{"text_format":"1","workbook":"xlsx","n_sheets":88,"sheets":["POSTS-MA","REV 12-15-20","SEQ-PSTAB","SEQ-4Temp","TOC","POSTS25","POSTS30","ESGNPOSTS","POSTSPACING","PICILINKS","SIGN CODES","ACTIVITIES","STD PLANS","C  S&I","C SIGN","C INSTALL","C SAL","REM C PANEL","C REM","D REM","D REM PANEL","D SIGN","D SIGN INSTALL","D SIGN S & I","D SAL","MASTARM","DEL & MARK","REF SIGN","SAL REF SIGN","REF SIGN S&I","OL","S&I SPEC","A REM FOOT","SIGN PANELS TYPE A EXTRUDED","AEXTRM","AEXTSA","APSTMOD","AREM","AS&IHP","ASAL"," A SIGN 14' PILE (prefered ver)","SIGN PANELS TYPE A","ASPNLIN","ASPNLOL","ASPNLSAL","ASPNLSAW","AFF","A REM PANEL","AKP","EA","EAOL","EAREM","EAEXTFI","PANEL OL, EXT PAN, PMP","EOREM","EO","EOOL","EO EXT PAN SECT","ESALINS","EO SAW","OH REM","OH SAL PN","OHREPOSPNL","OH STRUCT QUAN","S & I_OH B","OH OL","OH INSPN","SIGN PANELS TYPE OH","OH ID ","OH EXT REM","OH REMPAN","OH SAW","OH PMP","OH PMP MOD","BMST","SIGN PANELS TYPE OH (EXT PAN )","REMOVE EXT PANEL SECT","OH REM FOOT","OH SGN SUP CANT","OH SIGN SUP BRIDGE","OH REM WKWY","OH REM LT SYS","safety cable","REMOVE BRIDGE MTD OH LIGHT SYST","SEQ-4Copy","Conc Rail Calc"," D REM - REMOVE THIS TAB","Sheet1"],"not_rendered":{"charts":0,"images":16,"macros":1,"external_links":2,"defined_names":105,"comments":43,"pivot_tables":0},"unopened":[],"bounds":{"document_bytes":16777216,"sheet_cells":100000,"rows_first":2000,"rows_last":500,"rows_between":2000,"halvings":0,"cell_chars":16384,"cell_head_chars":4096},"cells_cut":0,"cells_raw":0,"read":"whole","date_system":"1900"}

{"sheet":"POSTS-MA","index":0,"n_rows":279,"n_cols":22,"rows_kept":279,"cut":false,"hidden":true,"merged":[[1,1,1,4],[3,1,3,2],[2,3,2,4]]}
[]
[null,"STRUCTURAL DETAILS FOR SIGNAL MAST ARM MOUNTED SIGNS"]
[null,"HEIGHT ","LENGTH","STIFFENER"]
[null,"INCH",null,"QTY","SPACING"]
[null,24,24,2,{"$f":"IF(D5=\"X\",\"X\",mastarmspace(C5,D5))","v":{"$error":"#NAME?"}},{"$f":"(C5-((D5-1)*E5))/2","v":{"$error":"#NAME?"}},null,null,null,2,{"$f":"J5+1","v":3},4,5,6,7,8,9,10,11,12,13,14]
[null,24,{"$f":"C5+6","v":30},2,{"$error":"#NAME?"},{"$error":"#NAME?"},null,null,2,{"$f":"mastarmposts($I6*12,J$5*12,MAH,MAW,MAQ)","v":{"$error":"#NAME?"}},{"$f":"mastarmposts($I6*12,K$5*12,MAH,MAW,MAQ)","v":{"$error":"#NAME?"}},{"$error":"#NAME?"},{"$error":"#NAME?"},{"$error":"#NAME?"},{"$error":"#NAME?"},{"$error":"#NAME?"},{"$error":"#NAME?"},{"$error":"#NAME?"},{"$error":"#NAME?"},{"$error":"#NAME?"},{"$error":"#NAME?"},{"$error":"#NAME?"}]
[null,24,36,2,{"$error":"#NAME?"},{"$error":"#NAME?"},null,null,3,{"$error":"#NAME?"},{"$error":"#NAME?"},{"$error":"#NAME?"},{"$error":"#NAME?"},{"$error":"#NAME?"},{"$error":"#NAME?"},{"$error":"#NAME?"},{"$error":"#NAME?"},{"$error":"#NAME?"},{"$error":"#NAME?"},{"$error":"#NAME?"},{"$error":"#NAME?"},{"$error":"#NAME?"}]
[null,24,42,2,{"$error":"#NAME?"},{"$error":"#NAME?"},null,null,4,{"$error":"#NAME?"},{"$error":"#NAME?"},{"$error":"#NAME?"},{"$error":"#NAME?"},{"$error":"#NAME?"},{"$error":"#NAME?"},{"$error":"#NAME?"},{"$error":"#NAME?"},{"$error":"#NAME?"},{"$error":"#NAME?"},{"$error":"#NAME?"},{"$error":"#NAME?"},{"$error":"#NAME?"}]
[null,24,48,2,{"$error":"#NAME?"},{"$error":"#NAME?"},null,null,5,{"$error":"#NAME?"},{"$error":"#NAME?"},{"$error":"#NAME?"},{"$error":"#NAME?"},{"$error":"#NAME?"},{"$error":"#NAME?"},{"$error":"#NAME?"},{"$error":"#NAME?"},{"$error":"#NAME?"},{"$error":"#NAME?"},{"$error":"#NAME?"},{"$error":"#NAME?"},{"$error":"#NAME?"}]
[null,24,54,3,{"$error":"#NAME?"},{"$error":"#NAME?"},null,null,6,{"$error":"#NAME?"},{"$error":"#NAME?"},{"$error":"#NAME?"},{"$error":"#NAME?"},{"$error":"#NAME?"},{"$error":"#NAME?"},{"$error":"#NAME?"},{"$error":"#NAME?"},{"$error":"#NAME?"},{"$error":"#NAME?"},{"$error":"#NAME?"},{"$error":"#NAME?"},{"$error":"#NAME?"}]
[null,24,60,3,{"$error":"#NAME?"},{"$error":"#NAME?"},null,null,7,{"$error":"#NAME?"},{"$error":"#NAME?"},{"$error":"#NAME?"},{"$error":"#NAME?"},{"$error":"#NAME?"},{"$error":"#NAME?"},{"$error":"#NAME?"},{"$error":"#NAME?"},{"$error":"#NAME?"},{"$error":"#NAME?"},{"$error":"#NAME?"},{"$error":"#NAME?"},{"$error":"#NAME?"}]
[null,24,66,3,{"$error":"#NAME?"},{"$error":"#NAME?"}]
[null,24,72,3,{"$error":"#NAME?"},{"$error":"#NAME?"},null,null,null,2,{"$f":"J13+1","v":3},4,5,6,7,8,9,10,11,12,13,14]
[null,24,78,3,{"$error":"#NAME?"},{"$error":"#NAME?"},null,null,2,{"$f":"mastarmposts($I14*12,J$5*12,MAH,MAW,MAS)","v":{"$error":"#NAME?"}},{"$error":"#NAME?"},{"$error":"#NAME?"},{"$error":"#NAME?"},{"$error":"#NAME?"},{"$error":"#NAME?"},{"$error":"#NAME?"},{"$error":"#NAME?"},{"$error":"#NAME?"},{"$error":"#NAME?"},{"$error":"#NAME?"},{"$error":"#NAME?"},{"$error":"#NAME?"}]
[null,24,84,3,{"$error":"#NAME?"},{"$error":"#NAME?"},null,null,3,{"$error":"#NAME?"},{"$error":"#NAME?"},{"$error":"#NAME?"},{"$error":"#NAME?"},{"$error":"#NAME?"},{"$error":"#NAME?"},{"$error":"#NAME?"},{"$error":"#NAME?"},{"$error":"#NAME?"},{"$error":"#NAME?"},{"$error":"#NAME?"},{"$error":"#NAME?"},{"$error":"#NAME?"}]
[null,24,90,4,{"$error":"#NAME?"},{"$error":"#NAME?"},null,null,4,{"$error":"#NAME?"},{"$error":"#NAME?"},{"$error":"#NAME?"},{"$error":"#NAME?"},{"$error":"#NAME?"},{"$error":"#NAME?"},{"$error":"#NAME?"},{"$error":"#NAME?"},{"$error":"#NAME?"},{"$error":"#NAME?"},{"$error":"#NAME?"},{"$error":"#NAME?"},{"$error":"#NAME?"}]
[null,24,96,4,{"$error":"#NAME?"},{"$error":"#NAME?"},null,null,5,{"$error":"#NAME?"},{"$error":"#NAME?"},{"$error":"#NAME?"},{"$error":"#NAME?"},{"$error":"#NAME?"},{"$error":"#NAME?"},{"$error":"#NAME?"},{"$error":"#NAME?"},{"$error":"#NAME?"},{"$error":"#NAME?"},{"$error":"#NAME?"},{"$error":"#NAME?"},{"$error":"#NAME?"}]
[null,24,102,4,{"$error":"#NAME?"},{"$error":"#NAME?"},null,null,6,{"$error":"#NAME?"},{"$error":"#NAME?"},{"$error":"#NAME?"},{"$error":"#NAME?"},{"$error":"#NAME?"},{"$error":"#NAME?"},{"$error":"#NAME?"},{"$error":"#NAME?"},{"$error":"#NAME?"},{"$error":"#NAME?"},{"$error":"#NAME?"},{"$error":"#NAME?"},{"$error":"#NAME?"}]
[null,24,108,4,{"$error":"#NAME?"},{"$error":"#NAME?"},null,null,7,{"$error":"#NAME?"},{"$error":"#NAME?"},{"$error":"#NAME?"},{"$error":"#NAME?"},{"$error":"#NAME?"},{"$error":"#NAME?"},{"$error":"#NAME?"},{"$error":"#NAME?"},{"$error":"#NAME?"},{"$error":"#NAME?"},{"$error":"#NAME?"},{"$error":"#NAME?"},{"$error":"#NAME?"}]
[null,24,114,4,{"$error":"#NAME?"},{"$error":"#NAME?"}]
[null,24,120,4,{"$error":"#NAME?"},{"$error":"#NAME?"}]
[null,24,126,5,{"$error":"#NAME?"},{"$error":"#NAME?"}]
[null,24,132,5,{"$error":"#NAME?"},{"$error":"#NAME?"}]
[null,24,138,5,{"$error":"#NAME?"},{"$error":"#NAME?"}]
[null,24,144,5,{"$error":"#NAME?"},{"$error":"#NAME?"}]
[null,24,150,5,{"$error":"#NAME?"},{"$error":"#NAME?"}]
[null,24,156,5,{"$error":"#NAME?"},{"$error":"#NAME?"}]
[null,24,162,5,{"$error":"#NAME?"},{"$error":"#NAME?"}]
[null,24,168,5,{"$error":"#NAME?"},{"$error":"#NAME?"}]
[null,30,24,2,{"$error":"#NAME?"},{"$error":"#NAME?"}]
[null,30,{"$f":"C30+6","v":30},2,{"$error":"#NAME?"},{"$error":"#NAME?"}]
[null,30,36,2,{"$error":"#NAME?"},{"$error":"#NAME?"}]
[null,30,42,2,{"$error":"#NAME?"},{"$error":"#NAME?"}]
[null,30,48,2,{"$error":"#NAME?"},{"$error":"#NAME?"}]
[null,30,54,3,{"$error":"#NAME?"},{"$error":"#NAME?"}]
[null,30,60,3,{"$error":"#NAME?"},{"$error":"#NAME?"}]
[null,30,66,3,{"$error":"#NAME?"},{"$error":"#NAME?"}]
[null,30,72,3,{"$error":"#NAME?"},{"$error":"#NAME?"}]
[null,30,78,3,{"$error":"#NAME?"},{"$error":"#NAME?"}]
[null,30,84,3,{"$error":"#NAME?"},{"$error":"#NAME?"}]
[null,30,90,4,{"$error":"#NAME?"},{"$error":"#NAME?"}]
[null,30,96,4,{"$error":"#NAME?"},{"$error":"#NAME?"}]
[null,30,102,4,{"$error":"#NAME?"},{"$error":"#NAME?"}]
[null,30,108,4,{"$error":"#NAME?"},{"$error":"#NAME?"}]
[null,30,114,5,{"$error":"#NAME?"},{"$error":"#NAME?"}]
[null,30,120,5,{"$error":"#NAME?"},{"$error":"#NAME?"}]
[null,30,126,5,{"$error":"#NAME?"},{"$error":"#NAME?"}]
[null,30,132,5,{"$error":"#NAME?"},{"$error":"#NAME?"}]
[null,30,138,5,{"$error":"#NAME?"},{"$error":"#NAME?"}]
[null,30,144,5,{"$error":"#NAME?"},{"$error":"#NAME?"}]
[null,30,150,5,{"$error":"#NAME?"},{"$error":"#NAME?"}]
[null,30,156,5,{"$error":"#NAME?"},{"$error":"#NAME?"}]
[null,30,162,5,{"$error":"#NAME?"},{"$error":"#NAME?"}]
[null,30,168,5,{"$error":"#NAME?"},{"$error":"#NAME?"}]
[null,36,24,2,{"$error":"#NAME?"},{"$error":"#NAME?"}]
[null,36,{"$f":"C55+6","v":30},2,{"$error":"#NAME?"},{"$error":"#NAME?"}]
[null,36,36,2,{"$error":"#NAME?"},{"$error":"#NAME?"}]
[null,36,42,2,{"$error":"#NAME?"},{"$error":"#NAME?"}]
[null,36,48,2,{"$error":"#NAME?"},{"$error":"#NAME?"}]
[null,36,54,3,{"$error":"#NAME?"},{"$error":"#NAME?"}]
[null,36,60,3,{"$error":"#NAME?"},{"$error":"#NAME?"}]
[null,36,66,3,{"$error":"#NAME?"},{"$error":"#NAME?"}]
[null,36,72,3,{"$error":"#NAME?"},{"$error":"#NAME?"}]
[null,36,78,3,{"$error":"#NAME?"},{"$error":"#NAME?"}]
[null,36,84,3,{"$error":"#NAME?"},{"$error":"#NAME?"}]
[null,36,90,4,{"$error":"#NAME?"},{"$error":"#NAME?"}]
[null,36,96,4,{"$error":"#NAME?"},{"$error":"#NAME?"}]
[null,36,102,4,{"$error":"#NAME?"},{"$error":"#NAME?"}]
[null,36,108,4,{"$f":"IF(D69=\"X\",\"X\",mastarmspace(C69,D69))","v":{"$error":"#NAME?"}},{"$f":"(C69-((D69-1)*E69))/2","v":{"$error":"#NAME?"}}]
[null,36,114,5,{"$error":"#NAME?"},{"$error":"#NAME?"}]
[null,36,120,5,{"$error":"#NAME?"},{"$error":"#NAME?"}]
[null,36,126,5,{"$error":"#NAME?"},{"$error":"#NAME?"}]
[null,36,132,5,{"$error":"#NAME?"},{"$error":"#NAME?"}]
[null,36,138,5,{"$error":"#NAME?"},{"$error":"#NAME?"}]
[null,36,144,5,{"$error":"#NAME?"},{"$error":"#NAME?"}]
[null,36,150,5,{"$error":"#NAME?"},{"$error":"#NAME?"}]
[null,36,156,5,{"$error":"#NAME?"},{"$error":"#NAME?"}]
[null,36,162,5,{"$error":"#NAME?"},{"$error":"#NAME?"}]
[null,36,168,5,{"$error":"#NAME?"},{"$error":"#NAME?"}]
[null,42,24,2,{"$error":"#NAME?"},{"$error":"#NAME?"}]
[null,42,{"$f":"C80+6","v":30},2,{"$error":"#NAME?"},{"$error":"#NAME?"}]
[null,42,36,2,{"$error":"#NAME?"},{"$error":"#NAME?"}]
[null,42,42,2,{"$error":"#NAME?"},{"$error":"#NAME?"}]
[null,42,48,2,{"$error":"#NAME?"},{"$error":"#NAME?"}]
[null,42,54,3,{"$error":"#NAME?"},{"$error":"#NAME?"}]
[null,42,60,3,{"$error":"#NAME?"},{"$error":"#NAME?"}]
[null,42,66,3,{"$error":"#NAME?"},{"$error":"#NAME?"}]
[null,42,72,3,{"$error":"#NAME?"},{"$error":"#NAME?"}]
[null,42,78,3,{"$error":"#NAME?"},{"$error":"#NAME?"}]
[null,42,84,3,{"$error":"#NAME?"},{"$error":"#NAME?"}]
[null,42,90,4,{"$error":"#NAME?"},{"$error":"#NAME?"}]
[null,42,96,4,{"$error":"#NAME?"},{"$error":"#NAME?"}]
[null,42,102,4,{"$error":"#NAME?"},{"$error":"#NAME?"}]
[null,42,108,4,{"$error":"#NAME?"},{"$error":"#NAME?"}]
[null,42,114,5,{"$error":"#NAME?"},{"$error":"#NAME?"}]
[null,42,120,5,{"$error":"#NAME?"},{"$error":"#NAME?"}]
[null,42,126,5,{"$error":"#NAME?"},{"$error":"#NAME?"}]
[null,42,132,5,{"$error":"#NAME?"},{"$error":"#NAME?"}]
[null,42,138,5,{"$error":"#NAME?"},{"$error":"#NAME?"}]
[null,42,144,5,{"$error":"#NAME?"},{"$error":"#NAME?"}]
[null,42,150,5,{"$error":"#NAME?"},{"$error":"#NAME?"}]
[null,42,156,5,{"$error":"#NAME?"},{"$error":"#NAME?"}]
[null,42,162,6,{"$error":"#NAME?"},{"$error":"#NAME?"}]
[null,42,168,6,{"$error":"#NAME?"},{"$error":"#NAME?"}]
[null,48,24,2,{"$error":"#NAME?"},{"$error":"#NAME?"}]
[null,48,{"$f":"C105+6","v":30},2,{"$error":"#NAME?"},{"$error":"#NAME?"}]
[null,48,36,2,{"$error":"#NAME?"},{"$error":"#NAME?"}]
[null,48,42,2,{"$error":"#NAME?"},{"$error":"#NAME?"}]
[null,48,48,2,{"$error":"#NAME?"},{"$error":"#NAME?"}]
[null,48,54,3,{"$error":"#NAME?"},{"$error":"#NAME?"}]
[null,48,60,3,{"$error":"#NAME?"},{"$error":"#NAME?"}]
[null,48,66,3,{"$error":"#NAME?"},{"$error":"#NAME?"}]
[null,48,72,3,{"$error":"#NAME?"},{"$error":"#NAME?"}]
[null,48,78,3,{"$error":"#NAME?"},{"$error":"#NAME?"}]
[null,48,84,3,{"$error":"#NAME?"},{"$error":"#NAME?"}]
[null,48,90,4,{"$error":"#NAME?"},{"$error":"#NAME?"}]
[null,48,96,4,{"$error":"#NAME?"},{"$error":"#NAME?"}]
[null,48,102,4,{"$error":"#NAME?"},{"$error":"#NAME?"}]
[null,48,108,4,{"$error":"#NAME?"},{"$error":"#NAME?"}]
[null,48,114,5,{"$error":"#NAME?"},{"$error":"#NAME?"}]
[null,48,120,5,{"$error":"#NAME?"},{"$error":"#NAME?"}]
[null,48,126,5,{"$error":"#NAME?"},{"$error":"#NAME?"}]
[null,48,132,5,{"$error":"#NAME?"},{"$error":"#NAME?"}]
[null,48,138,5,{"$error":"#NAME?"},{"$error":"#NAME?"}]
[null,48,144,5,{"$error":"#NAME?"},{"$error":"#NAME?"}]
[null,48,150,5,{"$error":"#NAME?"},{"$error":"#NAME?"}]
[null,48,156,5,{"$error":"#NAME?"},{"$error":"#NAME?"}]
[null,48,162,6,{"$error":"#NAME?"},{"$error":"#NAME?"}]
[null,48,168,6,{"$error":"#NAME?"},{"$error":"#NAME?"}]
[null,54,24,2,{"$error":"#NAME?"},{"$error":"#NAME?"}]
[null,54,{"$f":"C130+6","v":30},2,{"$error":"#NAME?"},{"$error":"#NAME?"}]
[null,54,36,2,{"$error":"#NAME?"},{"$error":"#NAME?"}]
[null,54,42,2,{"$f":"IF(D133=\"X\",\"X\",mastarmspace(C133,D133))","v":{"$error":"#NAME?"}},{"$f":"(C133-((D133-1)*E133))/2","v":{"$error":"#NAME?"}}]
[null,54,48,2,{"$error":"#NAME?"},{"$error":"#NAME?"}]
[null,54,54,3,{"$error":"#NAME?"},{"$error":"#NAME?"}]
[null,54,60,3,{"$error":"#NAME?"},{"$error":"#NAME?"}]
[null,54,66,4,{"$error":"#NAME?"},{"$error":"#NAME?"}]
[null,54,72,4,{"$error":"#NAME?"},{"$error":"#NAME?"}]
[null,54,78,4,{"$error":"#NAME?"},{"$error":"#NAME?"}]
[null,54,84,4,{"$error":"#NAME?"},{"$error":"#NAME?"}]
[null,54,90,5,{"$error":"#NAME?"},{"$error":"#NAME?"}]
[null,54,96,5,{"$error":"#NAME?"},{"$error":"#NAME?"}]
[null,54,102,5,{"$error":"#NAME?"},{"$error":"#NAME?"}]
[null,54,108,5,{"$error":"#NAME?"},{"$error":"#NAME?"}]
[null,54,114,5,{"$error":"#NAME?"},{"$error":"#NAME?"}]
[null,54,120,5,{"$error":"#NAME?"},{"$error":"#NAME?"}]
[null,54,126,5,{"$error":"#NAME?"},{"$error":"#NAME?"}]
[null,54,132,5,{"$error":"#NAME?"},{"$error":"#NAME?"}]
[null,54,138,5,{"$error":"#NAME?"},{"$error":"#NAME?"}]
[null,54,144,5,{"$error":"#NAME?"},{"$error":"#NAME?"}]
[null,54,150,5,{"$error":"#NAME?"},{"$error":"#NAME?"}]
[null,54,156,5,{"$error":"#NAME?"},{"$error":"#NAME?"}]
[null,54,162,6,{"$error":"#NAME?"},{"$error":"#NAME?"}]
[null,54,168,6,{"$error":"#NAME?"},{"$error":"#NAME?"}]
[null,60,24,2,{"$error":"#NAME?"},{"$error":"#NAME?"}]
[null,60,{"$f":"C155+6","v":30},2,{"$error":"#NAME?"},{"$error":"#NAME?"}]
[null,60,36,2,{"$error":"#NAME?"},{"$error":"#NAME?"}]
[null,60,42,2,{"$error":"#NAME?"},{"$error":"#NAME?"}]
[null,60,48,2,{"$error":"#NAME?"},{"$error":"#NAME?"}]
[null,60,54,3,{"$error":"#NAME?"},{"$error":"#NAME?"}]
[null,60,60,3,{"$error":"#NAME?"},{"$error":"#NAME?"}]
[null,60,66,4,{"$error":"#NAME?"},{"$error":"#NAME?"}]
[null,60,72,4,{"$error":"#NAME?"},{"$error":"#NAME?"}]
[null,60,78,4,{"$error":"#NAME?"},{"$error":"#NAME?"}]
[null,60,84,4,{"$error":"#NAME?"},{"$error":"#NAME?"}]
[null,60,90,5,{"$error":"#NAME?"},{"$error":"#NAME?"}]
[null,60,96,5,{"$error":"#NAME?"},{"$error":"#NAME?"}]
[null,60,102,5,{"$error":"#NAME?"},{"$error":"#NAME?"}]
[null,60,108,5,{"$error":"#NAME?"},{"$error":"#NAME?"}]
[null,60,114,5,{"$error":"#NAME?"},{"$error":"#NAME?"}]
[null,60,120,5,{"$error":"#NAME?"},{"$error":"#NAME?"}]
[null,60,126,5,{"$error":"#NAME?"},{"$error":"#NAME?"}]
[null,60,132,5,{"$error":"#NAME?"},{"$error":"#NAME?"}]
[null,60,138,5,{"$error":"#NAME?"},{"$error":"#NAME?"}]
[null,60,144,5,{"$error":"#NAME?"},{"$error":"#NAME?"}]
[null,60,150,5,{"$error":"#NAME?"},{"$error":"#NAME?"}]
[null,60,156,5,{"$error":"#NAME?"},{"$error":"#NAME?"}]
[null,60,162,6,{"$error":"#NAME?"},{"$error":"#NAME?"}]
[null,60,168,6,{"$error":"#NAME?"},{"$error":"#NAME?"}]
[null,66,24,"X","X",{"$error":"#VALUE!"}]
[null,66,{"$f":"C180+6","v":30},"X","X",{"$error":"#VALUE!"}]
[null,66,36,"X","X",{"$error":"#VALUE!"}]
[null,66,42,2,{"$error":"#NAME?"},{"$error":"#NAME?"}]
[null,66,48,2,{"$error":"#NAME?"},{"$error":"#NAME?"}]
[null,66,54,3,{"$error":"#NAME?"},{"$error":"#NAME?"}]
[null,66,60,3,{"$error":"#NAME?"},{"$error":"#NAME?"}]
[null,66,66,4,{"$error":"#NAME?"},{"$error":"#NAME?"}]
[null,66,72,4,{"$error":"#NAME?"},{"$error":"#NAME?"}]
[null,66,78,4,{"$error":"#NAME?"},{"$error":"#NAME?"}]
[null,66,84,4,{"$error":"#NAME?"},{"$error":"#NAME?"}]
[null,66,90,5,{"$error":"#NAME?"},{"$error":"#NAME?"}]
[null,66,96,5,{"$error":"#NAME?"},{"$error":"#NAME?"}]
[null,66,102,5,{"$error":"#NAME?"},{"$error":"#NAME?"}]
[null,66,108,5,{"$error":"#NAME?"},{"$error":"#NAME?"}]
[null,66,114,5,{"$error":"#NAME?"},{"$error":"#NAME?"}]
[null,66,120,5,{"$error":"#NAME?"},{"$error":"#NAME?"}]
[null,66,126,5,{"$f":"IF(D197=\"X\",\"X\",mastarmspace(C197,D197))","v":{"$error":"#NAME?"}},{"$f":"(C197-((D197-1)*E197))/2","v":{"$error":"#NAME?"}}]
[null,66,132,5,{"$error":"#NAME?"},{"$error":"#NAME?"}]
[null,66,138,5,{"$error":"#NAME?"},{"$error":"#NAME?"}]
[null,66,144,5,{"$error":"#NAME?"},{"$error":"#NAME?"}]
[null,66,150,5,{"$error":"#NAME?"},{"$error":"#NAME?"}]
[null,66,156,5,{"$error":"#NAME?"},{"$error":"#NAME?"}]
[null,66,162,6,{"$error":"#NAME?"},{"$error":"#NAME?"}]
[null,66,168,6,{"$error":"#NAME?"},{"$error":"#NAME?"}]
[null,72,24,"X","X",{"$error":"#VALUE!"}]
[null,72,{"$f":"C205+6","v":30},"X","X",{"$error":"#VALUE!"}]
[null,72,36,"X","X",{"$error":"#VALUE!"}]
[null,72,42,2,{"$error":"#NAME?"},{"$error":"#NAME?"}]
[null,72,48,2,{"$error":"#NAME?"},{"$error":"#NAME?"}]
[null,72,54,3,{"$error":"#NAME?"},{"$error":"#NAME?"}]
[null,72,60,3,{"$error":"#NAME?"},{"$error":"#NAME?"}]
[null,72,66,4,{"$error":"#NAME?"},{"$error":"#NAME?"}]
[null,72,72,4,{"$error":"#NAME?"},{"$error":"#NAME?"}]
[null,72,78,4,{"$error":"#NAME?"},{"$error":"#NAME?"}]
[null,72,84,4,{"$error":"#NAME?"},{"$error":"#NAME?"}]
[null,72,90,5,{"$error":"#NAME?"},{"$error":"#NAME?"}]
[null,72,96,5,{"$error":"#NAME?"},{"$error":"#NAME?"}]
[null,72,102,5,{"$error":"#NAME?"},{"$error":"#NAME?"}]
[null,72,108,5,{"$error":"#NAME?"},{"$error":"#NAME?"}]
[null,72,114,5,{"$error":"#NAME?"},{"$error":"#NAME?"}]
[null,72,120,5,{"$error":"#NAME?"},{"$error":"#NAME?"}]
[null,72,126,5,{"$error":"#NAME?"},{"$error":"#NAME?"}]
[null,72,132,5,{"$error":"#NAME?"},{"$error":"#NAME?"}]
[null,72,138,5,{"$error":"#NAME?"},{"$error":"#NAME?"}]
[null,72,144,5,{"$error":"#NAME?"},{"$error":"#NAME?"}]
[null,72,150,5,{"$error":"#NAME?"},{"$error":"#NAME?"}]
[null,72,156,5,{"$error":"#NAME?"},{"$error":"#NAME?"}]
[null,72,162,6,{"$error":"#NAME?"},{"$error":"#NAME?"}]
[null,72,168,6,{"$error":"#NAME?"},{"$error":"#NAME?"}]
[null,78,24,"X","X",{"$error":"#VALUE!"}]
[null,78,{"$f":"C230+6","v":30},"X","X",{"$error":"#VALUE!"}]
[null,78,36,"X","X",{"$error":"#VALUE!"}]
[null,78,42,"X","X",{"$error":"#VALUE!"}]
[null,78,48,"X","X",{"$error":"#VALUE!"}]
[null,78,54,4,{"$error":"#NAME?"},{"$error":"#NAME?"}]
[null,78,60,4,{"$error":"#NAME?"},{"$error":"#NAME?"}]
[null,78,66,4,{"$error":"#NAME?"},{"$error":"#NAME?"}]
[null,78,72,4,{"$error":"#NAME?"},{"$error":"#NAME?"}]
[null,78,78,4,{"$error":"#NAME?"},{"$error":"#NAME?"}]
[null,78,84,4,{"$error":"#NAME?"},{"$error":"#NAME?"}]
[null,78,90,4,{"$error":"#NAME?"},{"$error":"#NAME?"}]
[null,78,96,4,{"$error":"#NAME?"},{"$error":"#NAME?"}]
[null,78,102,5,{"$error":"#NAME?"},{"$error":"#NAME?"}]
[null,78,108,5,{"$error":"#NAME?"},{"$error":"#NAME?"}]
[null,78,114,5,{"$error":"#NAME?"},{"$error":"#NAME?"}]
[null,78,120,5,{"$error":"#NAME?"},{"$error":"#NAME?"}]
[null,78,126,5,{"$error":"#NAME?"},{"$error":"#NAME?"}]
[null,78,132,5,{"$error":"#NAME?"},{"$error":"#NAME?"}]
[null,78,138,5,{"$error":"#NAME?"},{"$error":"#NAME?"}]
[null,78,144,5,{"$error":"#NAME?"},{"$error":"#NAME?"}]
[null,78,150,5,{"$error":"#NAME?"},{"$error":"#NAME?"}]
[null,78,156,5,{"$error":"#NAME?"},{"$error":"#NAME?"}]
[null,78,162,6,{"$error":"#NAME?"},{"$error":"#NAME?"}]
[null,78,168,6,{"$error":"#NAME?"},{"$error":"#NAME?"}]
[null,84,24,"X","X",{"$error":"#VALUE!"}]
[null,84,{"$f":"C255+6","v":30},"X","X",{"$error":"#VALUE!"}]
[null,84,36,"X","X",{"$error":"#VALUE!"}]
[null,84,42,"X","X",{"$error":"#VALUE!"}]
[null,84,48,"X","X",{"$error":"#VALUE!"}]
[null,84,54,4,{"$error":"#NAME?"},{"$error":"#NAME?"}]
[null,84,60,4,{"$f":"IF(D261=\"X\",\"X\",mastarmspace(C261,D261))","v":{"$error":"#NAME?"}},{"$f":"(C261-((D261-1)*E261))/2","v":{"$error":"#NAME?"}}]
[null,84,66,4,{"$error":"#NAME?"},{"$error":"#NAME?"}]
[null,84,72,4,{"$error":"#NAME?"},{"$error":"#NAME?"}]
[null,84,78,5,{"$error":"#NAME?"},{"$error":"#NAME?"}]
[null,84,84,5,{"$error":"#NAME?"},{"$error":"#NAME?"}]
[null,84,90,5,{"$error":"#NAME?"},{"$error":"#NAME?"}]
[null,84,96,5,{"$error":"#NAME?"},{"$error":"#NAME?"}]
[null,84,102,5,{"$error":"#NAME?"},{"$error":"#NAME?"}]
[null,84,108,5,{"$error":"#NAME?"},{"$error":"#NAME?"}]
[null,84,114,5,{"$error":"#NAME?"},{"$error":"#NAME?"}]
[null,84,120,5,{"$error":"#NAME?"},{"$error":"#NAME?"}]
[null,84,126,5,{"$error":"#NAME?"},{"$error":"#NAME?"}]
[null,84,132,5,{"$error":"#NAME?"},{"$error":"#NAME?"}]
[null,84,138,5,{"$error":"#NAME?"},{"$error":"#NAME?"}]
[null,84,144,5,{"$error":"#NAME?"},{"$error":"#NAME?"}]
[null,84,150,5,{"$error":"#NAME?"},{"$error":"#NAME?"}]
[null,84,156,5,{"$error":"#NAME?"},{"$error":"#NAME?"}]
[null,84,162,6,{"$error":"#NAME?"},{"$error":"#NAME?"}]
[null,84,168,6,{"$error":"#NAME?"},{"$error":"#NAME?"}]

{"sheet":"REV 12-15-20","index":1,"n_rows":4,"n_cols":3,"rows_kept":4,"cut":false,"hidden":false,"merged":[]}
[]
[]
[]
[null,null,"REVISED 12-15-2020"]

{"sheet":"SEQ-PSTAB","index":2,"n_rows":174,"n_cols":12,"rows_kept":174,"cut":false,"hidden":false,"merged":[[34,3,34,4],[81,3,81,4],[82,3,82,4],[10,3,10,4],[11,3,11,4],[4,1,4,8],[0,1,0,2],[1,1,1,2],[2,1,2,2],[43,3,43,4],[53,3,53,4],[54,3,54,4],[55,3,55,4],[27,3,27,4],[28,3,28,4],[29,3,29,4],[30,3,30,4],[31,3,31,4],[22,3,22,4],[23,3,23,4],[24,3,24,4],[25,3,25,4],[26,3,26,4],[17,3,17,4],[0,9,0,13],[1,9,1,13],[2,9,2,13],[4,9,4,10],[32,3,32,4],[33,3,33,4],[140,3,140,4],[138,3,138,4],[136,3,136,4],[74,3,74,4],[75,3,75,4],[76,3,76,4],[59,3,59,4],[60,3,60,4],[61,3,61,4],[62,3,62,4],[63,3,63,4],[84,3,84,4],[69,3,69,4],[48,3,48,4],[49,3,49,4],[50,3,50,4],[51,3,51,4],[52,3,52,4],[18,3,18,4],[19,3,19,4],[20,3,20,4],[21,3,21,4],[13,3,13,4],[12,3,12,4],[14,3,14,4],[15,3,15,4],[16,3,16,4],[6,9,6,10],[7,9,7,10],[5,2,7,2],[5,9,5,10],[5,3,5,4],[6,3,6,4],[7,3,7,4],[8,3,8,4],[9,3,9,4],[64,3,64,4],[65,3,65,4],[66,3,66,4],[67,3,67,4],[68,3,68,4],[80,3,80,4],[72,3,72,4],[39,3,39,4],[173,1,173,10],[167,1,167,10],[57,3,57,4],[56,3,56,4],[73,3,73,4],[172,1,172,10],[152,3,152,4],[151,3,151,4],[150,3,150,4],[149,3,149,4],[148,3,148,4],[70,3,70,4],[71,3,71,4],[77,3,77,4],[78,3,78,4],[79,3,79,4],[35,3,35,4],[36,3,36,4],[37,3,37,4],[38,3,38,4],[40,3,40,4],[41,3,41,4],[42,3,42,4],[44,3,44,4],[58,3,58,4],[45,3,45,4],[46,3,46,4],[47,3,47,4],[99,3,99,4],[90,3,90,4],[83,3,83,4],[91,3,91,4],[92,3,92,4],[93,3,93,4],[94,3,94,4],[105,3,105,4],[106,3,106,4],[88,3,88,4],[89,3,89,4],[87,3,87,4],[85,3,85,4],[86,3,86,4],[95,3,95,4],[96,3,96,4],[97,3,97,4],[98,3,98,4],[107,3,107,4],[108,3,108,4],[109,3,109,4],[100,3,100,4],[101,3,101,4],[102,3,102,4],[103,3,103,4],[104,3,104,4],[115,3,115,4],[116,3,116,4],[117,3,117,4],[118,3,118,4],[119,3,119,4],[110,3,110,4],[111,3,111,4],[112,3,112,4],[113,3,113,4],[114,3,114,4],[120,3,120,4],[121,3,121,4],[122,3,122,4],[123,3,123,4],[124,3,124,4],[134,3,134,4],[135,3,135,4],[137,3,137,4],[139,3,139,4],[130,3,130,4],[131,3,131,4],[132,3,132,4],[133,3,133,4],[145,3,145,4],[125,3,125,4],[126,3,126,4],[127,3,127,4],[128,3,128,4],[162,3,162,4],[163,3,163,4],[164,3,164,4],[159,3,159,4],[160,3,160,4],[161,3,161,4],[146,3,146,4],[147,3,147,4],[156,3,156,4],[157,3,157,4],[158,3,158,4],[129,3,129,4],[141,3,141,4],[142,3,142,4],[143,3,143,4],[144,3,144,4],[155,3,155,4],[154,3,154,4],[153,3,153,4]]}
[null,{"$f":"IF(F1=\"X\",\"Choose one---\",\"\")","v":""},null,null,{"$f":"IF(F1=\"X\",\"------->\",\"\")","v":""},null,"STATEMENT OF ESTIMATED QUANTITIES",null,"<-------","Use this chart title if you are preparing a complete state project plan set."]
[null,{"$f":"IF(F2=\"X\",\"Choose one---\",\"\")","v":"Choose one---"},null,null,{"$f":"IF(F2=\"X\",\"------->\",\"\")","v":"------->"},"x","PERMANENT SIGNING TABULATION",null,"<-------","Use this chart title if your plan sheet set is part of a larger state project."]
[null,{"$f":"IF(F3=\"X\",\"Choose one---\",\"\")","v":""},null,null,{"$f":"IF(F3=\"X\",\"------->\",\"\")","v":""},null,"Custom Title - Type Here",null,"<-------","Use this chart title if your plan sheet set is part of a larger state project."]
[]
[null,{"$f":"IF(F1<>\"\",G1,IF(F2<>\"\",G2,G3))","v":"PERMANENT SIGNING TABULATION"},null,null,null,null,null,null,null,"X",null,"Include"]
[null,null,"SHEET\nNO",null,null,null,null,null,null,"TOTAL",null,"x"]
[null,"TAB",null,"ITEM NO",null,null,"ITEM",null,"UNIT",{"$f":"IF(F1<>\"\",\"ESTIMATED\",IF(F2<>\"\",\"SIGNING\",\"SIGNING\"))","v":"SIGNING"},null,"x"]
[null,null,null,null,null,null,null,null,null,"QUANTITIES",null,"x"]
[null,"AA",null,2011.6010000000001,null,null,"AS BUILT",null,"LUMP SUM",0,null,"SIGNING"]
[null,null,null,2021.501,null,null,"MOBILIZATION",null,"LUMP SUM",null,null,"SIGNING"]
[null,null,null,2104.502,null,null,"REMOVE DELINEATOR / MARKER SIGN",null,"EACH",null,null,"SIGNING"]
[null,null,null,2104.502,null,null,"REMOVE DELINEATOR / MARKER PANEL",null,"EACH",null,null,"SIGNING"]
[null,null,null,2104.502,null,null,"REMOVE REFERENCE LOCATION SIGN",null,"EACH",null,null,"SIGNING"]
[null,null,null,2104.502,null,null,"REMOVE SIGN",null,"EACH",null,null,"SIGNING"]
[null,null,null,2104.502,null,null,"REMOVE SIGN TYPE A",null,"EACH",{"$f":"AREM!C2","v":0},null,"SIGNING"]
[null,null,null,2104.502,null,null,"REMOVE SIGN TYPE C",null,"EACH",17,null,"SIGNING"]
[null,null,null,2104.502,null,null,"REMOVE SIGN TYPE D",null,"EACH",{"$f":"' D REM - REMOVE THIS TAB'!C15","v":3},null,"SIGNING"]
[null,null,null,2104.502,null,null,"REMOVE SIGN TYPE EA",null,"EACH",{"$f":"EAREM!C14","v":0},null,"SIGNING"]
[null,null,null,2104.502,null,null,"REMOVE SIGN TYPE EO",null,"EACH",{"$f":"EOREM!C14","v":0},null,"SIGNING"]
[null,null,null,2104.502,null,null,"REMOVE SIGN TYPE OH (BRIDGE MOUNTED)",null,"EACH",{"$f":"'OH REM'!F15","v":0},null,"SIGNING"]
[null,null,null,2104.502,null,null,"REMOVE SIGN TYPE OH",null,"EACH",{"$f":"'OH REM'!F14","v":1},null,"SIGNING"]
[null,null,null,2104.502,null,null,"REMOVE SIGN TYPE SPECIAL",null,"EACH",0,null,"SIGNING"]
[null,null,null,2104.502,null,null,"REMOVE SIGN PANEL OVERLAY TYPE A",null,"EACH",0,null,"SIGNING"]
[null,null,null,2104.502,null,null,"REMOVE SIGN PANEL OVERLAY TYPE EA",null,"EACH",{"$f":"EAOL!K15","v":0},null,"SIGNING"]
[null,null,null,2104.502,null,null,"REMOVE SIGN PANEL OVERLAY TYPE EO",null,"EACH",{"$f":"EOOL!K15","v":0},null,"SIGNING"]
[null,null,null,2104.502,null,null,"REMOVE SIGN PANEL OVERLAY TYPE OH",null,"EACH",0,null,"SIGNING"]
[null,null,null,2104.502,null,null,"REMOVE SIGN LIGHTING SYSTEM",null,"EACH",{"$f":"'OH REM LT SYS'!C15","v":1},null,"SIGNING"]
[null,null,null,2104.502,null,null,"REMOVE SIGN PANEL TYPE A",null,"EACH",0,null,"SIGNING"]
[null,null,null,2104.502,null,null,"REMOVE SIGN PANEL TYPE C",null,"EACH",0,null,"SIGNING"]
[null,null,null,2104.502,null,null,"REMOVE SIGN PANEL TYPE D",null,"EACH",{"$f":"'D REM PANEL'!C15","v":3},null,"SIGNING"]
[null,null,null,2104.502,null,null,"REMOVE SIGN PANEL TYPE OH",null,"EACH",{"$f":"'OH REMPAN'!G14","v":4},null,"SIGNING"]
[null,null,null,2104.502,null,null,"REMOVE SIGN FOOTING - TYPE A",null,"EACH",{"$f":"'A REM FOOT'!C19","v":2},null,"SIGNING"]
[null,null,null,2104.502,null,null,"REMOVE SIGN FOOTING - TYPE OH",null,"EACH",{"$f":"'OH REM FOOT'!C15","v":1},null,"SIGNING"]
[null,null,null,2104.502,null,null,"SALVAGE DELINEATOR",null,"EACH",{"$f":"#REF!","v":{"$error":"#REF!"}},null,"SIGNING"]
[null,null,null,2104.502,null,null,"SALVAGE MARKER",null,"EACH",{"$f":"#REF!","v":{"$error":"#REF!"}},null,"SIGNING"]
[null,null,null,2104.502,null,null,"SALVAGE REFERENCE LOCATION SIGN",null,"EACH",{"$f":"'SAL REF SIGN'!#REF!","v":{"$error":"#REF!"}},null,"SIGNING"]
[null,null,null,2104.502,null,null,"SALVAGE SIGN PANEL TYPE A",null,"EACH",0,null,"SIGNING"]
[null,null,null,2104.502,null,null,"SALVAGE SIGN PANEL TYPE C",null,"EACH",0,null,"SIGNING"]
[null,null,null,2104.502,null,null,"SALVAGE SIGN PANEL TYPE D",null,"EACH",0,null,"SIGNING"]
[null,null,null,2104.502,null,null,"SALVAGE SIGN PANEL TYPE SPECIAL",null,"EACH",0,null,"SIGNING"]
[null,null,null,2104.502,null,null,"SALVAGE SIGN PANEL TYPE EA",null,"EACH",0,null,"SIGNING"]
[null,null,null,2104.502,null,null,"SALVAGE SIGN PANEL TYPE EO",null,"EACH",{"$f":"ESALINS!C38","v":0},null,"SIGNING"]
[null,null,null,2104.502,null,null,"SALVAGE SIGN PANEL TYPE OH",null,"EACH",0,null,"SIGNING"]
[null,null,null,2104.502,null," ","SALVAGE SIGN",null,"EACH",{"$f":"'OH REM WKWY'!D8","v":0},null,"SIGNING"]
[null,null,null,2104.502,null,null,"SALVAGE SIGN TYPE A",null,"EACH",0,null,"SIGNING"]
[null,null,null,2104.502,null,null,"SALVAGE SIGN TYPE C",null,"EACH",{"$f":"#REF!+#REF!","v":{"$error":"#REF!"}},null,"SIGNING"]
[null,null,null,2104.502,null,null,"SALVAGE SIGN TYPE D",null,"EACH",{"$f":"#REF!","v":{"$error":"#REF!"}},null,"SIGNING"]
[null,null,null,2104.502,null,null,"SALVAGE SIGN TYPE EA",null,"EACH",0,null,"SIGNING"]
[null,null,null,2104.502,null,null,"SALVAGE SIGN TYPE EO",null,"EACH",{"$f":"ESALINS!C38","v":0},null,"SIGNING"]
[null,null,null,2104.502,null,null,"SALVAGE SIGN TYPE OH",null,"EACH",0,null,"SIGNING"]
[null,null,null,2104.502,null,null,"SALVAGE SIGN TYPE OH (BR MOUNTED)",null,"EACH",0,null,"SIGNING"]
[null,null,null,2104.502,null,null,"SALVAGE SIGN TYPE SPECIAL",null,"EACH",0,null,"SIGNING"]
[null,null,null,2104.502,null,null,"SALVAGE SIGN SUPPORT OH",null,"EACH",0,null,"SIGNING"]
[null,null,null,2104.5030000000002,null,null,"REMOVE SIGN WALKWAY",null,"LIN FT",{"$f":"'OH REM WKWY'!D7","v":0},null,"SIGNING"]
[null,null,null,2545.5160000000001,null,null,"SIGN LIGHTING SYSTEM",null,"SYSTEM",{"$f":"'OH REM WKWY'!D9","v":0},null,"SIGNING"]
[null,null,null,2545.5160000000001,null,null,"SIGN LIGHTING SYSTEM BRIDGE MOUNTED",null,"SYSTEM",{"$f":"'OH REM WKWY'!D10","v":0},null,"SIGNING"]
[null,null,null,2545.616,null,null,"MODIFY SIGN LIGHTING SYSTEM",null,"SYSTEM",{"$f":"'OH REM WKWY'!D10","v":0},null,"SIGNING"]
[null,null,null,2563.6010000000001,null,null,"TRAFFIC CONTROL",null,"LUMP SUM",{"$f":"'OH REM WKWY'!D11","v":0},null,"SIGNING"]
[null,null,null,2564.502,null,null,"MEDIAN BARRIER FOOTING",null,"EACH",0,null,"SIGNING"]
[null,null,null,2564.502,null,null,"SIGN SUPPORT SIGN BRIDGE",null,"EACH",{"$f":"'OH SIGN SUP BRIDGE'!C18","v":1},null,"SIGNING"]
[null,"AA",null,2564.502,null,null,"SIGN SUPPORT CANTILEVER",null,"EACH",{"$f":"'OH SGN SUP CANT'!B14","v":1},null,"SIGNING"]
[null,"BB",null,2564.502,null,null,"MODIFY POST",null,"EACH",0,null,"SIGNING"]
[null,null,null,2564.502,null,null,"INSTALL DELINEATOR",null,"EACH",{"$f":"#REF!","v":{"$error":"#REF!"}},null,"SIGNING"]
[null,null,null,2564.502,null,null,"INSTALL MARKER",null,"EACH",{"$f":"#REF!","v":{"$error":"#REF!"}},null,"SIGNING"]
[null,null,null,2564.502,null,null,"INSTALL REFERENCE LOCATION SIGN",null,"EACH",0,null,"SIGNING"]
[null,null,null,2564.502,null,null,"INSTALL SIGN PANEL",null,"EACH",0,null,"SIGNING"]
[null,null,null,2564.502,null,null,"INSTALL SIGN PANEL TYPE A",null,"EACH",{"$f":"ASPNLIN!C12","v":0},null,"SIGNING"]
[null,null,null,2564.502,null,null,"INSTALL SIGN PANEL TYPE C",null,"EACH",{"$f":"#REF!","v":{"$error":"#REF!"}},null,"SIGNING"]
[null,null,null,2564.502,null,null,"INSTALL SIGN PANEL TYPE D",null,"EACH",0,null,"SIGNING"]
[null,null,null,2564.502,null,null,"INSTALL SIGN PANEL TYPE EO",null,"EACH",{"$f":"ESALINS!C38","v":0},null,"SIGNING"]
[null,null,null,2564.502,null,null,"INSTALL SIGN PANEL TYPE OH",null,"EACH",0,null,"SIGNING"]
[null,null,null,2564.502,null,null,"INSTALL SIGN PANEL TYPE SPECIAL",null,"EACH",0,null,"SIGNING"]
[null,null,null,2564.502,null,null,"INSTALL SIGN PANEL TYPE OVERLAY",null,"EACH",0,null,"SIGNING"]
[null,null,null,2564.502,null,null,"INSTALL SIGN TYPE A",null,"EACH",0,null,"SIGNING"]
[null,null,null,2564.502,null,null,"INSTALL SIGN TYPE C",null,"EACH",{"$f":"#REF!","v":{"$error":"#REF!"}},null,"SIGNING"]
[null,null,null,2564.502,null,null,"INSTALL SIGN TYPE D",null,"EACH",{"$f":"#REF!+#REF!","v":{"$error":"#REF!"}},null,"SIGNING"]
[null,null,null,2564.502,null,null,"INSTALL SIGN TYPE EA",null,"EACH",0,null,"SIGNING"]
[null,null,null,2564.502,null,null,"INSTALL SIGN TYPE EO",null,"EACH",{"$f":"ESALINS!C38","v":0},null,"SIGNING"]
[null,null,null,2564.502,null,null,"INSTALL SIGN TYPE OH",null,"EACH",0,null,"SIGNING"]
[null,null,null,2564.502,null,null,"INSTALL SIGN TYPE OH (BR MOUNT)",null,"EACH",0,null,"SIGNING"]
[null,null,null,2564.502,null,null,"LIGHTING SYSTEM IDENTIFICATION PLATE",null,"EACH",null,null,"SIGNING"]
[null,null,null,2564.502,null,null,"EXTEND WALKWAY SUPPORT",null,"EACH",0,null,"SIGNING"]
[null,null,null,2564.502,null,null,"FRICTION FUSE",null,"EACH",0,null,"SIGNING"]
[null,null,null,2564.502,null,null,"KEEPER PLATE",null,"EACH",0,null,"SIGNING"]
[null,null,null,2564.502,null,null,"DELINEATOR",null,"EACH",0,null,"SIGNING"]
[null,null,null,2564.502,null,null,"DELINEATOR TYPE RECOVERABLE",null,"EACH",null,null,"SIGNING"]
[null,null,null,2564.502,null,null,"DELINEATOR TYPE SPECIAL",null,"EACH",0,null,"SIGNING"]
[null,null,null,2564.502,null,null,"REFERENCE LOCATION SIGN",null,"EACH",{"$f":"'REF SIGN'!C947","v":0},null,"SIGNING"]
[null,null,null,2564.5030000000002,null,null,"SAW SIGN PANELS",null,"LIN FT",0,null,"SIGNING"]
[null,null,null,2564.5030000000002,null,null,"SAW SIGN PANELS TYPE A",null,"LIN FT",0,null,"SIGNING"]
[null,null,null,2564.5030000000002,null,null,"SAW SIGN PANELS TYPE EA",null,"LIN FT",0,null,"SIGNING"]
[null,null,null,2564.5030000000002,null,null,"SAW SIGN PANELS TYPE EO",null,"LIN FT",0,null,"SIGNING"]
[null,null,null,2564.5030000000002,null,null,"SAW SIGN PANELS TYPE OH",null,"LIN FT",0,null,"SIGNING"]
[null,null,null,2564.5070000000001,null,null,"CONCRETE FOOTINGS",null,"CU YD",0,null,"SIGNING"]
[null,null,null,2564.5070000000001,null,null,"CONCRETE FOOTINGS (TYPE A SIGNS)",null,"CU YD",0,null,"SIGNING"]
[null,null,null,2564.5070000000001,null,null,"CONCRETE FOOTINGS (TYPE OH SHAFT)",null,"CU YD",{"$f":"#REF!","v":{"$error":"#REF!"}},null,"SIGNING"]
[null,null,null,2564.5070000000001,null,null,"CONCRETE FOOTINGS (TYPE OH SPREAD)",null,"CU YD",{"$f":"#REF!","v":{"$error":"#REF!"}},null,"SIGNING"]
[null,"BB",null,2564.5070000000001,null,null,"CONCRETE FOOTINGS (DESIGN SPECIAL)",null,"CU YD",0,null,"SIGNING"]
[null,"CC",null,2564.5079999999998,null,null,"STRUCTURAL STEEL",null,"POUND",0,null,"SIGNING"]
[null,null,null,2564.5079999999998,null,null,"STRUCT STEEL-POSTS FOR TYPE A SIGNS","(P)","POUND",0,null,"SIGNING"]
[null,null,null,2564.5079999999998,null,null,"STRUCT STEEL-POSTS FOR OH SIGNS (A)","(P)","POUND",0,null,"SIGNING"]
[null,null,null,2564.5079999999998,null,null,"STRUCT STEEL-POSTS FOR OH SIGNS (B)","(P)","POUND",{"$f":"#REF!","v":{"$error":"#REF!"}},null,"SIGNING"]
[null,null,null,2564.5079999999998,null,null,"STRUCT STEEL-POSTS FOR OH SIGNS (C)","(P)","POUND",null,null,"SIGNING"]
[null,null,null,2564.5079999999998,null,null,"STRUCTURAL STEEL-POSTS FOR OH SIGNS (D)","(P)","POUND",null,null,"SIGNING"]
[null,null,null,2564.5079999999998,null,null,"STRUCT STEEL-TRUSSES FOR OH SIGNS (A)","(P)","POUND",0,null,"SIGNING"]
[null,null,null,2564.5079999999998,null,null,"STRUCT STEEL-TRUSSES FOR OH SIGNS (B)","(P)","POUND",{"$f":"#REF!","v":{"$error":"#REF!"}},null,"SIGNING"]
[null,null,null,2564.5079999999998,null,null,"STRUCT STEEL-TRUSSES FOR OH SIGNS (C)","(P)","POUND",{"$f":"#REF!","v":{"$error":"#REF!"}},null,"SIGNING"]
[null,null,null,2564.5079999999998,null,null,"STRUCTURAL STEEL-TRUSSES FOR OH SIGNS (D)","(P)","POUND",{"$f":"#REF!","v":{"$error":"#REF!"}},null,"SIGNING"]
[null,null,null,2564.5079999999998,null,null,"STR STEEL-TRUSSES FOR OH SIGNS BR MTD","(P)","POUND",{"$f":"BMST!D9","v":0},null,"SIGNING"]
[null,null,null,2564.5079999999998,null,null,"STR STEEL-WLKWY SPRT FOR OH SIGNS (B)","(P)","POUND",0,null,"SIGNING"]
[null,null,null,2564.5079999999998,null,null,"STRUCTURAL STEEL-WALKWAY SUPPORT FOR OH SIGNS (D)","(P)","POUND",0,null,"SIGNING"]
[null,null,null,2564.5079999999998,null,null,"STR STEEL-WLKWY GRTNG FOR OH SIGNS (B)","(P)","POUND",0,null,"SIGNING"]
[null,null,null,2564.5079999999998,null,null,"STR STEEL-WLKWY GRTNG FOR OH SIGNS (C)","(P)","POUND",0,null,"SIGNING"]
[null,null,null,2564.5079999999998,null,null,"STRUCTURAL STEEL-WALKWAY GRATING FOR OH SIGNS (D)","(P)","POUND",0,null,"SIGNING"]
[null,null,null,2564.5079999999998,null,null,"STR STEEL-WLKWY GRTNG FOR OH SIGNS (SPEC)","(P)","POUND",0,null,"SIGNING"]
[null,null,null,2564.5079999999998,null,null,"STR STEEL-PANEL MT PST FOR OH SIGNS (A)","(P)","POUND",null,null,"SIGNING"]
[null,null,null,2564.5079999999998,null,null,"STR STEEL-PANEL MT PST FOR OH SIGNS (B)","(P)","POUND",{"$f":"#REF!","v":{"$error":"#REF!"}},null,"SIGNING"]
[null,null,null,2564.5079999999998,null,null,"STR STEEL-PANEL MT PST FOR OH SIGNS (C)","(P)","POUND",{"$f":"#REF!","v":{"$error":"#REF!"}},null,"SIGNING"]
[null,null,null,2564.5079999999998,null,null,"STRUCTURAL STEEL-PANEL MOUNT PST FOR OH SIGNS (D)","(P)","POUND",{"$f":"#REF!","v":{"$error":"#REF!"}},null,"SIGNING"]
[null,null,null,2564.518,null,null,"OVERHEAD SIGN STRUCTURE REPAIR",null,"HOUR",0,null,"SIGNING"]
[null,null,null,2564.518,null,null,"SIGN PANELS TYPE A","(P)","SQ FT",{"$f":"'SIGN PANELS TYPE A EXTRUDED'!G16+'SIGN PANELS TYPE A'!H18","v":0},null,"SIGNING"]
[null,null,null,2564.518,null,null,"SIGN PANELS TYPE C",null,"SQ FT",{"$f":"ROUNDUP(#REF!,0)","v":{"$error":"#REF!"}},null,"SIGNING"]
[null,null,null,2564.518,null,null,"SIGN PANELS TYPE D",null,"SQ FT",{"$f":"ROUNDUP(#REF!,0)","v":{"$error":"#REF!"}},null,"SIGNING"]
[null,null,null,2564.518,null,null,"SIGN PANELS TYPE EA","(P)","SQ FT",{"$f":"EA!J975+EAEXTFI!K9","v":0},null,"SIGNING"]
[null,null,null,2564.518,null,null,"SIGN PANELS TYPE EO","(P)","SQ FT",{"$f":"EO!J15+'EO EXT PAN SECT'!I20","v":0},null,"SIGNING"]
[null,null,null,2564.518,null,null,"SIGN PANELS TYPE OH","(P)","SQ FT",{"$f":"'SIGN PANELS TYPE OH'!P17+'SIGN PANELS TYPE OH (EXT PAN )'!G8","v":0},null,"SIGNING"]
[null,null,null,2564.518,null,null,"SIGN PANELS TYPE OVERLAY",null,"SQ FT",{"$f":"ROUNDUP(OL!I963,0)","v":0},null,"SIGNING"]
[null,null,null,2564.518,null,null,"SIGN PANELS TYPE SPECIAL",null,"SQ FT",0,null,"SIGNING"]
[null,null,null,2564.518,null,null,"SIGN PANEL OVERLAY TYPE A","(P)","SQ FT",0,null,"SIGNING"]
[null,null,null,2564.518,null,null,"SIGN PANEL OVERLAY TYPE EA","(P)","SQ FT",0,null,"SIGNING"]
[null,null,null,2564.518,null,null,"SIGN PANEL OVERLAY TYPE EO","(P)","SQ FT",0,null,"SIGNING"]
[null,null,null,2564.518,null,null,"SIGN PANEL OVERLAY TYPE OH","(P)","SQ FT",{"$f":"'OH OL'!P17","v":0},null,"SIGNING"]
[null,null,null,2564.518,null,null,"FURNISH SIGN PANELS TYPE C",null,"SQ FT",0,null,"SIGNING"]
[null,null,null,2564.518,null,null,"FURNISH SIGN PANELS TYPE D",null,"SQ FT",0,null,"SIGNING"]
[null,null,null,2564.518,null,null,"FURNISH SIGN PANELS TYPE OH",null,"SQ FT",0,null,"SIGNING"]
[null,null,null,2564.518,null,null,"FURNISH SIGN PANELS TYPE OVERLAY",null,"SQ FT",0,null,"SIGNING"]
[null,null,null,2013.6030000000001,null,null,"SAFETY CABLE",null,"LIN FT",{"$f":"'safety cable'!E15","v":96},null,"SIGNING"]
[null,null,null,2104.6010000000001,null,null,"SALVAGE LIGHTING SYSTEM",null,"LUMP SUM",0,null,"SIGNING"]
[null,null,null,2564.6019999999999,null,null,"INSTALL SIGN COLLAR",null,"EACH",0,null,"SIGNING"]
[null,null,null,2564.6019999999999,null,null,"SIGN COLLAR",null,"EACH",0,null,"SIGNING"]
[null,null,null,2564.6019999999999,null,null,"CONC PEDESTAL EXTENSION DES SPEC",null,"EACH",0,null,"SIGNING"]
[null,null,null,2564.6019999999999,null,null,"INSTALL SIGN",null,"EACH",0,null,"SIGNING"]
[null,null,null,2564.6019999999999,null,null,"INSTALL STEEL POST",null,"EACH",0,null,"SIGNING"]
[null,null,null,2564.6019999999999,null,null,"FOUNDATION SPECIAL OH",null,"EACH",0,null,"SIGNING"]
[null,null,null,2564.6019999999999,null,null,"MEDIAN SIGN POST ANCHOR",null,"EACH",0,null,"SIGNING"]
[null,null,null,2564.6019999999999,null,null,"REPAIR SIGN TYPE OH",null,"EACH",0,null,"SIGNING"]
[null,null,null,2564.6019999999999,null,null,"FURNISH & INSTALL TRAFFIC WARNING SIGN",null,"EACH",0,null,"SIGNING"]
[null,null,null,2564.6019999999999,null,null,"INSTALL SIGN SUPPORT",null,"EACH",0,null,"SIGNING"]
[null,null,null,2564.6019999999999,null,null,"REPOSITION SIGN PANEL TYPE OH",null,"EACH",{"$f":"OHREPOSPNL!P11","v":4},null,"SIGNING"]
[null,"CC",null,2564.6019999999999,null,null,"REPOSITION SIGN PANEL",null,"EACH",0,null,"SIGNING"]
[null,"DD",null,2564.6019999999999,null,null,"HIGHWAY ADVISORY RADIO SIGN",null,"EACH",0,null,"SIGNING"]
[null,null,null,2564.6019999999999,null,null,"MODIFY SIGN TYPE OH (BR MTD)",null,"EACH",0,null,"SIGNING"]
[null,null,null,2564.6019999999999,null,null,"MODIFY SIGN TYPE OH",null,"EACH",0,null,"SIGNING"]
[null,null,null,2564.6019999999999,null,null,"INSTALL SIGN TRUSS",null,"EACH",0,null,"SIGNING"]
[null,null,null,2564.6019999999999,null,null,"RELOCATE SIGN",null,"EACH",0,null,"SIGNING"]
[null,null,null,2564.6019999999999,null,null,"INSTALL SIGN TYPE SPECIAL",null,"EACH",0,null,"SIGNING"]
[null,null,null,2564.6019999999999,null,null,"CONCRETE FOOTINGS DESIGN SPECIAL",null,"EACH",0,null,"SIGNING"]
[null,null,null,2564.6019999999999,null,null,"INTERNALLY ILLUMINATED SIGN",null,"EACH",0,null,"SIGNING"]
[null,null,null,2564.6019999999999,null,null,"DELINEATOR/MARKER PANEL",null,"EACH",{"$f":"'DEL & MARK'!G39","v":9},null,"SIGNING"]
[null,null,null,2564.6019999999999,null,null,"DELINEATOR/MARKER SIGN",null,"EACH",{"$f":"'DEL & MARK'!H15","v":10},null,"SIGNING"]
[null,null,null,2564.6019999999999,null,null,"SIGN FRAME",null,"EACH",null,null,"SIGNING"]
[null,null,null,2564.6019999999999,null,null,"SUPPLEMENTAL DESCRIPTION",null,"EACH",0,null,"SIGNING"]
[null,null,null,2564.6179999999999,null,null,"SIGN TYPE C",null,"SQ FT",0,null,"SIGNING"]
[null,"DD",null,2564.6179999999999,null,null,"SIGN TYPE D",null,"SQ FT",0,null,"SIGNING"]
[]
[]
[null,null,null,null,null,null,null,null,null,null,null,"x"]
[null,null,null,null,null,null,null,null,null,null,null,"x"]
[null,"GENERAL NOTE:"]
[null,"FOR SIGNS THAT ARE LOCATED ADJACENT TO A SIDEWALK OR TRAIL, A 4' MINIMUM (6' PREFERRED) UNOBSTRUCTED PAVED WALKWAY OR PATH"]
[]
[null,"(P) DENOTES PLAN QUANTITY",null,null,null,null,null,null,null,null,null,"High"]
[null,{"$f":"\"(3)  OTHER NOTES.\"","v":"(3)  OTHER NOTES."},null,null,null,null,null,null,null,null,null,"High"]
[null,{"$f":"\"(4)  OTHER NOTES.\"","v":"(4)  OTHER NOTES."},null,null,null,null,null,null,null,null,null,"High"]

{"sheet":"SEQ-4Temp","index":3,"n_rows":8,"n_cols":8,"rows_kept":8,"cut":false,"hidden":true,"merged":[[4,1,4,6],[5,2,7,2],[4,7,4,8],[5,7,5,8],[6,7,6,8],[7,7,7,8]]}
[]
[]
[]
[]
[null,{"$f":"IF('SEQ-PSTAB'!F1<>\"\",'SEQ-PSTAB'!G1,IF('SEQ-PSTAB'!F2<>\"\",'SEQ-PSTAB'!G2,'SEQ-PSTAB'!G3))","v":"PERMANENT SIGNING TABULATION"},null,null,null,null,null,"X"]
[null,null,"SHEET\nNO",null,null,null,null,"TOTAL"]
[null,"TAB",null,"ITEM NO",null,"ITEM","UNIT","ESTIMATED"]
[null,null,null,null,null,null,null,"QUANTITIES"]

{"sheet":"TOC","index":4,"n_rows":70,"n_cols":3,"rows_kept":70,"cut":false,"hidden":false,"merged":[[21,1,21,2],[40,1,40,2],[38,1,38,2],[30,1,30,2],[5,1,5,2],[25,1,25,2],[2,1,2,2],[17,1,17,2],[15,1,15,2],[12,1,12,2],[9,1,9,2]]}
[]
[null,"PAGE\nNO","SHEET NAME"]
[null,"ID PLATE (STANDARD SIGN DRAWINGS)"]
[null,0,"OH IDENTIFICATION PLATE"]
[null,0,"FEED POINT IDENTIFICATION PLATE"]
[null,"PLACEMENT DETAILS"]
[null,"ST13","SIGN PLACEMENT"]
[null,"ST87","DELINEATORS AND MARKERS"]
[null,58,"FLANGED CHANNEL POST MOUNTED THROUGH SURFACED MEDIAN OR SIDEWALK"]
[null,"A SIGN STRUCTURAL DETAILS"]
[null,0,"H-PILE FOOTINGS - SHEET 1"]
[null,0,"H-PILE FOOTINGS - SHEET 2"]
[]
[null,0,"CONCRETE FOOTINGS - SHEET 1"]
[null,0,"CONCRETE FOOTINGS - SHEET 2"]
[]
[null,0,"POST MODIFICATIONS"]
[null,"C & D SIGN STRUCTURAL DETAILS"]
[null,"ST23","SHEET 1 (MAIN)"]
[null,"ST24","SHEET 2 (A-FRAME)"]
[null,"ST25","SHEET 3 (PUNCH) * PUNCHING DETAILS ARE IN STANDARDS SIGN MANUAL PAGE 110."]
[null,"C SIGN: VARIOUS MOUNTING SHEETS"]
[null,57,"TYPE C SIGNS MOUNTED ON BRIDGE MEDIAN ISLAND"]
[null,56,"TYPE C SIGNS, DELINEATORES, & MARKERS IN CONCRETE "]
[null,59,"TYPC C SIGNS MOUNTED ON O-POSTS, OH SIGN POSTS, OR SIGNAL STANDARDS"]
[null,"MOUNTED ON BRIDGE RAIL"]
[null,32,"4 1/2\" O-PIPE [A]"]
[null,0,"6 5/8\" O-PIPE"]
[null,0,"4 1/2\" O-PIPE [B]"]
[null,0,"WALL RAIL"]
[null,"BRIDGE MOUNTED (D SIGNS ONLY)"]
[null,36,"DESIGN A1"]
[null,0,"DESIGN B4"]
[null,0,"DESIGN B3"]
[null,0,"DESIGN B2"]
[null,0,"DESIGN B1"]
[null,0,"DESIGN A2"]
[null,0,"DESIGN B5"]
[null,"EA & EO SIGNS"]
[null,94,"STRUCTURAL DETAIL"]
[null,"OH (OVERHEAD) SIGNS"]
[null,0,"PANEL MOUNTING POST MODIFICATION DETAILS"]
[null,0,"OH SIGN SUPPORTS"]
[null,0,"OH SIGN SAFETY CABLE - DESIGN A"]
[null,0,"OH SIGN SAFETY CABLE - DESIGN B"]
[null,0,"GENERAL ELEVATIONS AND NOTES (DRAWING ST-1)"]
[null,0,"CAMBER, POST IDENTIFICATION, AND ESTIMATED QUANTITIES (DRAWING ST-2)"]
[null,0,"FOUNDATIONS AND ANCHOR RODS (DRAWING ST-3)"]
[null,0,"TRUSS/POST CONNECTION & BASEPLATES (DRAWING ST-4)"]
[null,0,"SIGN TRUSS DETAILS - TRUSS TYPE A (DRAWING ST-5)"]
[null,0,"SIGN TRUSS DETAILS - TRUSS TYPE B (DRAWING ST-6)"]
[null,0,"SIGN TRUSS DETAILS - TRUSS TYPE C (DRAWING ST-7)"]
[null,0,"WALKWAY DETAILS (DRAWING ST-8)"]
[null,0,"FOLDING HANDRAIL (DRAWING ST-9)"]
[null,0,"SIGN PANEL AND PANEL MOUNTING POSTS DETAILS (DRAWING ST-10)"]
[null,0,"ELECTRICAL DETAILS (DRAWING ST-11)"]
[null,0,"ELECTRICAL DETAILS (DRAWING ST-12)"]
[null,0,"MODIFIED ELECTRICAL DETAILS (DRAWING ST-13) (INPLACE OF 12 UNLESS BOTH CMS & REG. OH)"]
[null,null,"D PANELS"]
[null,"ST81","FIRST PAGE OF TYPE D SIGN PANEL LAYOUTS"]
[null,"ST94","LAST PAGE OF SIGN PANEL TYPE D LAYOUTS"]
[null,null,"EO PANELS"]
[null,"ST27","FIRST PAGE OF TYPE EO SIGN PANEL LAYOUTS"]
[null,"ST47","LAST PAGE OF TYPE EO SIGN PANEL LAYOUTS"]
[null,null,"OH PANELS"]
[null,"ST67","FIRST PAGE OF TYPE OH SIGN PANEL LAYOUTS"]
[null,"ST68","LAST PAGE OF TYPE OH SIGN PANEL LAYOUTS"]
[null,null,"OH OVERLAY"]
[null,"ST70","FIRST PAGE OF TYPE OH SIGN PANEL OVERLAY LAYOUTS"]
[null,"ST71","LAST PAGE OF TYPE OH SIGN PANEL OVERLAY LAYOUTS"]

{"sheet":"POSTS25","index":5,"n_rows":412,"n_cols":5,"rows_kept":412,"cut":false,"hidden":true,"merged":[[1,1,1,4],[3,1,3,2],[2,3,3,3],[2,4,3,4]]}
[]
[null,"2.5# POSTS"]
[null,"HEIGHT ","LENGTH","V-POST","K-POST"]
[null,"INCH"]
[null,12,12,1,0]
[null,{"$f":"B5+6","v":18},12,1,0]
[null,24,12,1,0]
[null,30,12,1,0]
[null,36,12,2,0]
[null,42,12,2,0]
[null,48,12,2,0]
[null,54,12,2,0]
[null,60,12,2,1]
[null,66,12,2,1]
[null,72,12,2,1]
[null,78,12,2,1]
[null,84,12,2,1]
[null,90,12,2,1]
[null,96,12,2,1]
[null,102,12,2,1]
[null,108,12,2,1]
[null,114,12,2,1]
[null,120,12,2,1]
[null,126,12,2,1]
[null,132,12,2,1]
[null,138,12,2,1]
[null,144,12,2,1]
[null,150,12,2,1]
[null,12,18,1,0]
[null,{"$f":"B29+6","v":18},18,1,0]
[null,24,18,2,0]
[null,30,18,2,0]
[null,36,18,2,0]
[null,42,18,2,1]
[null,48,18,2,1]
[null,54,18,2,1]
[null,60,18,2,1]
[null,66,18,2,1]
[null,72,18,2,1]
[null,78,18,2,1]
[null,84,18,2,1]
[null,90,18,2,1]
[null,96,18,2,1]
[null,102,18,2,1]
[null,108,18,2,1]
[null,114,18,2,1]
[null,120,18,2,1]
[null,126,18,2,1]
[null,132,18,2,2]
[null,138,18,2,2]
[null,144,18,2,2]
[null,150,18,2,2]
[null,12,24,1,0]
[null,{"$f":"B53+6","v":18},24,2,0]
[null,24,24,2,0]
[null,30,24,2,0]
[null,36,24,2,1]
[null,42,24,2,1]
[null,48,24,2,1]
[null,54,24,2,1]
[null,60,24,2,1]
[null,66,24,2,1]
[null,72,24,2,1]
[null,78,24,2,1]
[null,84,24,2,1]
[null,90,24,2,1]
[null,96,24,2,1]
[null,102,24,2,1]
[null,108,24,2,1]
[null,114,24,2,2]
[null,120,24,2,2]
[null,126,24,2,2]
[null,132,24,2,2]
[null,138,24,2,2]
[null,144,24,2,2]
[null,150,24,2,2]
[null,12,30,1,0]
[null,{"$f":"B77+6","v":18},30,2,0]
[null,24,30,2,0]
[null,30,30,2,1]
[null,36,30,2,1]
[null,42,30,2,1]
[null,48,30,2,1]
[null,54,30,2,1]
[null,60,30,2,1]
[null,66,30,2,1]
[null,72,30,2,1]
[null,78,30,2,1]
[null,84,30,2,1]
[null,90,30,2,1]
[null,96,30,2,1]
[null,102,30,2,2]
[null,108,30,2,2]
[null,114,30,2,2]
[null,120,30,2,2]
[null,126,30,2,2]
[null,132,30,2,2]
[null,138,30,2,2]
[null,12,36,2,0]
[null,{"$f":"B99+6","v":18},36,2,0]
[null,24,36,2,1]
[null,30,36,2,1]
[null,36,36,2,1]
[null,42,36,2,1]
[null,48,36,2,1]
[null,54,36,2,1]
[null,60,36,2,1]
[null,66,36,2,1]
[null,72,36,2,1]
[null,78,36,2,1]
[null,84,36,2,1]
[null,90,36,2,2]
[null,96,36,2,2]
[null,102,36,2,2]
[null,108,36,2,2]
[null,114,36,2,2]
[null,120,36,2,2]
[null,12,42,2,0]
[null,{"$f":"B118+6","v":18},42,2,0]
[null,24,42,2,1]
[null,30,42,2,1]
[null,36,42,2,1]
[null,42,42,2,1]
[null,48,42,2,1]
[null,54,42,2,1]
[null,60,42,2,1]
[null,66,42,2,1]
[null,72,42,2,1]
[null,78,42,2,2]
[null,84,42,2,2]
[null,90,42,2,2]
[null,96,42,2,2]
[null,102,42,2,2]
[null,108,42,2,2]
[null,114,42,2,2]
[null,120,42,2,2]
[null,12,48,2,0]
[null,{"$f":"B137+6","v":18},48,2,1]
[null,24,48,2,1]
[null,30,48,2,1]
[null,36,48,2,1]
[null,42,48,2,1]
[null,48,48,2,1]
[null,54,48,2,1]
[null,60,48,2,1]
[null,66,48,2,1]
[null,72,48,2,2]
[null,78,48,2,2]
[null,84,48,2,2]
[null,90,48,2,2]
[null,96,48,2,2]
[null,102,48,2,2]
[null,108,48,2,2]
[null,12,54,1,0]
[null,{"$f":"B154+6","v":18},54,2,1]
[null,24,54,2,1]
[null,30,54,2,1]
[null,36,54,2,1]
[null,42,54,2,1]
[null,48,54,2,1]
[null,54,54,2,1]
[null,60,54,2,1]
[null,66,54,2,2]
[null,72,54,2,2]
[null,78,54,2,2]
[null,84,54,2,2]
[null,90,54,2,2]
[null,96,54,2,2]
[null,12,60,1,0]
[null,{"$f":"B169+6","v":18},60,2,1]
[null,24,60,2,1]
[null,30,60,2,1]
[null,36,60,2,1]
[null,42,60,2,1]
[null,48,60,2,1]
[null,54,60,2,1]
[null,60,60,2,2]
[null,66,60,2,2]
[null,72,60,2,2]
[null,78,60,2,2]
[null,84,60,2,2]
[null,90,60,2,2]
[null,12,66,1,0]
[null,{"$f":"B183+6","v":18},66,2,2]
[null,24,66,2,2]
[null,30,66,2,2]
[null,36,66,2,2]
[null,42,66,2,2]
[null,48,66,2,2]
[null,54,66,2,2]
[null,60,66,2,2]
[null,66,66,2,2]
[null,72,66,2,2]
[null,78,66,2,2]
[null,84,66,2,2]
[null,90,66,2,2]
[null,12,72,2,2]
[null,{"$f":"B197+6","v":18},72,2,2]
[null,24,72,2,2]
[null,30,72,2,2]
[null,36,72,2,2]
[null,42,72,2,2]
[null,48,72,2,2]
[null,54,72,2,2]
[null,60,72,2,2]
[null,66,72,2,2]
[null,72,72,2,2]
[null,78,72,2,2]
[null,84,72,2,2]
[null,12,78,2,2]
[null,{"$f":"B210+6","v":18},78,2,2]
[null,24,78,2,2]
[null,30,78,2,2]
[null,36,78,2,2]
[null,42,78,2,2]
[null,48,78,2,2]
[null,54,78,2,2]
[null,60,78,2,2]
[null,66,78,2,2]
[null,72,78,2,2]
[null,78,78,2,2]
[null,12,84,2,2]
[null,{"$f":"B222+6","v":18},84,2,2]
[null,24,84,2,2]
[null,30,84,2,2]
[null,36,84,2,2]
[null,42,84,2,2]
[null,48,84,2,2]
[null,54,84,2,2]
[null,60,84,2,2]
[null,66,84,2,2]
[null,72,84,2,2]
[null,12,90,2,2]
[null,{"$f":"B233+6","v":18},90,2,2]
[null,24,90,2,2]
[null,30,90,2,2]
[null,36,90,2,2]
[null,42,90,2,2]
[null,48,90,2,2]
[null,54,90,2,2]
[null,60,90,2,2]
[null,66,90,2,2]
[null,72,90,2,2]
[null,12,96,2,2]
[null,{"$f":"B244+6","v":18},96,2,2]
[null,24,96,2,2]
[null,30,96,2,2]
[null,36,96,2,2]
[null,42,96,2,2]
[null,48,96,2,2]
[null,54,96,2,2]
[null,60,96,2,2]
[null,66,96,2,2]
[null,12,102,2,2]
[null,{"$f":"B254+6","v":18},102,2,2]
[null,24,102,2,2]
[null,30,102,2,2]
[null,36,102,2,2]
[null,42,102,2,2]
[null,48,102,2,2]
[null,54,102,2,2]
[null,60,102,2,2]
[null,66,102,2,2]
[null,72,102,3,3]
[null,78,102,3,3]
[null,84,102,3,3]
[null,12,108,2,2]
[null,{"$f":"B267+6","v":18},108,2,2]
[null,24,108,2,2]
[null,30,108,2,2]
[null,36,108,2,2]
[null,42,108,2,2]
[null,48,108,2,2]
[null,54,108,2,2]
[null,60,108,2,2]
[null,66,108,3,3]
[null,72,108,3,3]
[null,78,108,3,3]
[null,84,108,3,3]
[null,12,114,2,2]
[null,{"$f":"B280+6","v":18},114,2,2]
[null,24,114,2,2]
[null,30,114,2,2]
[null,36,114,2,2]
[null,42,114,2,2]
[null,48,114,2,2]
[null,54,114,2,2]
[null,60,114,2,2]
[null,66,114,3,3]
[null,72,114,3,3]
[null,78,114,3,3]
[null,12,120,2,2]
[null,{"$f":"B292+6","v":18},120,2,2]
[null,24,120,2,2]
[null,30,120,2,2]
[null,36,120,2,2]
[null,42,120,2,2]
[null,48,120,2,2]
[null,54,120,2,2]
[null,60,120,3,3]
[null,66,120,3,3]
[null,72,120,3,3]
[null,78,120,3,3]
[null,12,126,2,2]
[null,{"$f":"B304+6","v":18},126,2,2]
[null,24,126,2,2]
[null,30,126,2,2]
[null,36,126,2,2]
[null,42,126,2,2]
[null,48,126,2,2]
[null,54,126,2,2]
[null,60,126,3,3]
[null,66,126,3,3]
[null,72,126,3,3]
[null,12,132,2,2]
[null,{"$f":"B315+6","v":18},132,2,2]
[null,{"$f":"B316+6","v":24},132,2,2]
[null,{"$f":"B317+6","v":30},132,2,2]
[null,{"$f":"B318+6","v":36},132,2,2]
[null,{"$f":"B319+6","v":42},132,2,2]
[null,12,138,2,2]
[null,{"$f":"B321+6","v":18},138,2,2]
[null,24,138,2,2]
[null,30,138,2,2]
[null,36,138,2,2]
[null,42,138,2,2]
[null,48,138,2,2]
[null,54,138,3,3]
[null,60,138,3,3]
[null,66,138,3,3]
[null,12,144,2,2]
[null,{"$f":"B331+6","v":18},144,2,2]
[null,24,144,2,2]
[null,30,144,2,2]
[null,36,144,2,2]
[null,42,144,2,2]
[null,48,144,2,2]
[null,54,144,3,3]
[null,60,144,3,3]
[null,66,144,3,3]
[null,72,144,4,4]
[null,78,144,4,4]
[null,84,144,4,4]
[null,12,150,2,2]
[null,{"$f":"B344+6","v":18},150,2,2]
[null,24,150,2,2]
[null,30,150,2,2]
[null,36,150,2,2]
[null,42,150,2,2]
[null,48,150,2,2]
[null,54,150,3,3]
[null,60,150,3,3]
[null,66,150,3,3]
[null,72,150,4,4]
[null,78,150,4,4]
[null,12,156,2,2]
[null,{"$f":"B356+6","v":18},156,2,2]
[null,24,156,2,2]
[null,30,156,2,2]
[null,36,156,2,2]
[null,42,156,2,2]
[null,48,156,2,2]
[null,54,156,3,3]
[null,60,156,3,3]
[null,66,156,4,4]
[null,72,156,4,4]
[null,78,156,4,4]
[null,12,162,2,2]
[null,{"$f":"B368+6","v":18},162,2,2]
[null,24,162,2,2]
[null,30,162,2,2]
[null,36,162,2,2]
[null,42,162,2,2]
[null,48,162,3,3]
[null,54,162,3,3]
[null,60,162,3,3]
[null,66,162,4,4]
[null,72,162,4,4]
[null,78,162,4,4]
[null,12,168,2,2]
[null,{"$f":"B380+6","v":18},168,2,2]
[null,24,168,2,2]
[null,30,168,2,2]
[null,36,168,2,2]
[null,42,168,2,2]
[null,48,168,3,3]
[null,54,168,3,3]
[null,60,168,3,3]
[null,66,168,4,4]
[null,72,168,4,4]
[null,12,174,2,2]
[null,{"$f":"B391+6","v":18},174,2,2]
[null,24,174,2,2]
[null,30,174,2,2]
[null,36,174,2,2]
[null,42,174,2,2]
[null,48,174,3,3]
[null,54,174,3,3]
[null,60,174,3,3]
[null,66,174,4,4]
[null,72,174,4,4]
[null,12,180,2,2]
[null,{"$f":"B402+6","v":18},180,2,2]
[null,24,180,2,2]
[null,30,180,2,2]
[null,36,180,2,2]
[null,42,180,2,2]
[null,48,180,3,3]
[null,54,180,3,3]
[null,60,180,4,4]
[null,66,180,4,4]
[null,72,180,4,4]

{"sheet":"POSTS30","index":6,"n_rows":432,"n_cols":5,"rows_kept":432,"cut":false,"hidden":true,"merged":[[1,1,1,4],[3,1,3,2],[2,3,3,3],[2,4,3,4]]}
[]
[null,"3.0# POSTS"]
[null,"HEIGHT ","LENGTH","V-POST","K-POST"]
[null,"INCH"]
[null,12,12,1,0]
[null,18,12,1,0]
[null,24,12,1,0]
[null,30,12,1,0]
[null,36,12,2,0]
[null,42,12,2,0]
[null,48,12,2,0]
[null,54,12,2,0]
[null,60,12,2,0]
[null,66,12,2,0]
[null,72,12,2,1]
[null,78,12,2,1]
[null,84,12,2,1]
[null,90,12,2,1]
[null,96,12,2,1]
[null,102,12,2,1]
[null,108,12,2,1]
[null,114,12,2,1]
[null,120,12,2,1]
[null,126,12,2,1]
[null,132,12,2,1]
[null,138,12,2,1]
[null,144,12,2,1]
[null,150,12,2,1]
[null,12,18,1,0]
[null,18,18,1,0]
[null,24,18,1,0]
[null,30,18,2,0]
[null,36,18,2,0]
[null,42,18,2,0]
[null,48,18,2,1]
[null,54,18,2,1]
[null,60,18,2,1]
[null,66,18,2,1]
[null,72,18,2,1]
[null,78,18,2,1]
[null,84,18,2,1]
[null,90,18,2,1]
[null,96,18,2,1]
[null,102,18,2,1]
[null,108,18,2,1]
[null,114,18,2,1]
[null,120,18,2,1]
[null,126,18,2,1]
[null,132,18,2,1]
[null,138,18,2,2]
[null,144,18,2,2]
[null,150,18,2,2]
[null,12,24,1,0]
[null,18,24,1,0]
[null,24,24,2,0]
[null,30,24,2,0]
[null,36,24,2,0]
[null,42,24,2,1]
[null,48,24,2,1]
[null,54,24,2,1]
[null,60,24,2,1]
[null,66,24,2,1]
[null,72,24,2,1]
[null,78,24,2,1]
[null,84,24,2,1]
[null,90,24,2,1]
[null,96,24,2,1]
[null,102,24,2,1]
[null,108,24,2,1]
[null,114,24,2,2]
[null,120,24,2,2]
[null,126,24,2,2]
[null,132,24,2,2]
[null,138,24,2,2]
[null,144,24,2,2]
[null,150,24,2,2]
[null,12,30,1,0]
[null,18,30,2,0]
[null,24,30,2,0]
[null,30,30,2,0]
[null,36,30,2,1]
[null,42,30,2,1]
[null,48,30,2,1]
[null,54,30,2,1]
[null,60,30,2,1]
[null,66,30,2,1]
[null,72,30,2,1]
[null,78,30,2,1]
[null,84,30,2,1]
[null,90,30,2,1]
[null,96,30,2,1]
[null,102,30,2,2]
[null,108,30,2,2]
[null,114,30,2,2]
[null,120,30,2,2]
[null,126,30,2,2]
[null,132,30,2,2]
[null,138,30,2,2]
[null,144,30,2,2]
[null,12,36,2,0]
[null,18,36,2,0]
[null,24,36,2,0]
[null,30,36,2,1]
[null,36,36,2,1]
[null,42,36,2,1]
[null,48,36,2,1]
[null,54,36,2,1]
[null,60,36,2,1]
[null,66,36,2,1]
[null,72,36,2,1]
[null,78,36,2,1]
[null,84,36,2,1]
[null,90,36,2,2]
[null,96,36,2,2]
[null,102,36,2,2]
[null,108,36,2,2]
[null,114,36,2,2]
[null,120,36,2,2]
[null,126,36,2,2]
[null,132,36,2,2]
[null,12,42,2,0]
[null,18,42,2,0]
[null,24,42,2,1]
[null,30,42,2,1]
[null,36,42,2,1]
[null,42,42,2,1]
[null,48,42,2,1]
[null,54,42,2,1]
[null,60,42,2,1]
[null,66,42,2,1]
[null,72,42,2,1]
[null,78,42,2,1]
[null,84,42,2,2]
[null,90,42,2,2]
[null,96,42,2,2]
[null,102,42,2,2]
[null,108,42,2,2]
[null,114,42,2,2]
[null,120,42,2,2]
[null,12,48,2,0]
[null,18,48,2,0]
[null,24,48,2,1]
[null,30,48,2,1]
[null,36,48,2,1]
[null,42,48,2,1]
[null,48,48,2,1]
[null,54,48,2,1]
[null,60,48,2,1]
[null,66,48,2,1]
[null,72,48,2,1]
[null,78,48,2,2]
[null,84,48,2,2]
[null,90,48,2,2]
[null,96,48,2,2]
[null,102,48,2,2]
[null,108,48,2,2]
[null,12,54,2,0]
[null,18,54,2,1]
[null,24,54,2,1]
[null,30,54,2,1]
[null,36,54,2,1]
[null,42,54,2,1]
[null,48,54,2,1]
[null,54,54,2,1]
[null,60,54,2,1]
[null,66,54,2,1]
[null,72,54,2,2]
[null,78,54,2,2]
[null,84,54,2,2]
[null,90,54,2,2]
[null,96,54,2,2]
[null,102,54,2,2]
[null,12,60,2,0]
[null,18,60,2,1]
[null,24,60,2,1]
[null,30,60,2,1]
[null,36,60,2,1]
[null,42,60,2,1]
[null,48,60,2,1]
[null,54,60,2,1]
[null,60,60,2,1]
[null,66,60,2,2]
[null,72,60,2,2]
[null,78,60,2,2]
[null,84,60,2,2]
[null,90,60,2,2]
[null,96,60,2,2]
[null,12,66,3,0]
[null,18,66,2,2]
[null,24,66,2,2]
[null,30,66,2,2]
[null,36,66,2,2]
[null,42,66,2,2]
[null,48,66,2,2]
[null,54,66,2,2]
[null,60,66,2,2]
[null,66,66,2,2]
[null,72,66,2,2]
[null,78,66,2,2]
[null,84,66,2,2]
[null,90,66,2,2]
[null,12,72,3,0]
[null,18,72,2,2]
[null,24,72,2,2]
[null,30,72,2,2]
[null,36,72,2,2]
[null,42,72,2,2]
[null,48,72,2,2]
[null,54,72,2,2]
[null,60,72,2,2]
[null,66,72,2,2]
[null,72,72,2,2]
[null,78,72,2,2]
[null,84,72,2,2]
[null,12,78,3,0]
[null,18,78,2,2]
[null,24,78,2,2]
[null,30,78,2,2]
[null,36,78,2,2]
[null,42,78,2,2]
[null,48,78,2,2]
[null,54,78,2,2]
[null,60,78,2,2]
[null,66,78,2,2]
[null,72,78,2,2]
[null,78,78,2,2]
[null,12,84,3,0]
[null,18,84,2,2]
[null,24,84,2,2]
[null,30,84,2,2]
[null,36,84,2,2]
[null,42,84,2,2]
[null,48,84,2,2]
[null,54,84,2,2]
[null,60,84,2,2]
[null,66,84,2,2]
[null,72,84,2,2]
[null,78,84,2,2]
[null,12,90,3,0]
[null,18,90,2,2]
[null,24,90,2,2]
[null,30,90,2,2]
[null,36,90,2,2]
[null,42,90,2,2]
[null,48,90,2,2]
[null,54,90,2,2]
[null,60,90,2,2]
[null,66,90,2,2]
[null,72,90,2,2]
[null,12,96,3,0]
[null,18,96,2,2]
[null,24,96,2,2]
[null,30,96,2,2]
[null,36,96,2,2]
[null,42,96,2,2]
[null,48,96,2,2]
[null,54,96,2,2]
[null,60,96,2,2]
[null,66,96,2,2]
[null,72,96,2,2]
[null,12,102,3,0]
[null,18,102,2,2]
[null,24,102,2,2]
[null,30,102,2,2]
[null,36,102,2,2]
[null,42,102,2,2]
[null,48,102,2,2]
[null,54,102,2,2]
[null,60,102,2,2]
[null,66,102,2,2]
[null,72,102,3,3]
[null,78,102,3,3]
[null,84,102,3,3]
[null,90,102,3,3]
[null,96,102,3,3]
[null,12,108,3,0]
[null,18,108,2,2]
[null,24,108,2,2]
[null,30,108,2,2]
[null,36,108,2,2]
[null,42,108,2,2]
[null,48,108,2,2]
[null,54,108,2,2]
[null,60,108,2,2]
[null,66,108,2,2]
[null,72,108,3,3]
[null,78,108,3,3]
[null,84,108,3,3]
[null,90,108,3,3]
[null,12,114,3,0]
[null,18,114,2,2]
[null,24,114,2,2]
[null,30,114,2,2]
[null,36,114,2,2]
[null,42,114,2,2]
[null,48,114,2,2]
[null,54,114,2,2]
[null,60,114,2,2]
[null,66,114,3,3]
[null,72,114,3,3]
[null,78,114,3,3]
[null,84,114,3,3]
[null,12,120,3,0]
[null,18,120,2,2]
[null,24,120,2,2]
[null,30,120,2,2]
[null,36,120,2,2]
[null,42,120,2,2]
[null,48,120,2,2]
[null,54,120,2,2]
[null,60,120,2,2]
[null,66,120,3,3]
[null,72,120,3,3]
[null,78,120,3,3]
[null,12,126,2,2]
[null,18,126,2,2]
[null,24,126,2,2]
[null,30,126,2,2]
[null,36,126,2,2]
[null,42,126,2,2]
[null,48,126,2,2]
[null,54,126,2,2]
[null,60,126,2,2]
[null,66,126,3,3]
[null,72,126,3,3]
[null,78,126,3,3]
[null,12,132,2,2]
[null,18,132,2,2]
[null,24,132,2,2]
[null,30,132,2,2]
[null,36,132,2,2]
[null,42,132,2,2]
[null,48,132,2,2]
[null,54,132,2,2]
[null,60,132,3,3]
[null,66,132,3,3]
[null,72,132,3,3]
[null,12,138,2,2]
[null,18,138,2,2]
[null,24,138,2,2]
[null,30,138,2,2]
[null,36,138,2,2]
[null,42,138,2,2]
[null,48,138,2,2]
[null,54,138,2,2]
[null,60,138,3,3]
[null,66,138,3,3]
[null,72,138,3,3]
[null,12,144,2,2]
[null,18,144,2,2]
[null,24,144,2,2]
[null,30,144,2,2]
[null,36,144,2,2]
[null,42,144,2,2]
[null,48,144,2,2]
[null,54,144,2,2]
[null,60,144,3,3]
[null,66,144,3,3]
[null,72,144,3,3]
[null,78,144,4,4]
[null,84,144,4,4]
[null,12,150,2,2]
[null,18,150,2,2]
[null,24,150,2,2]
[null,30,150,2,2]
[null,36,150,2,2]
[null,42,150,2,2]
[null,48,150,2,2]
[null,54,150,3,3]
[null,60,150,3,3]
[null,66,150,3,3]
[null,72,150,4,4]
[null,78,150,4,4]
[null,84,150,4,4]
[null,12,156,2,2]
[null,18,156,2,2]
[null,24,156,2,2]
[null,30,156,2,2]
[null,36,156,2,2]
[null,42,156,2,2]
[null,48,156,2,2]
[null,54,156,3,3]
[null,60,156,3,3]
[null,66,156,3,3]
[null,72,156,4,4]
[null,78,156,4,4]
[null,12,162,2,2]
[null,18,162,2,2]
[null,24,162,2,2]
[null,30,162,2,2]
[null,36,162,2,2]
[null,42,162,2,2]
[null,48,162,2,2]
[null,54,162,3,3]
[null,60,162,3,3]
[null,66,162,3,3]
[null,72,162,4,4]
[null,78,162,4,4]
[null,12,168,2,2]
[null,18,168,2,2]
[null,24,168,2,2]
[null,30,168,2,2]
[null,36,168,2,2]
[null,42,168,2,2]
[null,48,168,2,2]
[null,54,168,3,3]
[null,60,168,3,3]
[null,66,168,4,4]
[null,72,168,4,4]
[null,78,168,4,4]
[null,12,174,2,2]
[null,18,174,2,2]
[null,24,174,2,2]
[null,30,174,2,2]
[null,36,174,2,2]
[null,42,174,2,2]
[null,48,174,3,3]
[null,54,174,3,3]
[null,60,174,3,3]
[null,66,174,4,4]
[null,72,174,4,4]
[null,12,180,2,2]
[null,18,180,2,2]
[null,24,180,2,2]
[null,30,180,2,2]
[null,36,180,2,2]
[null,42,180,2,2]
[null,48,180,3,3]
[null,54,180,3,3]
[null,60,180,3,3]
[null,66,180,4,4]
[null,72,180,4,4]

{"sheet":"ESGNPOSTS","index":7,"n_rows":27,"n_cols":5,"rows_kept":27,"cut":false,"hidden":true,"merged":[[3,1,3,4],[1,1,1,4]]}
[]
[null,"E SIGN POST SPACING"]
[null,"WIDTH","2 POSTS","3 POSTS","4 POSTS"]
[null,"INCH"]
[null,48,30]
[null,{"$f":"B5+6","v":54},30]
[null,{"$f":"B6+6","v":60},36]
[null,66,36]
[null,72,42]
[null,78,48]
[null,84,48]
[null,90,54]
[null,96,54]
[null,102,null,36]
[null,108,null,36]
[null,114,null,42]
[null,120,null,42]
[null,126,null,42]
[null,132,null,48]
[null,138,null,48]
[null,144,null,54]
[null,150,null,null,42]
[null,156,null,null,42]
[null,162,null,null,42]
[null,168,null,null,42]
[null,174,null,null,48]
[null,180,null,null,48]

{"sheet":"POSTSPACING","index":8,"n_rows":29,"n_cols":5,"rows_kept":29,"cut":false,"hidden":true,"merged":[[3,1,3,4],[1,1,1,4]]}
[]
[null,"SIGN POST SPACING"]
[null,"WIDTH","2 POSTS","3 POSTS","4 POSTS"]
[null,"INCH"]
[null,36,24]
[null,{"$f":"B5+6","v":42},30]
[null,48,30]
[null,54,30]
[null,60,36]
[null,66,42]
[null,72,42]
[null,78,54]
[null,84,54]
[null,90,54]
[null,96,54]
[null,102,60,45]
[null,108,66,45]
[null,114,66,45]
[null,120,72,45]
[null,126,78,45]
[null,132,78,45]
[null,138,78,48]
[null,144,90,51,45]
[null,150,90,54,45]
[null,156,90,54,45]
[null,162,96,57,48]
[null,168,96,60,48]
[null,174,102,63,54]
[null,180,108,63,54]

{"sheet":"PICILINKS","index":9,"n_rows":295,"n_cols":8,"rows_kept":295,"cut":false,"hidden":true,"merged":[]}
["Rev","Item_Number","Short_Description","Units_Code"]
[null,"2102.501/00010","PAVEMENT MARKING REMOVAL","S F"]
["F","2104.509/00170","REMOVE DELINEATOR","EACH","DELREM"]
["F","2104.509/00180","REMOVE MARKER","EACH"]
[null,"2104.509/00199","REMOVE SIGN","EACH"]
[null,"2104.509/00200","REMOVE SIGN TYPE A (BRIDGE MOUNTED)","EACH"]
["x","2104.509/00201","REMOVE SIGN TYPE A","EACH","AREM","ABASRM"]
["F","2104.509/00203","REMOVE SIGN TYPE C","EACH"]
["F","2104.509/00205","REMOVE SIGN TYPE D","EACH","DREM"]
[null,"2104.509/00206","REMOVE SIGN TYPE EA","EACH"]
[null,"2104.509/00207","REMOVE SIGN TYPE EO","EACH"]
[null,"2104.509/00208","REMOVE SIGN TYPE OH (BRIDGE MOUNTED)","EACH"]
[null,"2104.509/00209","REMOVE SIGN TYPE OH","EACH"]
[null,"2104.509/00210","REMOVE SIGN TYPE D (BRIDGE MOUNTED)","EACH"]
[null,"2104.509/00220","REMOVE SIGN TYPE SPECIAL","EACH","AEXTRM"]
[null,"2104.509/00250","REMOVE SIGN PANEL OVERLAY TYPE A","EACH"]
[null,"2104.509/00251","REMOVE SIGN PANEL OVERLAY TYPE OH","EACH"]
[null,"2104.509/00252","REMOVE SIGN PANEL OVERLAY TYPE EA","EACH"]
[null,"2104.509/00253","REMOVE SIGN PANEL OVERLAY TYPE EO","EACH"]
[null,"2104.509/00410","REMOVE SIGN BASE","EACH"]
[null,"2104.509/00411","REMOVE SIGN BASE-TYPE OH","EACH"]
[null,"2104.509/00412","REMOVE SIGN BASE-TYPE A","EACH","ABASRM"]
[null,"2104.509/00497","REMOVE SIGN PANEL TYPE C","EACH"]
[null,"2104.509/00498","REMOVE SIGN PANEL TYPE D","EACH"]
[null,"2104.509/00499","REMOVE SIGN PANEL TYPE A","EACH",null,"AEXTRM"]
[null,"2104.509/00500","REMOVE SIGN PANEL TYPE OH","EACH"]
[null,"2104.509/00660","REMOVE HISTORIC PLAQUE","EACH"]
[null,"2104.509/00700","REMOVE WOOD INFORMATION SIGN","EACH"]
[null,"2104.523/00067","SALVAGE HISTORIC MARKER","EACH"]
[null,"2104.523/00068","SALVAGE HISTORIC PLAQUE","EACH"]
[null,"2104.523/00069","SALVAGE DEDICATION PLAQUE","EACH"]
["F","2104.523/00072","SALVAGE MARKER","EACH","DELS&I"]
["F","2104.523/00075","SALVAGE DELINEATOR","EACH","DELS&I"]
[null,"2104.523/00078","SALVAGE GUIDE POST TYPE A","EACH"]
[null,"2104.523/00080","SALVAGE GUIDE POST TYPE B","EACH"]
[null,"2104.523/00475","SALVAGE PED PUSH BUTTON AND SIGN","EACH"]
[null,"2104.523/00530","SALVAGE R10-10 SIGN","EACH"]
[null,"2104.523/00531","SALVAGE R11-2 SIGN","EACH"]
[null,"2104.523/00537","SALVAGE SIGN SUPPORT","EACH"]
[null,"2104.523/00538","SALVAGE COMMERCIAL SIGN","EACH"]
[null,"2104.523/00539","SALVAGE SIGN","EACH"]
["x","2104.523/00540","SALVAGE SIGN TYPE A","EACH","ASAL","AS&IHP"]
["x","2104.523/00543","SALVAGE SIGN TYPE C","EACH","CS&I","CSAL"]
["x","2104.523/00544","SALVAGE SIGN TYPE D","EACH","DS&I","DSAL"]
[null,"2104.523/00547","SALVAGE SIGN TYPE EA","EACH"]
[null,"2104.523/00548","SALVAGE SIGN TYPE EO","EACH"]
[null,"2104.523/00549","SALVAGE SIGN TYPE OH (BR MOUNTED)","EACH"]
[null,"2104.523/00550","SALVAGE SIGN TYPE OH","EACH"]
[null,"2104.523/00560","SALVAGE SIGN TYPE SPECIAL","EACH"]
[null,"2104.523/00593","SALVAGE SIGN PANEL TYPE A","EACH","ASPNLSAL","ASPNLIN","ASPNLSAL"]
[null,"2104.523/00594","SALVAGE SIGN PANEL TYPE A (EXTRUD)","EACH","AEXTSA","AEXTRM","ASPNLSAL"]
[null,"2104.523/00595","SALVAGE SIGN PANEL TYPE A (FLT SHT)","EACH"]
[null,"2104.523/00598","SALVAGE SIGN PANEL TYPE EA","EACH"]
[null,"2104.523/00600","SALVAGE SIGN PANEL TYPE EO","EACH"]
[null,"2104.523/00601","SALVAGE SIGN PANEL TYPE OH","EACH"]
[null,"2104.523/00605","SALVAGE SIGN PANEL TP OH (FLT SHT)","EACH"]
[null,"2104.523/00606","SALVAGE SIGN PANEL TYPE C","EACH"]
[null,"2104.523/00608","SALVAGE SIGN PANEL TYPE D","EACH"]
[null,"2104.523/00610","SALVAGE SIGN PANEL TYPE D (BR MTD)","EACH"]
[null,"2104.523/00652","SALVAGE SIGN POST TYPE B","EACH"]
[null,"2104.602/00025","RELOCATE COMMERCIAL SIGN","EACH"]
[null,"2232.602/00010","MILLED RUMBLE STRIPS","EACH"]
[null,"2232.603/00025","MILLED RUMBLE STRIPS","L F"]
[null,"2232.603/00030","MILLED RUMBLE STRIPS-INTERMITTENT","L F"]
[null,"2232.603/00035","MILLED RUMBLE STRIPS-CENTERLINE","L F"]
[null,"2554.602/00080","REPLACE DELINEATOR TYPE SPEC (NEW)","EACH"]
[null,"2554.602/00081","REPLACE DELINEATOR TYPE SPEC(SALV)","EACH"]
[null,"2563.601/00210","STOP SIGN RELOCATION","LS"]
[null,"2563.601/00220","SIGN REMOVAL","LS"]
[null,"2563.613/01200","SIGNS BY SQUARE INCH","UDAY"]
[null,"2563.613/01220","24\"X24\" SIGN","UDAY"]
[null,"2563.613/01221","24\"X24\" SIGN WITH SUPPORTS","UDAY"]
[null,"2563.613/01441","4'X4' SIGN WITH SUPPORTS","UDAY"]
[null,"2563.618/00011","CONSTRUCTION SIGN-SPECIAL","S F"]
[null,"2563.618/00024","FURNISH, INSTALL & REMOVE TYPE D SIGNS","S F"]
[null,"2563.618/00030","SIGN PANEL COVER","S F"]
[null,"2564.511/00010","CONCRETE FOOTINGS (TYPE OH SPREAD)","C Y"]
[null,"2564.511/00011","CONCRETE FOOTINGS (TYPE A SIGNS)","C Y"]
[null,"2564.511/00012","CONCRETE FOOTINGS (TYPE OH SHAFT)","C Y"]
[null,"2564.511/00013","CONCRETE FOOTINGS DESIGN SPECIAL","C Y"]
[null,"2564.515/00010","SIGN SUPPORT","EACH"]
[null,"2564.515/00011","SIGN SUPPORT TYPE A","EACH"]
[null,"2564.515/00020","SIGN SUPPORT SIGN OH","EACH"]
[null,"2564.515/00030","SIGN SUPPORT CANTILEVER","EACH"]
["x","2564.522/00111","STRUCT STEEL-POSTS FOR TYPE A SIGNS","LB","AS&IHP","ASIGNHP"]
[null,"2564.522/00121","STRUCT STEEL-POSTS FOR OH SIGNS (A)","LB"]
[null,"2564.522/00122","STRUCT STEEL-POSTS FOR OH SIGNS (B)","LB"]
[null,"2564.522/00221","STRUCT STEEL-TRUSSES FOR OH SIGNS (A)","LB"]
[null,"2564.522/00222","STRUCT STEEL-TRUSSES FOR OH SIGNS (B)","LB"]
[null,"2564.522/00225","STR STEEL-TRUSSES FOR OH SIGNS BR MTD","LB"]
[null,"2564.522/00226","STR STEEL-TRUS FOR OH SIGNS (A) BR MTD","LB"]
[null,"2564.522/00228","STR STEEL-TRUSSES FOR A SIGNS BR MTD","LB"]
[null,"2564.522/00251","STR STEEL-SIGN CMS 100 A (BR MTD)","LB"]
[null,"2564.522/00322","STR STEEL-WLKWY SPRT FOR OH SIGNS (B)","LB"]
[null,"2564.522/00422","STR STEEL-WLKWY GRTNG FOR OH SIGNS (B)","LB"]
[null,"2564.522/00522","STR STEEL-PANEL MT PST FOR OH SIGNS (B)","LB"]
[null,"2564.522/00530","STR STEEL-SIGN BRKT OH SIGNS (B)","LB"]
["x","2564.524/00010","MODIFY POST","EACH","APSTMOD"]
[null,"2564.531/00105","SIGN PANELS TYPE SPECIAL","S F"]
["x","2564.531/00110","SIGN PANELS TYPE A","S F","ASPNL","OL","AEXT","ASIGNHP"]
["x","2564.531/00111","SIGN PANELS TYPE A (EXTRUDED)","S F"]
["x","2564.531/00112","SIGN PANELS TYPE A (FLAT SHEET)","S F"]
["x","2564.531/00130","SIGN PANELS TYPE C","S F","CSIGN"]
["x","2564.531/00140","SIGN PANELS TYPE D","S F","DSIGN","OL"]
[null,"2564.531/00141","SIGN PANELS TYPE D-SIGNALS","S F"]
[null,"2564.531/00142","SIGN PANELS TYPE D-SIGNAL SYS A","S F"]
[null,"2564.531/00143","SIGN PANELS TYPE D-SIGNAL SYS B","S F"]
[null,"2564.531/00144","SIGN PANELS TYPE D-SIGNAL SYS C","S F"]
[null,"2564.531/00145","SIGN PANELS TYPE D-SIGNAL SYS D","S F"]
[null,"2564.531/00146","SIGN PANELS TYPE D-SIGNAL SYS E","S F"]
[null,"2564.531/00149","SIGN PANELS TYPE D-SIGNAL SYS I","S F"]
[null,"2564.531/00151","SIGN PANELS TYPE EA","S F"]
[null,"2564.531/00158","SIGN PANELS TYPE EO","S F"]
[null,"2564.531/00159","SIGN PANELS TYPE EO (EXTRUDED)","S F"]
[null,"2564.531/00160","SIGN PANELS TYPE EO (LOUVERED)","S F"]
[null,"2564.531/00189","SIGN PANELS TYPE OVERLAY","S F","OL","APSTCLP"]
[null,"2564.531/00190","SIGN PANELS TYPE OH","S F","OL"]
[null,"2564.531/00191","SIGN PANELS TYPE OH (EXTRUDED)","S F"]
[null,"2564.531/00192","SIGN PANELS TYPE OH (LOUVERED)","S F"]
[null,"2564.531/00193","SIGN PANELS TYPE OH (FLAT SHEET)","S F"]
[null,"2564.533/00130","FURNISH SIGN PANELS TYPE C","S F"]
[null,"2564.533/00140","FURNISH SIGN PANELS TYPE D","S F"]
[null,"2564.533/00190","FURNISH SIGN PANELS TYPE OVERLAY","S F"]
[null,"2564.533/00195","FURNISH SIGN PANELS TYPE OH","S F"]
["x","2564.534/00010","SAW SIGN PANELS","L F"]
[null,"2564.534/00011","SAW SIGN PANELS TYPE A","L F","ASPNLSAW"]
[null,"2564.534/00016","SAW SIGN PANELS TYPE OH","L F"]
["x","2564.534/00017","SAW SIGN PANELS TYPE OH (EXTRUDED)","L F"]
["x","2564.535/00010","SIGN PANEL OVERLAY TYPE A","S F","ASPNLOL","APSTCLP","APSTMOD","OL"]
[null,"2564.535/00100","SIGN PANEL OVERLAY TYPE OH","S F","OL"]
[null,"2564.535/00110","SIGN PANEL OVERLAY TYPE EO","S F"]
[null,"2564.535/00120","SIGN PANEL OVERLAY TYPE EA","S F"]
[null,"2564.536/00010","INSTALL SIGN PANEL","EACH"]
["x","2564.536/00011","INSTALL SIGN PANEL TYPE A","EACH","ASPNLIN"]
["x","2564.536/00013","INSTALL SIGN PANEL TYPE C","EACH"]
[null,"2564.536/00014","INSTALL SIGN PANEL TYPE D","EACH"]
[null,"2564.536/00020","INSTALL SIGN PANEL TYPE OH","EACH"]
[null,"2564.536/00030","INSTALL SIGN PANEL TYPE EO","EACH"]
["x","2564.537/00010","INSTALL SIGN TYPE A","EACH","AS&IHP"]
["x","2564.537/00013","INSTALL SIGN TYPE C","EACH","CS&I","CINS"]
["x","2564.537/00014","INSTALL SIGN TYPE D","EACH","DS&I","DINS"]
[null,"2564.537/00020","INSTALL SIGN TYPE OH","EACH"]
[null,"2564.537/00021","INSTALL SIGN TYPE OH (BR MOUNT)","EACH"]
[null,"2564.537/00022","INSTALL SIGN TYPE CMS (BR MOUNT)","EACH"]
[null,"2564.537/00030","INSTALL SIGN TYPE SPECIAL","EACH"]
[null,"2564.537/00040","INSTALL SIGN TYPE EO","EACH"]
[null,"2564.537/00045","INSTALL SIGN TYPE EA","EACH"]
[null,"2564.538/00009","SIGN LEGEND REVISION","EACH"]
[null,"2564.538/00010","SIGN LEGEND REVISION TYPE EA","EACH"]
[null,"2564.538/00015","SIGN LEGEND REVISION TYPE EO","EACH"]
[null,"2564.538/00020","SIGN LEGEND REVISION TYPE OH","EACH"]
[null,"2564.538/00021","SIGN LEGEND REVISION TYPE OH-SPECIAL","EACH"]
[null,"2564.538/00031","SIGN LEGEND REVISION TYPE A","EACH","ALGNDREV"]
[null,"2564.538/00034","SIGN LEGEND REVISION TYPE D","EACH"]
[null,"2564.539/00010","OVERHEAD SIGN IDENTIFICATION PLATE","EACH"]
[null,"2564.540/00010","EXTEND WALKWAY SUPPORT","EACH"]
[null,"2564.540/00011","EXTEND WALKWAY SUPPORT (A)","EACH"]
[null,"2564.540/00012","EXTEND WALK SUPPORT (B)","EACH"]
["x","2564.550/00010","DELINEATOR","EACH","DELIN"]
["x","2564.550/00011","DELINEATOR TYPE SPECIAL","EACH","DELIN"]
["x","2564.550/00020","DELINEATOR TYPE ONE TENTH MILE","EACH","DELIN"]
["x","2564.550/00030","DELINEATOR TYPE CYLINDER STYLE","EACH","DELIN"]
["x","2564.550/00040","DELINEATOR TYPE ALIGNMENT","EACH","DELIN"]
["x","2564.550/00111","DELINEATOR TYPE X4-6","EACH","DELIN"]
["x","2564.551/00010","REFERENCE POST MARKER","EACH","RPM"]
["x","2564.552/00010","HAZARD MARKER X4-2","EACH","DELIN"]
["x","2564.553/00010","CLEARANCE MARKER X4-4","EACH","DELIN"]
["x","2564.554/00010","SNOW PLOW MARKER X4-5","EACH","DELIN"]
["x","2564.555/00010","END OF ROADWAY MARKER X4-11","EACH","DELIN"]
[null,"2564.601/00100","INTERNALLY LIT SIGNING OH","LS"]
[null,"2564.601/00101","INTERNALLY LIT SIGNING OH A","LS"]
[null,"2564.601/00102","INTERNALLY LIT SIGNING OH B","LS"]
[null,"2564.601/00103","INTERNALLY LIT SIGNING OH C","LS"]
[null,"2564.601/00104","INTERNALLY LIT SIGNING OH D","LS"]
[null,"2564.601/00105","INTERNALLY LIT SIGNING OH E","LS"]
[null,"2564.601/00106","INTERNALLY LIT SIGNING OH F","LS"]
[null,"2564.601/00107","INTERNALLY LIT SIGNING OH G","LS"]
[null,"2564.601/00108","INTERNALLY LIT SIGNING OH H","LS"]
[null,"2564.601/00109","INTERNALLY LIT SIGNING OH I","LS"]
[null,"2564.601/00110","INTERNALLY LIT SIGNING OH J","LS"]
[null,"2564.601/00111","INTERNALLY LIT SIGNING OH K","LS"]
[null,"2564.601/00112","INTERNALLY LIT SIGNING OH L","LS"]
[null,"2564.602/00001","INSTALL SIGN COLLAR","EACH"]
[null,"2564.602/00005","SIGN COLLAR","EACH"]
[null,"2564.602/00008","CONC PEDESTAL EXTENSION DES SPEC","EACH"]
["x","2564.602/00010","INSTALL DELINEATOR","EACH","DELS&I"]
[null,"2564.602/00015","INSTALL SIGN","EACH"]
[null,"2564.602/00018","INSTALL STEEL POST","EACH"]
[null,"2564.602/00023","SALV & INST WILDLIFE WARNING REFLECTER","EACH"]
[null,"2564.602/00024","SALVAGE AND INSTALL OH SIGNS","EACH"]
[null,"2564.602/00025","SALVAGE, MOD & REINSTALL OH SIGN","EACH"]
[null,"2564.602/00026","SALVAGE AND REINSTALL OH SIGN","EACH"]
[null,"2564.602/00027","SALVAGE, MOD & REINSTALL TYPE A SIGN","EACH",null,"ABASRM","AEXTSA","AEXTRM"]
[null,"2564.602/00031","FOUNDATION SPECIAL OH","EACH"]
[null,"2564.602/00033","MEDIAN SIGN POST ANCHOR","EACH"]
[null,"2564.602/00035","REPAIR SIGN TYPE OH","EACH"]
[null,"2564.602/00036","REPAIR SIGN TYPE OH","EACH"]
[null,"2564.602/00037","SHORTEN PANEL MOUNTING POST","EACH"]
[null,"2564.602/00038","SHORTEN TYPE A SIGN POST","EACH","APSTMOD"]
[null,"2564.602/00042","EXTEND TYPE A SIGN POST","EACH","APSTMOD"]
[null,"2564.602/00046","EXTEND PANEL MOUNTING POST","EACH"]
[null,"2564.602/00049","F&I TRAFFIC WARNING SIGN","EACH"]
[null,"2564.602/00050","F&I MESSAGE BOARD","EACH"]
[null,"2564.602/00055","MICROPRISM BARRIER REFLECTOR","EACH"]
[null,"2564.602/00077","SIGN POST SUPPORT","EACH"]
[null,"2564.602/00079","INSTALL SIGN SUPPORT","EACH"]
[null,"2564.602/00080","SIGN SUPPORT SIGN OH","EACH"]
[null,"2564.602/00082","REPOSITION SIGN PANEL TYPE OH","EACH"]
[null,"2564.602/00083","REPOSITION SIGN PANEL","EACH"]
[null,"2564.602/00087","SIGN SUPPORT CANTILEVER","EACH"]
[null,"2564.602/00100","HIGHWAY ADVISORY RADIO SIGN","EACH"]
[null,"2564.602/00115","MODIFY SIGN TYPE OH (BR MTD)","EACH"]
[null,"2564.602/00120","MODIFY SIGN TYPE OH","EACH"]
[null,"2564.602/00121","MODIFY SIGN TYPE OH A","EACH",null,"AEXTSA","AEXTRM"]
[null,"2564.602/00122","MODIFY SIGN TYPE OH B","EACH"]
[null,"2564.602/00123","MODIFY SIGN TYPE OH C","EACH"]
[null,"2564.602/00140","INSTALL SIGN TRUSS","EACH"]
[null,"2564.602/00141","INSTALL SIGN TRUSS TYPE OH","EACH"]
[null,"2564.602/00151","FEED POINT IDENTIFICATION PLATE","EACH"]
[null,"2564.602/00170","TRAFFIC SIGN WITH POST","EACH"]
[null,"2564.602/00240","FURNISH OH CHANGEABLE MESSAGE SIGN","EACH"]
[null,"2564.602/00250","INSTALL OH CHANGEABLE MESSAGE SIGN","EACH"]
[null,"2564.602/00251","PORTABLE CHANGEABLE MESSAGE SIGN","EACH"]
[null,"2564.602/00252","RELOCATE OH CHANGEABLE MESSAGE SIGN","EACH"]
[null,"2564.602/00253","OH CHANGEABLE MESSAGE SIGN","EACH"]
[null,"2564.602/00255","SKID MOUNTED CHANGEABLE MESSAGE SIGN","EACH"]
[null,"2564.602/00280","ADJUST SIGN STRUCTURE","EACH"]
[null,"2564.602/00290","REFURBISH SIGN","EACH"]
[null,"2564.602/00300","RELOCATE SIGN","EACH"]
[null,"2564.602/00301","RELOCATE SIGN TYPE A","EACH",null,"ABASRM"]
[null,"2564.602/00302","RELOCATE SIGN TYPE B","EACH"]
[null,"2564.602/00303","RELOCATE SIGN TYPE C","EACH"]
[null,"2564.602/00320","INSTALL SIGN TYPE SPECIAL","EACH"]
[null,"2564.602/00370","FURNISH DELINEATOR","EACH"]
[null,"2564.602/00390","FURNISH MILE POST MARKER","EACH"]
[null,"2564.602/00395","FURNISH MARKER","EACH"]
[null,"2564.602/00403","FURNISH TYPE C SIGN","EACH"]
[null,"2564.602/00450","FURNISH SIGN POSTS","EACH"]
[null,"2564.602/00490","FURNISH SIGN PANEL (RR CROSSBUCK)","EACH"]
[null,"2564.602/00491","FURNISH SIGN PANEL (RR CROSSBUCK) SPEC","EACH"]
[null,"2564.602/00493","FURNISH SIGN PANEL (STOP SIGN)","EACH"]
[null,"2564.602/00495","FURNISH SIGN PANEL (TRACK NUMBER SIGN)","EACH"]
[null,"2564.602/00496","F SIGN PANEL(TRACKS OUT OF SERVICE SIGN)","EACH"]
[null,"2564.602/00498","FURNISH SIGN PANEL (EXEMPT SIGN)","EACH"]
[null,"2564.602/00500","F&I SIGN PANEL (RR CROSSBUCK)","EACH"]
[null,"2564.602/00501","F&I SIGN PANEL (RR CROSSBUCK) SPECIAL","EACH"]
[null,"2564.602/00503","F&I SIGN PANEL (STOP SIGN)","EACH"]
[null,"2564.602/00505","F&I SIGN PANEL (TRACK NUMBER SIGN)","EACH"]
[null,"2564.602/00506","F&I SIGN PANEL (__MPH SIGN)","EACH"]
[null,"2564.602/00508","F&I SIGN PANEL (EXEMPT SIGN)","EACH"]
[null,"2564.602/00514","F&I WOOD POST 4\"X6\"X14'","EACH"]
[null,"2564.602/00516","F&I WOOD POST 4\"X6\"X16'","EACH"]
[null,"2564.602/00536","FURNISH WOOD POST 4\"X6\"X16'","EACH"]
[null,"2564.602/00539","FURNISH WOOD POST 4\"X6\"X19'","EACH"]
[null,"2564.602/00550","RETROREFLECTIVE MARKER","EACH"]
[null,"2564.602/00566","F&I WOOD POST 4\"X4\"X16'","EACH"]
[null,"2564.602/00568","F&I WOOD POST 4\"X4\"X18'","EACH"]
[null,"2564.602/00580","CONCRETE FOOTINGS DESIGN SPECIAL","EACH"]
[null,"2564.602/00602","F&I SIGN PANEL TYPE B","EACH"]
[null,"2564.602/00603","F&I SIGN PANEL TYPE C","EACH"]
[null,"2564.602/00604","F&I SIGN PANEL TYPE D","EACH"]
[null,"2564.602/00618","F&I SIGN PANEL TYPE R","EACH"]
[null,"2564.602/00619","F&I SIGN PANEL TYPE S","EACH"]
[null,"2564.602/00621","F&I SIGN PANEL TYPE U","EACH"]
[null,"2564.602/00630","F&I SIGN PANEL TYPE SPECIAL","EACH"]
[null,"2564.602/00700","INTERNALLY LIT SIGN","EACH"]
[null,"2564.602/00704","INTERNALLY LIT SIGN TYPE D","EACH"]
[null,"2564.602/00720","INSTALL MARKER","EACH","DELS&I"]
[null,"2564.602/00825","END OF ROADWAY MARKER X4-11","EACH"]
[null,"2564.603/00005","STRUCTURAL STEEL U-POST","L F"]
[null,"2564.608/00010","STRUCTURAL STEEL 2.5# U-POST","LB"]
[null,"2564.608/00012","STRUCTURAL STEEL 3# U-POST","LB"]
["x","2564.608/00020","FURNISH STRUCTURAL STEEL 2.5# U-POST","LB"]
["x","2564.608/00022","FURNISH STRUCTURAL STEEL 3# U-POST","LB"]
["x","2564.618/00019","SIGN PANELS TYPE OH","S F"]
["x","2564.618/00020","SIGN PANELS TYPE OVERLAY","S F"]
["x","2564.618/00023","SIGN PANELS TYPE C","S F"]
["x","2564.618/00024","SIGN PANELS TYPE D","S F"]
["x","2564.618/00030","F&I SIGN PANEL OVERLAYS TYPE A","S F"]
["x","2564.618/00031","F&I SIGN PANEL OVERLAYS TYPE OH","S F"]
["x","2564.618/00032","F&I SIGN PANEL OVERLAYS TYPE EA","S F"]
["x","2564.618/00033","F&I SIGN PANEL OVERLAYS TYPE EO","S F"]
[null,"2565.602/00310","R9-3A SIGN","EACH"]
[null,"2565.602/00315","R3-2 SIGN (36\"X36\")","EACH"]
[null,"2565.602/00387","R10-12 SIGN (36\"X48\")","EACH"]
[null,"2565.602/00390","R10-12 SIGN (24\"X30\")","EACH"]
["x","2564.541/00010","FRICTION FUSE","EACH","AFF"]
["x","2564.542/00010","KEEPER PLATE","EACH","AKP"]
[null,"9999.999/99999","OTHER?","EACH","AEXTRM","AEXTSA"]
[null,"9999.999/99999","OTHER?","EACH","ANOTES"]
[]
[null,null,"AREM","NOTES"]
[null,null,"DREM","NOTES"]
[null,null,"CREM","COMMENTED OUT"]
[null,null,"DMS&I","NOTES"]

{"sheet":"SIGN CODES","index":10,"n_rows":640,"n_cols":3,"rows_kept":640,"cut":false,"hidden":false,"merged":[]}
["CODE\nNO","PANEL LEGEND","NOTES"]
["D10-1","MILE X"]
["D10-2","MILE XX"]
["D10-3","MILE XXX"]
["D10-4","ENHANCED REFERENCE LOCATION"]
["D10-5","INTERMEDIATE ENHANCED REFERENCE LOCATION"]
["D11-1","BIKE ROUTE"]
["D12-2M","CAR POOL INFO"]
["D12-4","EMERGENCY CALL 911"]
["D12-5a","TRAVEL INFO CALL 511"]
["D13-3M","FREEWAY ENTRANCE"]
["D17-2","TRUCK LANE XX MILES"]
["D18-X1","ALTERNATE FUELS CORRIDOR"]
["D18-X1P","EV-CHARGING PLAQUE"]
["D1-X1DH","FRONTAGE ROAD DOUBLE ARROW"]
["D1-X1L","FRONTAGE ROAD LEFT"]
["D1-X1R","FRONTAGE ROAD RIGHT"]
["D4-1L","PARKING LEFT"]
["D4-1R","PARKING RIGHT"]
["D4-2L","PARK - RIDE LEFT"]
["D4-2M","PARK - RIDE"]
["D4-2R","PARK - RIDE RIGHT"]
["D5-1","REST AREA XX MILES"]
["D5-1a","REST AREA NEXT RIGHT"]
["D5-1M","REST AREA XX MILES NEXT REST AREA XX MILES"]
["D5-2","REST AREA 45 DEG ARROW"]
["D5-2a","REST AREA 45 DEG ARROW"]
["D5-6","NEXT REST AREA XX MILES"]
["D5-X1L","WAYSIDE REST XX MILES ON LEFT"]
["D5-X1R","WAYSIDE REST XX MILES ON RIGHT"]
["D5-X2L","WAYSIDE REST LEFT"]
["D5-X2R","WAYSIDE REST RIGHT"]
["D6-2ML","SCENIC OVERLOOK XX MILES ON LEFT"]
["D6-2MR","SCENIC OVERLOOK XX MILES ON RIGHT"]
["D6-3ML","SCENIC OVERLOOK LEFT"]
["D6-3MR","SCENIC OVERLOOK RIGHT"]
["D7-X10aL","PARK NAME CANOE LAUNCH XX MILES LEFT"]
["D7-X10aR","PARK NAME CANOE LAUNCH XX MILES RIGHT"]
["D7-X10L","PARK NAME BOAT LAUNCH XX MILES LEFT"]
["D7-X10R","PARK NAME BOAT LAUNCH XX MILES RIGHT"]
["D7-X11L","CITY PARK LEFT"]
["D7-X11R","CITY PARK RIGHT"]
["D7-X11T","CITY PARK AHEAD"]
["D7-X12aL","COUNTY PARK XX MILES LEFT"]
["D7-X12aR","COUNTY PARK XX MILES RIGHT"]
["D7-X12L","COUNTY PARK LEFT"]
["D7-X12R","COUNTY PARK RIGHT"]
["D7-X12T","COUNTY PARK AHEAD"]
["D7-X13L","STATE PARK LEFT"]
["D7-X13R","STATE PARK RIGHT"]
["D7-X13T","STATE PARK AHEAD"]
["D7-X14L","PICNIC GROUNDS LEFT"]
["D7-X14R","PICNIC GROUNDS RIGHT"]
["D7-X14L","PICNIC GROUNDS AHEAD"]
["D7-X15L","COUNTY MUSEUM LEFT"]
["D7-X15R","COUNTY MUSEUM RIGHT"]
["D7-X15T","COUNTY MUSEUM AHEAD"]
["D7-X16L","GOLF COURSE LEFT"]
["D7-X16R","GOLF COURSE RIGHT"]
["D7-X16T","GOLF COURSE AHEAD"]
["D7-X17L","DISC GOLF COURSE LEFT"]
["D7-X17R","DISC GOLF COURSE RIGHT"]
["D7-X17T","DISC GOLF COURSE AHEAD"]
["D7-X18L","COUNTY FAIRGROUND LEFT"]
["D7-X18R","COUNTY FAIRGROUND RIGHT"]
["D7-X18T","COUNTY FAIRGROUND AHEAD"]
["D7-X19L","HIGH SCHOOL LEFT"]
["D7-X19R","HIGH SCHOOL RIGHT"]
["D7-X19T","HIGH SCHOOL AHEAD"]
["D7-X1L","GEOLOGICAL MARKER XX MILES ON LEFT"]
["D7-X1R","GEOLOGICAL MARKER XX MILES ON RIGHT"]
["D7-X20L","INDUSTRIAL PARK LEFT"]
["D7-X20R","INDUSTRIAL PARK RIGHT"]
["D7-X20T","INDUSTRIAL PARK AHEAD"]
["D7-X21L","CAREERFORCE CENTER LEFT"]
["D7-X21R","CAREERFORCE CENTER RIGHT"]
["D7-X21T","CAREERFORCE CENTER AHEAD"]
["D7-X22L","DOWNTOWN LEFT"]
["D7-X22R","DOWNTOWN RIGHT"]
["D7-X22T","DOWNTOWN AHEAD"]
["D7-X23L","BUSINESS DISTRICT LEFT"]
["D7-X23R","BUSINESS DISTRICT RIGHT"]
["D7-X24L","TOWN HALL LEFT"]
["D7-X24R","TOWN HALL RIGHT"]
["D7-X25L","AIRPORT LEFT"]
["D7-X25R","AIRPORT RIGHT"]
["D7-X26L","RECYCLING CENTER LEFT"]
["D7-X26R","RECYCLING CENTER RIGHT"]
["D7-X27L","SANITARY LANDFILL LEFT"]
["D7-X27R","SANITARY LANDFILL RIGHT"]
["D7-X28L","SOLID WASTE TRANSFER STATION LEFT"]
["D7-X28R","SOLID WASTE TRANSFER STATION RIGHT"]
["D7-X29L","DEMOLITION LANDFILL LEFT"]
["D7-X29R","DEMOLITION LANDFILL RIGHT"]
["D7-X29T","DEMOLITION LANDFILL AHEAD"]
["D7-X2L","GEOLOGICAL MARKER LEFT"]
["D7-X2R","GEOLOGICAL MARKER RIGHT"]
["D7-X3","GEOLOGICAL MARKER"]
["D7-X4","HISTORICAL MARKER"]
["D7-X5L","HISTORICAL MARKER XX MILES ON LEFT"]
["D7-X5R","HISTORICAL MARKER XX MILES ON RIGHT"]
["D7-X6L","HISTORICAL MARKER LEFT"]
["D7-X6R","HISTORICAL MARKER RIGHT"]
["D7-X7L","HISTORIC SITE XX MILES ON LEFT"]
["D7-X7R","HISTORIC SITE XX MILES ON RIGHT"]
["D7-X8L","HISTORIC SITE LEFT"]
["D7-X8R","HISTORIC SITE RIGHT"]
["D7-X8T","HISTORIC SITE AHEAD"]
["D7-X9L","HISTORIC DISTRICT LEFT"]
["D7-X9R","HISTORIC DISTRICT RIGHT"]
["D7-X9T","HISTORIC DISTRICT AHEAD"]
["D8-1","WEIGH STATION XX MILES"]
["D8-2M","WEIGH STATION NEXT RIGHT"]
["D8-3","WEIGH STATION 45 DEG ARROW"]
["D8-3ML","WEIGH STATION LEFT"]
["D8-3MR","WEIGH STATION RIGHT"]
["D9-1","PHONE"]
["D9-10ML","TOURIST INFO LEFT"]
["D9-10MR","TOURIST INFO RIGHT"]
["D9-16","TRUCK PARKING"]
["D9-18cMaL","HOSPITAL XX MILES LEFT"]
["D9-18cMaR","HOSPITAL XX MILES RIGHT"]
["D9-18cMbL","GAS LEFT"]
["D9-18cMbR","GAS RIGHT"]
["D9-18cMbRL","GAS RIGHT AND LEFT"]
["D9-18cMcL","FOOD LEFT"]
["D9-18cMcR","FOOD RIGHT"]
["D9-18cMcRL","FOOD RIGHT AND LEFT"]
["D9-18cMdL","LODGING LEFT"]
["D9-18cMdR","LODGING RIGHT"]
["D9-18cMdRL","LODGING RIGHT AND LEFT"]
["D9-18cMeL","HOSPITAL LEFT"]
["D9-18cMeR","HOSPITAL RIGHT"]
["D9-18cMfL","CAMPING LEFT"]
["D9-18cMfR","CAMPING RIGHT"]
["D9-18cMfRL","CAMPING RIGHT AND LEFT"]
["D9-18cMgL","DIESEL LEFT"]
["D9-18cMgR","DIESEL RIGHT"]
["D9-18cMgRL","DIESEL RIGHT AND LEFT"]
["D9-18cMhL","LP-GAS LEFT"]
["D9-18cMhR","LP-GAS RIGHT"]
["D9-18cMhRL","LP-GAS RIGHT AND LEFT"]
["D9-18cMiL","E85 LEFT"]
["D9-18cMiR","E85 RIGHT"]
["D9-18cMiRL","E85 RIGHT AND LEFT"]
["D9-18cMjL","EV-CHARGING LEFT"]
["D9-18cMjR","EV-CHARGING RIGHT"]
["D9-2","HOSPITAL"]
["D9-21","PHONE TTY"]
["D9-2MaALTL","HOSPITAL XX BLKS ADVANCED LEFT"]
["D9-2MaALTR","HOSPITAL XX BLKS ADVANCED RIGHT"]
["D9-2MaL","HOSPITAL XX BLKS LEFT"]
["D9-2MaR","HOSPITAL XX BLKS RIGHT"]
["D9-2MaT","HOSPITAL XX BLKS AHEAD"]
["D9-2MbL","HOSPITAL LEFT"]
["D9-2MbR","HOSPITAL RIGHT"]
["D9-6","HANDICAPED"]
["D9-6P","VAN ACCESSIBLE PLAQUE"]
["D9-X1L","HANDICAP LEFT"]
["D9-X1R","HANDICAP RIGHT"]
["D9-X3L","RESORTS LEFT"]
["D9-X3R","RESORTS RIGHT"]
["D9-X3RL","RESORTS RIGHT AND LEFT"]
["D9-X4L","CAMPING LEFT"]
["D9-X4R","CAMPING RIGHT"]
["D9-X4RL","CAMPING RIGHT AND LEFT"]
["E13-1P","XX MPH PLAQUE"]
["E5-1","EXIT XX DEG ARROW"]
["E5-1a","EXIT X XX DEG ARROW"]
["E5-1aM","EXIT XX XX DEG ARROW"]
["I-11","RECYCLING COLLECTION CENTER"]
["I-12","LIGHT RAIL TRANSIT STATION"]
["I2-X1","MINNESOTA ENTRANCE SIGN"]
["I2-X2","MINNESOTA EXIT SIGN"]
["I-5","AIRPORT"]
["I-6","BUS STATION"]
["I-7","TRAIN STATION"]
["I-8","LIBRARY"]
["M1-1","INTERSTATE XX"]
["M1-10","EISENHOWER INTERSTATE SYSTEM"]
["M1-2","INTERSTATE XX BUSINESS LOOP"]
["M1-3","INTERSTATE XX BUSINESS SPUR"]
["M1-4","US XX"]
["M1-4M","US XX BUSINESS"]
["M1-5M","MINNESOTA HWY XX"]
["M1-5Ma","MINNESOTA HWY XX BUSINESS"]
["M1-6M","XX COUNTY XX"]
["M1-9M","MISSISSIPPI RIVER TRAIL"]
["M1-X4","XX COUNTY XX"]
["M1-X5","TOWNSHIP XX"]
["M2-1","JCT (COLOR)"]
["M3-1","NORTH (COLOR)"]
["M3-2","EAST (COLOR)"]
["M3-3","SOUTH (COLOR)"]
["M3-4","WEST (COLOR)"]
["M4-14","BEGIN (COLOR)"]
["M4-1a","ALT (COLOR)"]
["M4-3","BUSINESS (COLOR)"]
["M4-4","TRUCK"]
["M4-5","TO (COLOR)"]
["M4-6","END (COLOR)"]
["M4-7","TEMPORARY (COLOR)"]
["M4-X1","OLD (COLOR)"]
["M4-X2","ALTERNATE ROUTE TO"]
["M5-1L","ADVANCE TURN LEFT (COLOR)"]
["M5-1R","ADVANCE TURN RIGHT (COLOR)"]
["M5-2L","ADVANCE TURN 45° LEFT (COLOR)"]
["M5-2R","ADVANCE TURN 45° RIGHT (COLOR)"]
["M5-3","CURVED STEM (COLOR)"]
["M5-4","LEFT LANE (COLOR)"]
["M5-5","CENTER LANE (COLOR)"]
["M5-6","RIGHT LANE (COLOR)"]
["M6-1","ARROW (COLOR)"]
["M6-1L","ARROW LEFT (COLOR)"]
["M6-1R","ARROW RIGHT (COLOR)"]
["M6-2L","ARROW LEFT (COLOR)"]
["M6-2R","ARROW RIGHT (COLOR)"]
["M6-3","ARROW UP (COLOR)"]
["M6-4","DOUBLE ARROW (COLOR)"]
["M6-5L","DOUBLE ARROW 45° LEFT (COLOR)"]
["M6-5R","DOUBLE ARROW 45° RIGHT (COLOR)"]
["M6-6L","ARROW UP LEFT (COLOR)"]
["M6-6R","ARROW UP RIGHT (COLOR)"]
["M6-7L","ARROW UP 45° LEFT (COLOR)"]
["M6-7R","ARROW UP 45° RIGHT (COLOR)"]
["M6-X2","U TURN (COLOR)"]
["OM1-2","TYPE 1 OBJECT MARKER"]
["OM2-2V","TYPE 2 OBJECT MARKER"]
["OM3-C","TYPE 3 OBJECT MARKER CENTER"]
["OM3-L","TYPE 3 OBJECT MARKER LEFT"]
["OM3-R","TYPE 3 OBJECT MARKER RIGHT"]
["OM4-2","TYPE 4 OBJECT MARKER"]
["R10-10L","LEFT TURN SIGNAL"]
["R10-10R","RIGHT TURN SIGNAL"]
["R10-11b","NO TURN ON RED"]
["R10-11c","NO TURN ON RED EXCEPT FROM RIGHT LANE"]
["R10-12","LEFT TURN YIELD ON GREEN BALL"]
["R10-15ML","LEFT TURNING VEHICLES STOP FOR PEDS"]
["R10-15MR","RIGHT TURNING VEHICLES STOP FOR PEDS"]
["R10-16","U-TURN YIELD TO RIGHT TURN"]
["R10-6L","STOP HERE ON RED LEFT"]
["R10-6R","STOP HERE ON RED RIGHT"]
["R10-7","DO NOT BLOCK INTERSECTION"]
["R10-7M","DO NOT BLOCK CROSSWALK"]
["R10-X12","LEFT TURN YIELD ON FLASHING YELLOW ARROW"]
["R10-X13","U-TURN YIELD ON FLASHING YELLOW ARROW"]
["R10-X6","1 CAR ON GREEN"]
["R10-X7","FORM TWO LANES WHEN METERED"]
["R1-1","STOP"]
["R1-2","YIELD"]
["R12-1M","BRIDGE WEIGHT LIMIT XX TONS"]
["R12-2","AXLE WEIGHT LIMIT XX TONS"]
["R12-5","WEIGHT LIMIT XXT, XXT, XXT"]
["R12-5M","WEIGHT LIMIT XXT"]
["R1-2aP","TO ONCOMING TRAFFIC PLAQUE"]
["R12-X11","PERMIT WEIGHT LIMIT XXT"]
["R12-X1P","BRIDGE PLAQUE"]
["R12-X1Pa","XX MILES PLAQUE"]
["R12-X2","RESTRICTED BRIDGE XX MILES LIMIT XX TONS"]
["R12-X2a","RESTRICTED BRIDGE XX MILES LIMIT XX TONS"]
["R12-X3","TRUCKS MUST NOT MEET ON BRIDGE"]
["R12-X3a","VEHICLES MUST NOT MEET ON BRIDGE"]
["R12-X4","RESTR BRIDGE XX MILES LIMIT XX TONS CLEAR XXFT XXIN "]
["R12-X4a","RESTRICTED BRIDGE XX MILES CLEARANCE XXFT XXIN"]
["R12-X5","VEHICLES OVER XX TONS USE TRUCK DETOUR"]
["R1-3P","ALL WAY PLAQUE"]
["R13-X1","TRUCKS OVER 10,000 LBS MUST ENTER WEIGH STA"]
["R14-1","TRUCK ROUTE"]
["R15-3P","EXEMPT PLAQUE"]
["R15-7","DIVIDED HIGHWAY WITH RAILS"]
["R15-7a","DIVIDED HIGHWAY WITH RAILS TEE INTERSECTION"]
["R1-5bL","STOP HERE FOR PED SYMBOL LEFT"]
["R1-5bR","STOP HERE FOR PED SYMBOL RIGHT"]
["R16-1","SEAT BELT FASTENED"]
["R16-1M","STATE LAW SEAT BELT"]
["R16-4","FENDER BENDER MOVE VEHICLES"]
["R1-6a","STATE LAW STOP FOR PED W/I X-WALK"]
["R1-6c","STATE LAW STOP FOR PED W/I X-WALK"]
["R16-X10","NO FISHING FROM BRIDGE"]
["R16-X13","VEHICLE NOISE LAWS ENFORCED"]
["R16-X15","STATE LAW MOVE OVER"]
["R16-X16","DO NOT CROSS DOUBLE WHITE LINE"]
["R16-X17","STATE LAW PHONE USE HANDS-FREE"]
["R16-X2","STATE LAW TRUCKS MUST MAINTAIN 500 FOOT"]
["R16-X3","$1000 FINE FOR LITTERING"]
["R16-X40","PARKING RESTRICTIONS COMMERCIAL VEHICLES"]
["R16-X5P","STATE LAW PLAQUE"]
["R1-9a","STATE LAW STOP FOR PEDESTRIANS"]
["R1-X1","STOP FOR PED IN CROSSWALK"]
["R1-X3P","TAKE TURNS"]
["R2-1","SPEED LIMIT XX"]
["R2-4a","SPEED LIMIT XX MINIMUM XX"]
["R3-1","NO RIGHT TURN"]
["R3-17","BIKE LANE"]
["R3-17aP","AHEAD PLAQUE"]
["R3-17bP","ENDS PLAQUE"]
["R3-18","NO LEFT NO U-TURN"]
["R3-2","NO LEFT TURN"]
["R3-27","NO THROUGH TRAFFIC"]
["R3-3","NO TURNS"]
["R3-33","RIGHT LANE MUST EXIT"]
["R3-33ML","LEFT LANE MUST EXIT"]
["R3-33MR","RIGHT LANE MUST EXIT"]
["R3-4","NO U-TURN"]
["R3-4M","NO U-TURN RIGHT"]
["R3-5a","THRU ONLY"]
["R3-5L","LEFT ONLY"]
["R3-5R","RIGHT ONLY"]
["R3-6L","THRU-LEFT"]
["R3-6R","THRU-RIGHT"]
["R3-7L","LEFT LANE MUST TURN LEFT"]
["R3-7ML","ALL TRAFFIC MUST TURN LEFT"]
["R3-7MR","ALL TRAFFIC MUST TURN RIGHT"]
["R3-7R","RIGHT LANE MUST TURN RIGHT"]
["R3-8AA","L-R"]
["R3-8AB","L-L"]
["R3-8ABC","L-L-T"]
["R3-8ABCA","L-L-T-R"]
["R3-8ABCD","L-L-T-TR"]
["R3-8ABD","L-L-TR"]
["R3-8ABLA","L-L-R"]
["R3-8ABRA","L-R-R"]
["R3-8AC","L-T"]
["R3-8ACA","L-T-R"]
["R3-8ACC","L-T-T"]
["R3-8ACCA","L-T-T-R"]
["R3-8ACD","L-T-TR"]
["R3-8AD","L-TR"]
["R3-8AE","L-LT"]
["R3-8AEBA","L-LT-R-R"]
["R3-8AEC","L-LT-T"]
["R3-8AECA","L-LT-T-R"]
["R3-8AELA","L-LT-R"]
["R3-8AERA","L-TR-R"]
["R3-8AF","L-LR"]
["R3-8AG","L-LTR"]
["R3-8AHA","L-LR-R"]
["R3-8AJA","L-LTR-R"]
["R3-8BA","R-R"]
["R3-8CA","T-R"]
["R3-8CCA","T-T-R"]
["R3-8CCBA","T-T-R-R"]
["R3-8CD","T-TR"]
["R3-8CEA","T-TR-R"]
["R3-8DA","LT-R"]
["R3-8DCA","LT-T-R"]
["R3-8EA","TR-R"]
["R3-8EE","LT-TR"]
["R3-8FA","LR-R"]
["R3-8GA","LTR-R"]
["R3-8H","LR"]
["R3-8KD","ROUNDABOUT L-TR"]
["R3-8KG","ROUNDABOUT L-LTR"]
["R3-8LA","ROUNDABOUT LT-R"]
["R3-8LE","ROUNDABOUT LT-TR"]
["R3-8MA","ROUNDABOUT LTR-R"]
["R3-9b","TWO WAY LEFT TURN LANE"]
["R3-9cP","BEGIN PLAQUE"]
["R3-9dP","END PLAQUE"]
["R3-X3L","DIAMOND RAMP CAR POOL LEFT"]
["R3-X3R","DIAMOND RAMP CAR POOL RIGHT"]
["R3-X5","U TURN"]
["R3-5Xa","LEFT TURN U TURN"]
["R4-1","DO NOT PASS"]
["R4-11","BIKES MAY USE FULL LANE"]
["R4-17","DO NOT DRIVE ON SHOULDER"]
["R4-2","PASS WITH CARE"]
["R4-3","SLOWER TRAFFIC KEEP RIGHT"]
["R4-3M","SLOWER TRAFFIC KEEP RIGHT"]
["R4-4","BEGIN RIGHT TURN LANE ARROW YIELD TO BIKES"]
["R4-5","TRUCKS USE RIGHT LANE"]
["R4-7","KEEP RIGHT"]
["R4-7c","NARROW KEEP RIGHT"]
["R4-8","KEEP LEFT"]
["R4-8c","NARROW KEEP LEFT"]
["R4-X1","THRU TRAFFIC KEEP RIGHT"]
["R4-X4","TRUCK STOPPING LANE"]
["R4-X6","PASSING LANE X MILE(S) AHEAD"]
["R4-X7","SHOULDER AUTHORIZED BUSES ONLY"]
["R4-X7P","END OR BEGIN PLAQUE"]
["R4-X8","BYPASS LANE"]
["R4-X8a","BYPASS AND TURN LANE"]
["R5-1","DO NOT ENTER"]
["R5-10aM","PEDS PROHIBITED"]
["R5-1a","WRONG WAY"]
["R5-2","NO TRUCKS"]
["R5-3","NO MOTOR VEHICLES"]
["R5-6","NO BICYCLES"]
["R5-X1","NO SNOWMOBILES"]
["R5-X2","STATE PROPERTY KEEP OFF OR OUT"]
["R5-X3","NO TRESSPASSING/CROSSING/ETC."]
["R5-X4","NO THRU TRAFFIC"]
["R5-X5","PROHIBITED VEHICLES"]
["R6-1L","ONE WAY LEFT"]
["R6-1R","ONE WAY RIGHT"]
["R6-2L","ONE WAY LEFT"]
["R6-2R","ONE WAY RIGHT"]
["R6-3","DIVIDED HIGHWAY"]
["R6-3a","DIVIDED HIGHWAY TEE INTERSECTION"]
["R6-4","ROUNDABOUT DIRECTIONAL (2 ARROWS)"]
["R6-4a","ROUNDABOUT DIRECTIONAL (3 ARROWS)"]
["R6-4b","ROUNDABOUT DIRECTIONAL (4 ARROWS)"]
["R6-6","BEGIN ONE WAY"]
["R6-7","END ONE WAY"]
["R7-108","15 MIN PARKING"]
["R7-8bP","VAN ACCESSIBLE PLAQUE"]
["R7-8M","DISABLED PARKING (WITH SYMBOL)"]
["R7-X2","NO TRUCK PARKING"]
["R8-3","NO PARKING"]
["R8-3dP","ON BRIDGE PLAQUE"]
["R8-3PM","BETWEEN SIGNS PLAQUE"]
["R8-3PMa","10 PM TO 6 AM"]
["R8-41","PARK & RIDE PARKING ONLY"]
["R8-7","EMERGENCY STOPPING ONLY"]
["R8-7M","EMERGENCY STOPPING ONLY PEDS PROHIBITED"]
["R8-8","DO NOT STOP ON TRACKS"]
["R9-3","NO PEDESTRIANS"]
["R9-5","BIKES USE PED SIGNAL"]
["R9-6","BIKES YIELD TO PEDS"]
["R9-7L","KEEP LEFT PEDS"]
["R9-7R","KEEP RIGHT PEDS"]
["R9-X1","BIKES USE SHOULDER"]
["S1-1","SCHOOL XING"]
["S3-1","SCHOOL BUS STOP AHEAD"]
["S3-2M","SCHOOL BUS TURN AROUND"]
["S3-X1","SCHOOL BUS LOADING AREA"]
["S4-1P","XX-XX AM XX-XX PM PLAQUE"]
["S4-2P","WHEN CHILDREN ARE PRESENT PLAQUE"]
["S4-3P","SCHOOL PLAQUE"]
["S4-4P","WHEN FLASHING PLAQUE"]
["S4-5","SCHOOL ZONE AHEAD SPEED LIMIT XX"]
["S4-6P","MON-FRI PLAQUE"]
["S4-7P","ALL YEAR PLAQUE"]
["S5-1","SCHOOL SPEED LIMIT XX WHEN FLASHING"]
["S5-2","END SCHOOL ZONE"]
["S5-3","END SCHOOL SPEED LIMIT"]
["W10-1","RR ADVANCE WARNING"]
["W10-11","LOW STORAGE SPACE"]
["W10-11a","XX FEET BETWEEN TRACKS & HIGHWAY"]
["W10-11b","XX FEET BETWEEN HIGHWAY & TRACK BEHIND YOU"]
["W10-12L","ANGLED RR CROSSING LEFT"]
["W10-12R","ANGLED RR CROSSING RIGHT"]
["W10-1aP","EXEMPT PLAQUE"]
["W10-2L","RR PARALLEL TRACKS LEFT INTERSECTION"]
["W10-2R","RR PARALLEL TRACKS RIGHTINTERSECTION"]
["W10-3L","RR PARALLEL TRACKS LEFT TEE INTERSECTION"]
["W10-3R","RR PARALLEL TRACKS RIGHT TEE INTERSECTION"]
["W10-4L","TEE INTERSECTION RR PARALLEL TRACKS LEFT"]
["W10-4R","TEE INTERSECTION RR PARALLEL TRACKS RIGHT"]
["W10-5","LOW GROUND CLEARANCE RR X-ING"]
["W10-5P","LOW GROUND CLEARANCE PLAQUE"]
["W10-9","NO TRAIN HORN"]
["W10-9P","NO TRAIN HORN PLAQUE"]
["W10-X3","LOOK FOR TRAINS"]
["W1-10aL","CURVE LEFT WITH INTERSECTION"]
["W1-10aR","CURVE RIGHT WITH INTERSECTION"]
["W1-10bL","CURVE LEFT WITH STRAIGHT ON INTERSECTION"]
["W1-10bR","CURVE RIGHT WITH STRAIGHT ON INTERSECTION"]
["W1-10cL","CURVE LEFT WITH TANGENT INTERSECTION"]
["W1-10cR","CURVE RIGHT WITH TANGENT INTERSECTION"]
["W1-10dL","REVERSE CURVE LEFT WITH TEE INTERSECTION"]
["W1-10dR","REVERSE CURVE RIGHT WITH TEE INTERSECTION"]
["W1-10eL","REVERSE CURVE LEFT WITH INTERSECTION"]
["W1-10eR","REVERSE CURVE RIGHT WITH INTERSECTION"]
["W1-10L","CURVE LEFT WITH TEE INTERSECTION"]
["W1-10R","CURVE RIGHT WITH TEE INTERSECTION"]
["W11-1","BICYCLE CROSSING"]
["W11-10","TRUCK CROSSING"]
["W11-14","HORSE-DRAWN VEHICLE"]
["W11-15","COMBINED BICYCLE/PEDESTRIAN CROSSING"]
["W11-15a","TRAIL CROSSING"]
["W11-15P","TRAIL CROSSING PLAQUE"]
["W1-11L","HAIRPIN TURN LEFT"]
["W1-11R","HAIRPIN TURN RIGHT"]
["W11-2","PEDESTRIAN CROSSING"]
["W11-3","DEER CROSSING"]
["W1-13L","TRUCK ROLLOVER CURVE LEFT"]
["W1-13R","TRUCK ROLLOVER CURVE RIGHT"]
["W11-4","CATTLE CROSSING"]
["W11-5","FARM MACHINERY"]
["W1-15L","270 DEGREE LOOP LEFT"]
["W1-15R","270 DEGREE LOOP RIGHT"]
["W11-6","SNOWMOBILE CROSSING"]
["W11-7","EQUESTRIAN CROSSING"]
["W11-8","FIRE STATION"]
["W11-9","DISABLED CROSSING"]
["W1-1aL","SHARP CURVE LEFT WITH SPEED LIMIT XX"]
["W1-1aR","SHARP CURVE RIGHT WITH SPEED LIMIT XX"]
["W1-1L","SHARP CURVE LEFT"]
["W1-1R","SHARP CURVE RIGHT"]
["W11-X3","TRUCKS ENTERING"]
["W12-1","DOUBLE ARROW"]
["W12-2","LOW CLEARANCE XX'-X\""]
["W12-2a","XXFT XXIN"]
["W1-2aL","CURVE LEFT WITH SPEED LIMIT XX"]
["W1-2aR","CURVE RIGHT WITH SPEED LIMIT XX"]
["W1-2L","CURVE LEFT"]
["W1-2R","CURVE RIGHT"]
["W13-1P","XX MPH PLAQUE"]
["W13-2","EXIT XX MPH"]
["W13-3","RAMP XX MPH"]
["W13-6","EXIT LOOP XX MPH"]
["W13-7","RAMP LOOP XX MPH"]
["W1-3L","REVERSE SHARP CURVE LEFT"]
["W1-3R","REVERSE SHARP CURVE RIGHT"]
["W14-1","DEAD END"]
["W14-2","NO OUTLET"]
["W14-3","NO PASSING ZONE"]
["W1-4L","REVERSE CURVE LEFT"]
["W1-4R","REVERSE CURVE RIGHT"]
["W14-X10","BUS ON SHOULDER WARNING (SYMBOL)"]
["W14-X2","WATCH FOR SLOW TRAFFIC"]
["W14-X9","WATCH FOR BUSES ON SHOULDER"]
["W15-1","PLAYGROUND"]
["W1-5L","WINDING ROAD LEFT"]
["W1-5R","WINDING ROAD RIGHT"]
["W1-6","ONE DIRECTION ARROW"]
["W16-1AP","SHARE THE ROAD PLAQUE"]
["W16-13P","WHEN FLASHING PLAQUE"]
["W16-15P","NEW PLAQUE"]
["W16-17P","ROUNDABOUT PLAQUE"]
["W16-2P","XX FEET PLAQUE"]
["W16-3P","XX MILES PLAQUE"]
["W16-4P","NEXT XX FT PLAQUE"]
["W16-5PL","LEFT ARROW PLAQUE"]
["W16-5PR","RIGHT ARROW PLAQUE"]
["W16-6PL","ADVANCED LEFT TURN PLAQUE"]
["W16-6PR","ADVANCED RIGHT TURN PLAQUE"]
["W16-7PL","DOWN ARROW LEFT PLAQUE"]
["W16-7PR","DOWN ARROW RIGHT PLAQUE"]
["W16-8aP","LEFT STREET STREET RIGHT PLAQUE"]
["W16-8P","STREET NAME PLAQUE"]
["W16-9P","AHEAD PLAQUE"]
["W1-7","DOUBLE ARROW"]
["W1-8","CHEVRON"]
["W19-1","FREEWAY ENDS XX MILES"]
["W19-2","EXPRESSWAY ENDS XX MILES"]
["W19-5","ALL TRAFFIC MUST EXIT"]
["W20-X3L","MERGE LEFT"]
["W20-X3R","MERGE RIGHT"]
["W2-1","CROSS ROAD"]
["W2-2L","SIDE ROAD LEFT"]
["W2-2R","SIDE ROAD RIGHT"]
["W23-2","NEW TRAFFIC PATTERN AHEAD"]
["W2-3L","SIDE ROAD 45° LEFT"]
["W2-3R","SIDE ROAD 45° RIGHT"]
["W2-4","T INTERSECTION"]
["W2-5","Y INTERSECTION"]
["W2-6","ROUNDABOUT"]
["W2-7L","OFFSET INTERSECTION LEFT FIRST"]
["W2-7R","OFFSET INTERSECTION RIGHT FIRST"]
["W2-8L","TWO SIDE ROADS LEFT"]
["W2-8R","TWO SIDE ROADS RIGHT"]
["W2-X12","HIDDEN ENTRANCE"]
["W3-1","STOP AHEAD"]
["W3-2","YIELD AHEAD"]
["W3-3","SIGNAL AHEAD"]
["W3-5","SPEED REDUCTION XX"]
["W3-7","RAMP METER AHEAD"]
["W3-8","RAMP METERED WHEN FLASHING"]
["W3-X4","PREPARE TO STOP WHEN FLASHING"]
["W3-X5","TRAFFIC CONTROL CHANGE AHEAD"]
["W3-X6","ROAD CLOSED WHEN FLASHING"]
["W3-X8","ENTERING TRAFFIC WHEN FLASHING"]
["W3-X8a","ENTERING TRAFFIC"]
["W3-X8b","TRAFFIC APPROACHING"]
["W4-1L","MERGE LEFT"]
["W4-1R","MERGE RIGHT"]
["W4-2L","LANE REDUCTION LEFT"]
["W4-2R","LANE REDUCTION RIGHT"]
["W4-3L","ADDED LANE LEFT"]
["W4-3R","ADDED LANE RIGHT"]
["W4-4P","CROSS TRAFFIC DOES NOT STOP PLAQUE"]
["W4-4aPL","TRAFFIC FROM LEFT DOES NOT STOP PLAQUE"]
["W4-4aPR","TRAFFIC FROM RIGHT DOES NOT STOP PLAQUE"]
["W4-4bP","ONCOMING TRAFFIC DOES NOT STOP PLAQUE"]
["W4-5","MERGE ON CURVE"]
["W4-5P","NO MERGE AREA PLAQUE"]
["W4-6","ADDED LANE ON CURVE"]
["W4-X1L","TRAFFIC MERGING FROM LEFT"]
["W4-X1R","TRAFFIC MERGING FROM RIGHT"]
["W5-1","ROAD NARROWS"]
["W5-2","NARROW BRIDGE"]
["W5-4","RAMP NARROWS"]
["W5-4A","PATH NARROWS"]
["W5-X1","SHOULDER NARROWS"]
["W6-1","DIVIDED HIGHWAY BEGIN"]
["W6-2","DIVIDED HIGHWAY ENDS"]
["W6-3","TWO WAY TRAFFIC"]
["W6-X2","ACCELERATION LANE ENDS"]
["W7-1","HILL"]
["W7-1a","HILL WITH GRADE XX%"]
["W7-2bP","TRUCKS USE LOWER GEAR PLAQUE"]
["W7-3aP","NEXT XX MILES PLAQUE"]
["W7-3bP","XX% GRADE XX MILES PLAQUE"]
["W7-3P","XX% GRADE PLAQUE"]
["W7-5","HILL BIKE"]
["W8-1","BUMP"]
["W8-10","SLIPPERY WHEN WET BIKE"]
["W8-10P","SLIPPERY WHEN WET PLAQUE"]
["W8-11","UNEVEN LANES"]
["W8-12","NO CENTER LINE"]
["W8-13","BRIDGE ICES BEFORE ROAD"]
["W8-14","FALLEN ROCKS"]
["W8-15","GROOVED PAVEMENT"]
["W8-15P","MOTORCYCLE PLAQUE"]
["W8-16","METAL BRIDGE DECK"]
["W8-17L","SHOULDER DROP OFF LEFT"]
["W8-17P","SHOULDER DROP OFF PLAQUE"]
["W8-17R","SHOULDER DROP OFF RIGHT"]
["W8-18","ROAD MAY FLOOD"]
["W8-19","FLOOD GAUGE"]
["W8-1M","BUMP AHEAD"]
["W8-2","DIP"]
["W8-21","GUSTY WINDS AREA"]
["W8-22","FOG AREA"]
["W8-23","NO SHOULDER"]
["W8-25","SHOULDER ENDS"]
["W8-3","PAVEMENT ENDS"]
["W8-4","SOFT SHOULDER"]
["W8-5","SLIPPERY WHEN WET"]
["W8-5bP","STEEL DECK PLAQUE"]
["W8-5P","WHEN WET PLAQUE"]
["W8-7","LOOSE GRAVEL"]
["W8-8","ROUGH ROAD"]
["W8-9","LOW SHOULDER"]
["W8-X14","MINIMUM MAINTENANCE ROAD"]
["W9-1L","LEFT LANE ENDS"]
["W9-1R","RIGHT LANE ENDS"]
["W9-2L","LANE ENDS MERGE LEFT"]
["W9-2R","LANE ENDS MERGE RIGHT"]
["X1-1","AIRCRAFT APPROACH AREA"]
["X2-2","BRIDGE NUMBER XX"]
["X3-4","KEEP OFF INFILTRATION AREA"]
["X3-5D","SNOWPLOW MARKER DOWN"]
["X3-5U","SNOWPLOW MARKER UP"]
["X4-1","GUIDE DELINEATOR (COLOR)"]
["X4-2","1/10 MILE DELINEATOR"]
["X4-3","CYLINDER STYLE DELINEATOR"]
["X5-2","REFLECTIVE POST STRIP"]

{"sheet":"ACTIVITIES","index":11,"n_rows":65,"n_cols":4,"rows_kept":65,"cut":false,"hidden":false,"merged":[]}
[]
[null,"IN\nPLAN","ACTIVITY\nNO","ACTIVITY DESCRIPTION"]
[null,"x",1,"FURNISH & INSTALL"]
[null,"x",2,"INPLACE"]
[null,null,3,"SALVAGE"]
[null,"x",4,"REMOVE"]
[null,"x",5,"REMOVE SIGN TYPE C"]
[null,"x",6,"INSTALL"]
[null,"x",{"$f":"SUBTOTAL(3,$D$9:D9)+6","v":7},"F & I  SIGN PANEL OVERLAY(S)"]
[null,"x",{"$f":"SUBTOTAL(3,$D$9:D10)+6","v":8},"F & I  SIGN PANEL(S)"]
[null,null,{"$f":"SUBTOTAL(3,$D$9:D11)+6","v":9},"F & I  LEFT SIGN PANEL"]
[null,null,{"$f":"SUBTOTAL(3,$D$9:D12)+6","v":10},"F & I  MIDDLE SIGN PANEL"]
[null,null,{"$f":"SUBTOTAL(3,$D$9:D13)+6","v":11},"F & I  RIGHT SIGN PANEL"]
[null,null,{"$f":"SUBTOTAL(3,$D$9:D14)+6","v":12},"F & I  SIGN PANEL(S) AND PANEL MOUNTING POSTS"]
[null,"x",{"$f":"SUBTOTAL(3,$D$9:D15)+6","v":13},"F & I  LEFT SIGN PANEL AND PANEL MOUNTING POSTS"]
[null,null,{"$f":"SUBTOTAL(3,$D$9:D16)+6","v":14},"F & I  MIDDLE SIGN PANEL AND PANEL MOUNTING POSTS"]
[null,null,{"$f":"SUBTOTAL(3,$D$9:D17)+6","v":15},"F & I  RIGHT SIGN PANEL AND PANEL MOUNTING POSTS"]
[null,"x",{"$f":"SUBTOTAL(3,$D$9:D18)+6","v":16},"F & I  SIGN PANEL OVERLAY(S)"]
[null,null,{"$f":"SUBTOTAL(3,$D$9:D19)+6","v":17},"F & I  SIGN PANEL OVERLAY LEFT SIGN PANEL"]
[null,"x",{"$f":"SUBTOTAL(3,$D$9:D20)+6","v":18},"F & I  SIGN PANEL OVERLAY MIDDLE SIGN PANEL"]
[null,null,{"$f":"SUBTOTAL(3,$D$9:D21)+6","v":19},"F & I  SIGN PANEL OVERLAY RIGHT SIGN PANEL"]
[null,null,{"$f":"SUBTOTAL(3,$D$9:D22)+6","v":20},"SIGN LEGEND REVISION"]
[null,null,{"$f":"SUBTOTAL(3,$D$9:D23)+6","v":21},"SIGN LEGEND REVISION LEFT SIGN PANEL"]
[null,null,{"$f":"SUBTOTAL(3,$D$9:D24)+6","v":22},"SIGN LEGEND REVISION MIDDLE SIGN PANEL"]
[null,null,{"$f":"SUBTOTAL(3,$D$9:D25)+6","v":23},"SIGN LEGEND REVISION RIGHT SIGN PANEL"]
[null,null,{"$f":"SUBTOTAL(3,$D$9:D26)+6","v":24},"SALVAGE SIGN PANEL(S)"]
[null,null,{"$f":"SUBTOTAL(3,$D$9:D27)+6","v":25},"SALVAGE LEFT SIGN PANEL"]
[null,null,{"$f":"SUBTOTAL(3,$D$9:D28)+6","v":26},"SALVAGE MIDDLE SIGN PANEL"]
[null,null,{"$f":"SUBTOTAL(3,$D$9:D29)+6","v":27},"SALVAGE RIGHT SIGN PANEL"]
[null,null,{"$f":"SUBTOTAL(3,$D$9:D30)+6","v":28},"REMOVE SIGN PANEL(S)"]
[null,null,{"$f":"SUBTOTAL(3,$D$9:D31)+6","v":29},"REMOVE LEFT SIGN PANEL"]
[null,null,{"$f":"SUBTOTAL(3,$D$9:D32)+6","v":30},"REMOVE MIDDLE SIGN PANEL"]
[null,null,{"$f":"SUBTOTAL(3,$D$9:D33)+6","v":31},"REMOVE RIGHT SIGN PANEL"]
[null,null,{"$f":"SUBTOTAL(3,$D$9:D34)+6","v":32},"MODIFY PANEL MOUNTING POSTS"]
[null,null,{"$f":"SUBTOTAL(3,$D$9:D35)+6","v":33},"MODIFY PANEL MOUNTING POSTS LEFT SIGN PANEL"]
[null,null,{"$f":"SUBTOTAL(3,$D$9:D36)+6","v":34},"MODIFY PANEL MOUNTING POSTS MIDDLE SIGN PANEL"]
[null,null,{"$f":"SUBTOTAL(3,$D$9:D37)+6","v":35},"MODIFY PANEL MOUNTING POSTS RIGHT SIGN PANEL"]
[null,null,{"$f":"SUBTOTAL(3,$D$9:D38)+6","v":36},"F & I  EXTRUDED PANEL SECTION(S)"]
[null,null,{"$f":"SUBTOTAL(3,$D$9:D39)+6","v":37},"F & I  EXTRUDED PANEL SECTION(S)  LEFT SIGN PANEL"]
[null,null,{"$f":"SUBTOTAL(3,$D$9:D40)+6","v":38},"F & I  EXTRUDED PANEL SECTION(S)  MIDDLE SIGN PANEL"]
[null,null,{"$f":"SUBTOTAL(3,$D$9:D41)+6","v":39},"F & I  EXTRUDED PANEL SECTION(S)  RIGHT SIGN PANEL"]
[null,null,{"$f":"SUBTOTAL(3,$D$9:D42)+6","v":40},"REMOVE EXTRUDED PANEL SECTION(S)"]
[null,null,{"$f":"SUBTOTAL(3,$D$9:D43)+6","v":41},"REMOVE EXTRUDED PANEL SECTION(S)  LEFT SIGN PANEL"]
[null,null,{"$f":"SUBTOTAL(3,$D$9:D44)+6","v":42},"REMOVE EXTRUDED PANEL SECTION(S)  MIDDLE SIGN PANEL"]
[null,null,{"$f":"SUBTOTAL(3,$D$9:D45)+6","v":43},"REMOVE EXTRUDED PANEL SECTION(S)  RIGHT SIGN PANEL"]
[null,null,{"$f":"SUBTOTAL(3,$D$9:D46)+6","v":44},"SAW SIGN PANEL(S)"]
[null,null,{"$f":"SUBTOTAL(3,$D$9:D47)+6","v":45},"SAW LEFT SIGN PANEL"]
[null,null,{"$f":"SUBTOTAL(3,$D$9:D48)+6","v":46},"SAW MIDDLE SIGN PANEL"]
[null,null,{"$f":"SUBTOTAL(3,$D$9:D49)+6","v":47},"SAW RIGHT SIGN PANEL"]
[null,null,{"$f":"SUBTOTAL(3,$D$9:D50)+6","v":48},"MODIFY SIGN STRUCTURE"]
[null,null,{"$f":"SUBTOTAL(3,$D$9:D51)+6","v":49},"REPOSITION LEFT SIGN PANEL"]
[null,null,{"$f":"SUBTOTAL(3,$D$9:D52)+6","v":50},"REPOSITION MIDDLE SIGN PANEL"]
[null,null,{"$f":"SUBTOTAL(3,$D$9:D53)+6","v":51},"REPOSITION RIGHT SIGN PANEL"]
[null,null,{"$f":"SUBTOTAL(3,$D$9:D54)+6","v":52},"RAISE SIGN PANEL(S)  8\""]
[null,null,{"$f":"SUBTOTAL(3,$D$9:D55)+6","v":53},"MODIFY SIGN LIGHTING SYSTEM"]
[null,null,{"$f":"SUBTOTAL(3,$D$9:D56)+6","v":54},"INSTALL SIGN PANEL(S)"]
[null,null,{"$f":"SUBTOTAL(3,$D$9:D57)+6","v":55},"INSTALL LEFT SIGN PANEL"]
[null,null,{"$f":"SUBTOTAL(3,$D$9:D58)+6","v":56},"INSTALL MIDDLE SIGN PANEL"]
[null,null,{"$f":"SUBTOTAL(3,$D$9:D59)+6","v":57},"INSTALL RIGHT SIGN PANEL"]
[null,null,{"$f":"SUBTOTAL(3,$D$9:D60)+6","v":58},"MODIFY POSTS"]
[null,null,{"$f":"SUBTOTAL(3,$D$9:D61)+6","v":59},"F & I  OVERHEAD SIGN IDENTIFICATION PLATE"]
[null,null,{"$f":"SUBTOTAL(3,$D$9:D62)+6","v":60},"F & I  FEED POINT IDENTIFICATION PLATE"]
[null,null,{"$f":"SUBTOTAL(3,$D$9:D63)+6","v":61},"F & I  NEW POST CLIPS ON ALL SIGN PANELS"]
[null,null,{"$f":"SUBTOTAL(3,$D$9:D64)+6","v":62},"REMOVE SIGN WALKWAY"]
[null,null,{"$f":"SUBTOTAL(3,$D$9:D65)+6","v":63},"REMOVE SIGN LIGHTING SYSTEM"]

{"sheet":"STD PLANS","index":12,"n_rows":69,"n_cols":15,"rows_kept":69,"cut":false,"hidden":false,"merged":[[3,1,3,2],[57,1,57,2],[68,1,68,11]]}
[]
[]
[null,null,null,null,"user note"]
[null,"STANDARD PLANS",null,null,"INCLUDE in plans with:"]
["x","NUMBER","DESCRIPTION"]
["SIGNING","5-297.701","STANDARD SIGN PLACEMENT",null," SIGN, INSTALL SIGN PAY ITEMS"]
["SIGNING","5-297.702","DELINEATOR AND MARKER PLACEMENT",null,"DELINEATOR/MARKER, INSTALL DELIN/MARKER"]
["SIGNING","5-297.703","SIGN, DELINEATOR, AND MARKER PLACEMENT NEAR INTERCHANGE RAMP GORES",null,"DELINATION ON RAMPS/LOOPS"]
["SIGNING","5-297.710","EXTRUDED PANEL MOUNTING DETAILS (4 SHEETS)",null,"EXIT PANELS ON SIGNS WITH EXTRUDED PANELS"]
["SIGNING","5-297.711","I-BEAM SUPPORTED SIGN STRUCTURE DETAILS - FOOTING AND BASE CONNECTIONS (2 SHEETS)",null,"I BEAM STRUCTURES"]
[null,"5-297.713","I-BEAM SUPPORTED SIGN STRUCTURE DETAILS - SHALLOW SPREAD FOUNDATION"]
["X","5-297.721","THREE WALL BASE - FOR 1-3/4\" SQUARE TUBE RISER POST",null,"1-3/4 INCH RISER POSTS"]
[null,"5-297.726","SIGN MOUNTED ON CONCRETE WALL (3 SHEETS)"]
["X","5-297.730","SIGN MOUNTING SYSTEMS FOR ROUND SUPPORTS",null,"PANELS MOUNTED TO ROUND POSTS"]
["X","5-297.731","SIGN MOUNTING DETAILS FOR SIGNAL MAST ARMS",null,"MAST ARM SIGNING"]
["SIGNING","5-297.740","CONCRETE RAIL MOUNTED SIGN (4 SHEETS)",null,"CONCRETE RAIL MOUNTED SIGNS"]
["SIGNING","5-297.741","STRUCTURAL DETAILS FOR BRIDGE MOUNTED SIGNS - STREET NAME",null,"BRIDGE MOUNTED STREET NAME SIGNS"]
["SIGNING","5-297.742","STRUCTURAL DETAILS FOR BRIDGE MOUNTED SIGNS - MINOR GUIDE SIGNS",null,"BRIDGE MOUNTED GUIDE SIGNS"]
["X","5-297.745","MONOTUBE OVERHEAD SIGN STRUCTURES - GENERAL ELEVATIONS SECTIONS AND NOTES",null,"MONOTUBE STRUCTURES"]
["SIGNING","5-297.746","MONOTUBE OVERHEAD SIGN STRUCTURES - FOUNDATION DETAILS (2 SHEETS)",null,"MONOTUBE STRUCTURES"]
["SIGNING","5-297.747","MONOTUBE OVERHEAD SIGN STRUCTURES - SIMPLE SPAN (2 SHEETS)",null,"MONOTUBE STRUCTURES"]
["SIGNING","5-297.748","MONOTUBE OVERHEAD SIGN STRUCTURES - CANTILEVER (2 SHEETS)",null,"MONOTUBE STRUCTURES"]
["SIGNING","5-297.749","MONOTUBE OVERHEAD SIGN STRUCTURES - SIGN PANEL AND EXIT PANEL (2 SHEETS)",null,"MONOTUBE STRUCTURES"]
["SIGNING","5-297.750","PANEL MOUNTING POST MODIFICATION DETAILS",null,"PANEL MOUNTING POSTS"]
["SIGNING","5-297.752","TYPE F MEDIAN BARRIER FOUNDATION - SPREAD FOOTING",null,"OH STRUCTURES WITH SPREAD MEDIAN BARRIER FOOTING"]
["SIGNING","5-297.753","TYPE F MEDIAN BARRIER FOUNDATION - DRILLED SHAFT FOOTING",null,"OH STRUCTURES WITH DRILLED SHAFT MEDIAN BARRIER FOOTING"]
["SIGNING","5-297.754","SINGLE SLOPE MEDIAN BARRIER FOUNDATION - SPREAD FOOTING",null,"OH STRUCTURES WITH SPREAD FOOTING & SINGLE SLOPE MEDIAN BARRIER FOOTING"]
["SIGNING","5-297.755","SINGLE SLOPE MEDIAN BARRIER FOUNDATION - DRILLED SHAFT FOOTING ",null,"OH STRUCTURES WITH DRILLED SHAFT SINGLE SLOPE MEDIAN BARRIER FOOTING"]
["X","5-297.761","STANDARD OVERHEAD SIGN STRUCTURES - DESIGN D - GENERAL ELEVATIONS, SECTIONS AND NOTES",null,"OH DESIGN D SIGN STRUCTURES"]
["X","5-297.762","STANDARD OVERHEAD SIGN STRUCTURES - DESIGN D - CAMBER POST TYPE AND ESTIMATED QUANTITIES",null,"OH DESIGN D SIGN STRUCTURES"]
["SIGNING","5-297.763","STANDARD OVERHEAD SIGN STRUCTURES - DESIGN D - FOUNDATION DETAILS (2 SHEETS)",null,"OH DESIGN D SIGN STRUCTURES WITH FOUNDATIONS"]
["SIGNING","5-297.764","STANDARD OVERHEAD SIGN STRUCTURES - DESIGN D - BASE PLATE, HANDHOLE, AND COVER PLATE DETAILS",null,"OH DESIGN D SIGN STRUCTURES"]
["SIGNING","5-297.765","STANDARD OVERHEAD SIGN STRUCTURES - DESIGN D - TRUSS TO POST CONNECTION DETAILS.",null,"OH DESIGN D SIGN STRUCTURES"]
["SIGNING","5-297.766","STANDARD OVERHEAD SIGN STRUCTURES - DESIGN D - SIGN TRUSS DETAILS TYPE A",null,"OH DESIGN D SIGN STRUCTURES WITH THIS TRUSS TYPE"]
["SIGNING","5-297.767","STANDARD OVERHEAD SIGN STRUCTURES - DESIGN D - SIGN TRUSS DETAILS TYPE B",null,"OH DESIGN D SIGN STRUCTURES WITH THIS TRUSS TYPE"]
["SIGNING","5-297.768","STANDARD OVERHEAD SIGN STRUCTURES - DESIGN D - SIGN TRUSS DETAILS TYPE C",null,"OH DESIGN D SIGN STRUCTURES WITH THIS TRUSS TYPE"]
["SIGNING","5-297.769","STANDARD OVERHEAD SIGN STRUCTURES - DESIGN D - WALKWAY DETAILS (3 SHEETS)",null,"OH DESIGN D SIGN STRUCTURES WITH WALKWAY"]
["SIGNING","5-297.770","STANDARD OVERHEAD SIGN STRUCTURES - DESIGN D - WALKWAY AND RAILING RETROFIT DETAILS",null,"OH DESIGN D SIGN STRUCTURES WITH WALKWAY RAILING"]
["X","5-297.772","STANDARD OVERHEAD SIGN STRUCTURES - DESIGN D - DMS MOUNTING DETAILS",null,"DMS ON OH STRUCTURES"]
["SIGNING","5-297.771","STANDARD OVERHEAD SIGN STRUCTURES - DESIGN D - ROCK SOCKET FOUNDATION DETAILS",null,"OH ROCK SOCKET FOUNDATION"]
["X","5-297.774","STANDARD OVERHEAD SIGN STRUCTURES - DESIGN D - VARIABLE LENGTH DRILLED SHAFT DETAILS",null,"OH VARIABLE DEPTH FOUNDATION"]
["SIGNING","5-297.779","OVERHEAD SIGN STRUCTURE - FOUNDATION EXTENSION - DESIGN D EXTENSION DETAILS - TYPE 1-4 POSTS",null,"FOUNDATION EXTENSION DESIGN D TYPE 1-4 POSTS"]
["X","5-297.780","OVERHEAD SIGN STRUCTURE - FOUNDATION EXTENSION - DESIGN D EXTENSION DETAILS - TYPE 5-6 POSTS (2 SHEETS)",null,"FOUNDATION EXTENSION DESIGN D TYPE 5-6 POSTS"]
["SIGNING","5-297.781","OVERHEAD SIGN STRUCTURE - FOUNDATION EXTENSION - INTERIM DESIGN B EXTENSION DETAILS - TYPE 1-4 POSTS",null,"FOUNDATION EXTENSION INTERIM DESIGN B TYPE 1-4 POSTS"]
["SIGNING","5-297.782","OVERHEAD SIGN STRUCTURE - FOUNDATION EXTENSION - INTERIM DESIGN B EXTENSION DETAILS - TYPE 5-7 POSTS (2 SHEETS)",null,"FOUNDATION EXTENSION INTERIM DESIGN B TYPE 5-7 POSTS"]
["SIGNING","5-297.783","OVERHEAD SIGN STRUCTURE - FOUNDATION EXTENSION - DESIGN B EXTENSION DETAILS - TYPE 1-3 POSTS",null,"FOUNDATION EXTENSION DESIGN B TYPE 1-3 POSTS"]
["SIGNING","5-297.784","OVERHEAD SIGN STRUCTURE - FOUNDATION EXTENSION - DESIGN B EXTENSION DETAILS - TYPE 4-5 POSTS (2 SHEETS)",null,"FOUNDATION EXTENSION DESIGN B TYPE 4-5 POSTS"]
["SIGNING","5-297.785","OVERHEAD SIGN STRUCTURE - FOUNDATION EXTENSION - DESIGN B EXTENSION DETAILS - TYPE 6-7 POSTS (2 SHEETS)",null,"FOUNDATION EXTENSION DESIGN B TYPE 6-7 POSTS"]
["SIGNING","5-297.786","OVERHEAD SIGN STRUCTURE - FOUNDATION EXTENSION - DESIGN B EXTENSION DETAILS - TYPE 8-9 POSTS (2 SHEETS)",null,"FOUNDATION EXTENSION DESIGN B TYPE 8-9 POSTS"]
["SIGNING","5-297.787","OVERHEAD SIGN STRUCTURE - FOUNDATION EXTENSION - DESIGN B EXTENSION DETAILS - TYPE 10-13 POSTS (3 SHEETS)",null,"FOUNDATION EXTENSION DESIGN B TYPE 10-13 POSTS"]
["SIGNING","5-297.788","OVERHEAD SIGN STRUCTURE - FOUNDATION EXTENSION - DESIGN B EXTENSION DETAILS - TYPE 14-15 POSTS",null,"FOUNDATION EXTENSION DESIGN B TYPE 14-15 POSTS"]
["SIGNING","5-297.789","OVERHEAD SIGN STRUCTURE - FOUNDATION EXTENSION - DESIGN B EXTENSION DETAILS - TYPE 16-19 POSTS (2 SHEETS)",null,"FOUNDATION EXTENSION DESIGN B TYPE 16-19 POSTS"]
[]
[]
[]
[]
[]
[null,"DETAILS",null,null,"INCLUDE in plans with:"]
["x","NUMBER","DESCRIPTION"]
["x",null,"SQUARE TUBE SIGN MOUNTING DETAIL",null," SIGN, SIGN PANEL, INSTALL SIGN, INSTALL SIGN PANEL PAY ITEMS"]
["x",null,"SQUARE TUBE FIN BASE DETAIL",null,"2 INCH RISER POST STRUCTURE"]
["x",null,"SQUARE TUBE SHEAR BOLT DETAIL",null,"2 INCH RISER POST STRUCTURE IN CONCRETE"]
["x",null,"SQUARE TUBE SLIP BASE DETAIL",null,"2-1/2 INCH RISER POST STRUCTURE"]
["x",null,"I BEAM SUPPORTED SIGN STRUCTURE DETAIL SHALLOW SPREAD FOOTING",null,"I BEAM STRUCTURES WITH SHALLOW FOUNDATIONS"]
[]
[]
[]
[]
[null,"Designer Note: include only Standard Plans pertinent to project ",null,null,null,null,null,null,null,null,null,null,null,null,"x"]

{"sheet":"C  S&I","index":13,"n_rows":52,"n_cols":13,"rows_kept":52,"cut":false,"hidden":false,"merged":[[9,12,10,12],[3,12,5,12],[4,3,4,4],[5,3,5,4],[5,5,5,7],[9,8,10,8],[9,9,10,9],[9,10,10,10],[9,11,10,11],[6,3,6,4],[7,3,7,4],[8,3,8,4],[2,2,3,2],[2,3,2,4],[2,5,2,7],[2,9,2,12],[3,3,3,4],[3,5,4,7],[3,9,5,9],[3,10,5,10],[3,11,4,11],[2,8,3,8],[9,1,10,1],[9,2,10,2],[9,3,9,4],[10,3,10,4],[11,3,11,4],[12,10,14,10],[12,11,14,11],[12,12,14,12],[12,1,14,1],[12,2,14,2],[12,3,12,4],[13,3,13,4],[14,3,14,4],[15,3,15,4],[12,8,14,8],[12,9,14,9],[16,1,17,1],[16,2,17,2],[16,3,16,4],[16,8,17,8],[16,9,17,9],[21,3,21,4],[19,1,20,1],[19,2,20,2],[19,3,19,4],[19,8,20,8],[16,11,17,11],[16,12,17,12],[17,3,17,4],[18,3,18,4],[19,10,20,10],[16,10,17,10],[19,11,20,11],[19,12,20,12],[20,3,20,4],[20,5,20,7],[19,9,20,9],[25,1,28,1],[26,3,26,4],[27,3,27,4],[28,3,28,4],[22,3,22,4],[29,2,32,2],[29,3,29,4],[29,8,32,8],[24,3,24,4],[25,2,28,2],[25,3,25,4],[25,8,28,8],[58,2,58,10],[1,1,1,11],[29,11,32,11],[29,12,32,12],[30,3,30,4],[31,3,31,4],[32,3,32,4],[29,9,32,9],[29,10,32,10],[25,9,28,9],[25,10,28,10],[25,11,28,11],[25,12,28,12],[23,3,23,4],[33,3,33,4],[29,1,32,1]]}
[]
[null,"SALVAGE AND INSTALL SIGN TYPE C",null,null,null,null,null,null,null,null,null,null,"ST-C"]
[null,null,"SIGNS",null,null,"PANEL",null,null,"MTG\nHT","NEW POSTS/MOUNTING"]
[null,"SIGN",null,"PANEL",null,"SIZE",null,null,null,"NUMBER OF POSTS","POST TYPE\n(2)","RISER POST SIZE","SURFACE TYPE"]
[null,"NO","QTY","LEGEND",null,null,null,null,"(1)"]
[null,null,"EACH",null,null,"INCH",null,null,"FEET",null,null,"INCHES"]
[null,"C-201",2,"EXIT 30 MPH",null,48,"x",60,7,1,"SQ","2-1/2","SOIL"]
[null,"C-202",12,"CHEVRON",null,36,"x",48,7,1,"SQ","2-1/2","SOIL"]
[null," ",1,"MILE 164",null,12,"x",36,7,1,"SQ","2","SOIL"]
[null," ",2,"CURVE",null,48,"x",48,7,2,"SQ","2-1/2","SOIL"]
[null,null,null,"30 MPH",null,30,"x",30]
[null," ",2,"RAMP 30 MPH",null,48,"x",60,7,1,"SQ","2-1/2","SOIL"]
[null," ",1,"ALTERNATE ROUTE TO",null,24,"x",12,7,1,"SQ","2","SOIL"]
[null,null,null,"EAST",null,24,"x",12]
[null,null,null,"INTERSTATE 94",null,24,"x",24]
[null," ",1,"ADVANCED RIGHT TURN ARROW",null,21,"x",15,7,1,"SQ","2-1/2","SOIL"]
[null," ",2,"ONE WAY(RIGHT)",null,54,"x",18,7,1,"SQ","2-1/2","SOIL"]
[null,null,null,"STOP",null,36,"x",36]
[null," ",6,"ONE WAY (LEFT)",null,54,"x",18,7,1,"SQ","2","SOIL"]
[null," ",2,"ONE WAY (LEFT)",null,54,"x",18,7,1,"SQ","2-1/2","SOIL"]
[null,null,null,"YIELD",null,36]
[null," ",4,"ONE WAY (RIGHT)",null,54,"x",18,7,1,"SQ","2","SOIL"]
[null," ",4,"DO NOT ENTER",null,48,"x",48,7,1,"SQ","2","SOIL"]
[null," ",2,"PEDS BIKES PROHIBITED",null,18,"x",24,7,1,"SQ","2-1/2","SOIL"]
[null," ",2,"WRONG WAY",null,42,"x",30,7,1,"SQ","2-1/2","SOIL"]
[null," ",1,"ALTERNATE ROUTE TO",null,24,"x",12,7,1,"SQ","2-1/2","SOIL"]
[null,null,null,"EAST",null,24,"x",12]
[null,null,null,"INTERSTATE 94",null,24,"x",24]
[null,null,null,"U TURN ARROW",null,21,"x",15]
[null," ",1,"ALTERNATE ROUTE TO",null,24,"x",12,7,1,"SQ","2-1/2","SOIL"]
[null,null,null,"EAST",null,24,"x",12]
[null,null,null,"INTERSTATE 94",null,24,"x",24]
[null,null,null,"U TURN ARROW",null,21,"x",15]
[null,"TOTAL",{"$f":"SUM(C7:C33)","v":45}]
[null,null,null,null,null,null," "]
[null,null,null,null,null,null,null,null,null,null,null,null," "]
[null,"SPECIFIC NOTE(S):"]
[]
[null,"GENERAL NOTE(S):"]
[null,"1.  MOUNTING HEIGHT IS MINIMUM (WITH A +6 INCH TOLERANCE)  "]
[null,"2.  POST TYPE ABBREVIATIONS (SQ = SQUARE TUBE,  R = ROUND POST, CR = CONCRETE RAIL - POST TYPE)"]
[null,"3.  SEE THE CURRENT MnDOT STANDARD SIGNS AND MARKINGS MANUAL FOR STANDARD SIGN DESIGNS, SPLICE PLATES, STRINGERS AND PUNCHING CODES. "]
[null,"4.  SEE SQUARE TUBE SIGN MOUNTING DETAIL FOR ATTACHMENT."]
[null,"5.  SEE STANDARD PLAN 5-297.701 FOR PLACEMENT."]
[null,"6.  SEE SQUARE TUBE SLIP BASE DETAIL FOR 2-1/2 INCH RISER POST.      "]
[null,"7.  SEE SQUARE TUBE FIN BASE DETAIL FOR 2 INCH RISER POST IN SOIL."]
[null,"8.  SEE SQUARE TUBE SHEAR BOLT BASE DETAIL FOR 2 INCH RISER POST ON CONCRETE."]
[null,"9.  SEE STANDARD PLAN 5-297.721 FOR 1-3/4 INCH RISER POST USE SQUARE TUBE THREE WALL BASE. "]
[null,"10. SEE STANDARD PLAN 5-297.730 FOR SIGN MOUNTING TO ROUND POST."]
[null,"11. SEE STANDARD PLAN 5-297.703 FOR SIGN PLACEMENT AT RAMP GORES."]
[null,"12. SEE STANDARD PLAN 5-297.740 FOR CONCRETE RAIL MOUNTED SIGN STRUCTURES."]
[null,"13. SEE CONCRETE WALL MOUNTED SIGN DETAIL FOR WALL MOUNTED SIGN STRUCTURES."]

{"sheet":"C SIGN","index":14,"n_rows":55,"n_cols":15,"rows_kept":55,"cut":false,"hidden":false,"merged":[[27,13,30,13],[31,13,34,13],[31,14,34,14],[31,1,34,1],[31,2,34,2],[31,10,34,10],[31,11,34,11],[31,12,34,12],[27,14,30,14],[27,1,30,1],[27,2,30,2],[27,10,30,10],[27,11,30,11],[27,12,30,12],[14,12,17,12],[14,10,17,10],[14,11,17,11],[9,2,10,2],[9,10,10,10],[21,13,22,13],[21,14,22,14],[21,1,22,1],[18,13,19,13],[18,1,19,1],[18,2,19,2],[18,10,19,10],[18,11,19,11],[18,12,19,12],[22,5,22,7],[21,2,22,2],[21,10,22,10],[21,11,22,11],[21,12,22,12],[11,13,13,13],[11,14,13,14],[9,12,10,12],[3,12,5,12],[3,14,5,14],[3,13,5,13],[14,1,17,1],[9,1,10,1],[14,13,17,13],[14,14,17,14],[35,1,36,1],[35,10,36,10],[35,12,36,12],[35,13,36,13],[35,2,36,2],[11,1,13,1],[11,2,13,2],[11,10,13,10],[11,11,13,11],[11,12,13,12],[9,11,10,11],[14,2,17,2],[1,1,1,13],[3,3,5,3],[3,9,5,9],[2,3,2,9],[2,11,2,14],[3,11,5,11],[2,2,5,2],[3,5,5,7],[3,8,5,8],[2,10,5,10]]}
[]
[null,"SIGN PANELS TYPE C",null,null,null,null,null,null,null,null,null,null,null,null,"ST-A"]
[null,null,"QUANTITY","PANEL",null,null,null,null,null,null,"MOUNTING\nHEIGHT\n(FEET)","POSTS / MOUNTING"]
[null,"SIGN",null,"CODE\nNUMBER",null,"SIZE\n(INCHES)",null,null,"AREA\n(SQ FT)","TOTAL\nAREA\n(SQ FT)",null,"NUMBER OF POSTS","POST TYPE","RISER POST \nSIZE\n(INCHES)","SURFACE TYPE"]
[null,"NUMBER",null,null,"LEGEND"]
[]
[null,"C-1",2,"W13-2",{"$f":"IF(D7<>\"\",IF(COUNTIF(Table2[CODE\nNO],D7)>0, LOOKUP(D7,Table2[CODE\nNO],Table2[PANEL LEGEND]),\"NOT FOUND\"),\"\")","v":"EXIT XX MPH"},48,"x",60,{"$f":"(F7*H7)/144","v":20},{"$f":"I7*C7","v":40},7,1,"SQ","2-1/2","SOIL"]
[null,"C-2",12,"W1-8",{"$f":"IF(D8<>\"\",IF(COUNTIF(Table2[CODE\nNO],D8)>0, LOOKUP(D8,Table2[CODE\nNO],Table2[PANEL LEGEND]),\"NOT FOUND\"),\"\")","v":"CHEVRON"},36,"x",48,12,{"$f":"I8*C8","v":144},7,1,"SQ","2-1/2","SOIL"]
[null,"C-3",1,"D10-3",{"$f":"IF(D9<>\"\",IF(COUNTIF(Table2[CODE\nNO],D9)>0, LOOKUP(D9,Table2[CODE\nNO],Table2[PANEL LEGEND]),\"NOT FOUND\"),\"\")","v":"MILE XXX"},12,"x",36,3,{"$f":"I9*C9","v":3},4,1,"SQ","1-3/4","CONC"]
[null,"C-4",2,"W1-2R",{"$f":"IF(D10<>\"\",IF(COUNTIF(Table2[CODE\nNO],D10)>0, LOOKUP(D10,Table2[CODE\nNO],Table2[PANEL LEGEND]),\"NOT FOUND\"),\"\")","v":"CURVE RIGHT"},48,"x",48,16,{"$f":"I10*C10","v":32},7,2,"SQ","2-1/2","SOIL"]
[null,null,null,"W13-1P",{"$f":"IF(D11<>\"\",IF(COUNTIF(Table2[CODE\nNO],D11)>0, LOOKUP(D11,Table2[CODE\nNO],Table2[PANEL LEGEND]),\"NOT FOUND\"),\"\")","v":"XX MPH PLAQUE"},30,"x",30,6.25,{"$f":"I11*C10","v":12.5},null,null,null,"2-1/2","SOIL"]
[null,"C-5",1,"M4-X2",{"$f":"IF(D12<>\"\",IF(COUNTIF(Table2[CODE\nNO],D12)>0, LOOKUP(D12,Table2[CODE\nNO],Table2[PANEL LEGEND]),\"NOT FOUND\"),\"\")","v":"ALTERNATE ROUTE TO"},24,"x",12,{"$f":"(F12*H12)/144","v":2},{"$f":"I12*C12","v":2},7,1,"SQ","2","SOIL"]
[null,null,null,"M3-2",{"$f":"IF(D13<>\"\",IF(COUNTIF(Table2[CODE\nNO],D13)>0, LOOKUP(D13,Table2[CODE\nNO],Table2[PANEL LEGEND]),\"NOT FOUND\"),\"\")","v":"EAST (COLOR)"},24,"x",12,2,{"$f":"I13*C12","v":2}]
[null,null,null,"M5-1R",{"$f":"IF(D14<>\"\",IF(COUNTIF(Table2[CODE\nNO],D14)>0, LOOKUP(D14,Table2[CODE\nNO],Table2[PANEL LEGEND]),\"NOT FOUND\"),\"\")","v":"ADVANCE TURN RIGHT (COLOR)"},21,"x",15,2.19,{"$f":"I14*C12","v":2.19}]
[null,"C-6",1,"M4-X2",{"$f":"IF(D15<>\"\",IF(COUNTIF(Table2[CODE\nNO],D15)>0, LOOKUP(D15,Table2[CODE\nNO],Table2[PANEL LEGEND]),\"NOT FOUND\"),\"\")","v":"ALTERNATE ROUTE TO"},24,"x",12,2,{"$f":"I15*C15","v":2},7,1,"SQ","2","SOIL"]
[null,null,null,"M3-2",{"$f":"IF(D16<>\"\",IF(COUNTIF(Table2[CODE\nNO],D16)>0, LOOKUP(D16,Table2[CODE\nNO],Table2[PANEL LEGEND]),\"NOT FOUND\"),\"\")","v":"EAST (COLOR)"},24,"x",12,2,{"$f":"I16*C15","v":2}]
[null,null,null,"M1-1",{"$f":"IF(D17<>\"\",IF(COUNTIF(Table2[CODE\nNO],D17)>0, LOOKUP(D17,Table2[CODE\nNO],Table2[PANEL LEGEND]),\"NOT FOUND\"),\"\")","v":"INTERSTATE XX"},24,"x",24,4,{"$f":"I17*C15","v":4}]
[null,null,null,"M5-1R",{"$f":"IF(D18<>\"\",IF(COUNTIF(Table2[CODE\nNO],D18)>0, LOOKUP(D18,Table2[CODE\nNO],Table2[PANEL LEGEND]),\"NOT FOUND\"),\"\")","v":"ADVANCE TURN RIGHT (COLOR)"},21,"x",15,2.19,{"$f":"I18*C15","v":2.19}]
[null,"C-7",2,"R6-1R",{"$f":"IF(D19<>\"\",IF(COUNTIF(Table2[CODE\nNO],D19)>0, LOOKUP(D19,Table2[CODE\nNO],Table2[PANEL LEGEND]),\"NOT FOUND\"),\"\")","v":"ONE WAY RIGHT"},54,"x",18,6.75,{"$f":"I19*C19","v":13.5},7,1,"SQ","2-1/2","SOIL"]
[null,null,null,"R1-1",{"$f":"IF(D20<>\"\",IF(COUNTIF(Table2[CODE\nNO],D20)>0, LOOKUP(D20,Table2[CODE\nNO],Table2[PANEL LEGEND]),\"NOT FOUND\"),\"\")","v":"STOP"},36,"x",36,9,{"$f":"I20*C19","v":18}]
[null,"C-8",6,"R6-1L",{"$f":"IF(D21<>\"\",IF(COUNTIF(Table2[CODE\nNO],D21)>0, LOOKUP(D21,Table2[CODE\nNO],Table2[PANEL LEGEND]),\"NOT FOUND\"),\"\")","v":"ONE WAY LEFT"},54,"x",18,6.75,{"$f":"I21*C21","v":40.5},7,1,"SQ","2","SOIL"]
[null,"C-9",2,"R6-1L",{"$f":"IF(D22<>\"\",IF(COUNTIF(Table2[CODE\nNO],D22)>0, LOOKUP(D22,Table2[CODE\nNO],Table2[PANEL LEGEND]),\"NOT FOUND\"),\"\")","v":"ONE WAY LEFT"},54,"x",18,6.75,{"$f":"I22*C22","v":13.5},7,1,"SQ","2-1/2","SOIL"]
[null,null,null,"R1-2",{"$f":"IF(D23<>\"\",IF(COUNTIF(Table2[CODE\nNO],D23)>0, LOOKUP(D23,Table2[CODE\nNO],Table2[PANEL LEGEND]),\"NOT FOUND\"),\"\")","v":"YIELD"},36,null,null,3.9,{"$f":"I23*C22","v":7.8}]
[null,"C-10",4,"R6-1R",{"$f":"IF(D24<>\"\",IF(COUNTIF(Table2[CODE\nNO],D24)>0, LOOKUP(D24,Table2[CODE\nNO],Table2[PANEL LEGEND]),\"NOT FOUND\"),\"\")","v":"ONE WAY RIGHT"},54,"x",18,{"$f":"(F24*H24)/144","v":6.75},{"$f":"I24*C24","v":27},7,1,"SQ","2","CONCRETE"]
[null,"C-11",4,"R5-1",{"$f":"IF(D25<>\"\",IF(COUNTIF(Table2[CODE\nNO],D25)>0, LOOKUP(D25,Table2[CODE\nNO],Table2[PANEL LEGEND]),\"NOT FOUND\"),\"\")","v":"DO NOT ENTER"},48,"x",48,16,{"$f":"I25*C25","v":64},7,1,"SQ","2","SOIL"]
[null,"C-12",2,"R5-10aM",{"$f":"IF(D26<>\"\",IF(COUNTIF(Table2[CODE\nNO],D26)>0, LOOKUP(D26,Table2[CODE\nNO],Table2[PANEL LEGEND]),\"NOT FOUND\"),\"\")","v":"PEDS PROHIBITED"},18,"x",24,3,{"$f":"I26*C26","v":6},7,1,"SQ","1-3/4","SOIL"]
[null,"C-13",2,"R5-1A",{"$f":"IF(D27<>\"\",IF(COUNTIF(Table2[CODE\nNO],D27)>0, LOOKUP(D27,Table2[CODE\nNO],Table2[PANEL LEGEND]),\"NOT FOUND\"),\"\")","v":"WRONG WAY"},42,"x",30,8.75,{"$f":"I27*C27","v":17.5},7,1,"SQ","2-1/2","SOIL"]
[null,"C-14",1,"M4-X2",{"$f":"IF(D28<>\"\",IF(COUNTIF(Table2[CODE\nNO],D28)>0, LOOKUP(D28,Table2[CODE\nNO],Table2[PANEL LEGEND]),\"NOT FOUND\"),\"\")","v":"ALTERNATE ROUTE TO"},24,"x",12,2,{"$f":"I28*C28","v":2},7,1,"SQ","2-1/2","SOIL"]
[null,null,null,"M3-2",{"$f":"IF(D29<>\"\",IF(COUNTIF(Table2[CODE\nNO],D29)>0, LOOKUP(D29,Table2[CODE\nNO],Table2[PANEL LEGEND]),\"NOT FOUND\"),\"\")","v":"EAST (COLOR)"},24,"x",12,2,{"$f":"I29*C28","v":2}]
[null,null,null,"M1-1",{"$f":"IF(D30<>\"\",IF(COUNTIF(Table2[CODE\nNO],D30)>0, LOOKUP(D30,Table2[CODE\nNO],Table2[PANEL LEGEND]),\"NOT FOUND\"),\"\")","v":"INTERSTATE XX"},24,"x",24,4,{"$f":"I30*C28","v":4}]
[null,null,null,"M6-X2",{"$f":"IF(D31<>\"\",IF(COUNTIF(Table2[CODE\nNO],D31)>0, LOOKUP(D31,Table2[CODE\nNO],Table2[PANEL LEGEND]),\"NOT FOUND\"),\"\")","v":"U TURN (COLOR)"},21,"x",15,2.19,{"$f":"I31*C28","v":2.19}]
[null,"C-15",1,"M4-X2",{"$f":"IF(D32<>\"\",IF(COUNTIF(Table2[CODE\nNO],D32)>0, LOOKUP(D32,Table2[CODE\nNO],Table2[PANEL LEGEND]),\"NOT FOUND\"),\"\")","v":"ALTERNATE ROUTE TO"},24,"x",12,2,{"$f":"I32*C32","v":2},7,1,"SQ","2-1/2","SOIL"]
[null,null,null,"M3-2",{"$f":"IF(D33<>\"\",IF(COUNTIF(Table2[CODE\nNO],D33)>0, LOOKUP(D33,Table2[CODE\nNO],Table2[PANEL LEGEND]),\"NOT FOUND\"),\"\")","v":"EAST (COLOR)"},24,"x",12,2,{"$f":"I33*C32","v":2}]
[null,null,null,"M1-1",{"$f":"IF(D34<>\"\",IF(COUNTIF(Table2[CODE\nNO],D34)>0, LOOKUP(D34,Table2[CODE\nNO],Table2[PANEL LEGEND]),\"NOT FOUND\"),\"\")","v":"INTERSTATE XX"},24,"x",24,4,{"$f":"I34*C32","v":4}]
[null,null,null,"M6-X2",{"$f":"IF(D35<>\"\",IF(COUNTIF(Table2[CODE\nNO],D35)>0, LOOKUP(D35,Table2[CODE\nNO],Table2[PANEL LEGEND]),\"NOT FOUND\"),\"\")","v":"U TURN (COLOR)"},21,"x",15,2.19,{"$f":"I35*C32","v":2.19}]
[null,"C-16",1,"W3-3",{"$f":"IF(D36<>\"\",IF(COUNTIF(Table2[CODE\nNO],D36)>0, LOOKUP(D36,Table2[CODE\nNO],Table2[PANEL LEGEND]),\"NOT FOUND\"),\"\")","v":"SIGNAL AHEAD"},48,"x",48,{"$f":"(F36*H36)/144","v":16},{"$f":"I36*C36","v":16},7,null,"CR-II",null," "]
[null,null,null,"W16-2P",{"$f":"IF(D37<>\"\",IF(COUNTIF(Table2[CODE\nNO],D37)>0, LOOKUP(D37,Table2[CODE\nNO],Table2[PANEL LEGEND]),\"NOT FOUND\"),\"\")","v":"XX FEET PLAQUE"},42,"x",18,5.25,{"$f":"I37*C36","v":5.25}]
[null,"TOTAL",null,null,null,null,null,null,null,{"$f":"SUM(J7:J37)","v":497.31}]
[null,null,null,null,null,null,null,null,null,null,null,null,null,null," "]
[null,"SPECIFIC NOTE(S):"]
[]
[null,"GENERAL NOTE(S):"]
[null,"1.  MOUNTING HEIGHT IS MINIMUM (WITH A +6 INCH TOLERANCE)  "]
[null,"2.  POST TYPE ABBREVIATIONS (SQ = SQUARE TUBE,  R = ROUND POST, CR = CONCRETE RAIL - POST TYPE)"]
[null,"3.  SEE THE CURRENT MnDOT STANDARD SIGNS AND MARKINGS MANUAL FOR STANDARD SIGN DESIGNS, SPLICE PLATES, STRINGERS AND PUNCHING CODES. "]
[null,"4.  SEE SQUARE TUBE SIGN MOUNTING DETAIL FOR ATTACHMENT."]
[null,"5.  SEE STANDARD PLAN 5-297.701 FOR PLACEMENT."]
[null,"6.  SEE SQUARE TUBE SLIP BASE DETAIL FOR 2-1/2 INCH RISER POST.      "]
[null,"7.  SEE SQUARE TUBE FIN BASE DETAIL FOR 2 INCH RISER POST IN SOIL."]
[null,"8.  SEE SQUARE TUBE SHEAR BOLT BASE DETAIL FOR 2 INCH RISER POST ON CONCRETE."]
[null,"9.  SEE STANDARD PLAN 5-297.721 FOR 1-3/4 INCH RISER POST USE SQUARE TUBE THREE WALL BASE. "]
[null,"10. SEE STANDARD PLAN 5-297.730 FOR SIGN MOUNTING TO ROUND POST."]
[null,"11. SEE STANDARD PLAN 5-297.703 FOR SIGN PLACEMENT AT RAMP GORES."]
[null,"12. SEE STANDARD PLAN 5-297.740 FOR CONCRETE RAIL MOUNTED SIGN STRUCTURES."]
[null,"13. SEE CONCRETE WALL MOUNTED SIGN DETAIL FOR WALL MOUNTED SIGN STRUCTURES."]

{"sheet":"C INSTALL","index":15,"n_rows":44,"n_cols":12,"rows_kept":44,"cut":false,"hidden":false,"merged":[[2,1,5,1],[2,2,5,2],[2,3,2,6],[3,3,5,3],[3,4,5,6],[9,7,10,7],[9,8,10,8],[9,9,10,9],[2,8,2,11],[3,8,5,8],[3,11,5,11],[2,7,5,7],[3,10,5,10],[19,11,20,11],[19,10,20,10],[16,10,17,10],[20,4,20,6],[12,11,15,11],[12,7,15,7],[19,8,20,8],[19,9,20,9],[16,1,17,1],[16,2,17,2],[16,7,17,7],[16,8,17,8],[16,9,17,9],[44,2,46,13],[47,2,49,13],[50,2,52,13],[1,1,1,10],[12,8,15,8],[12,9,15,9],[12,10,15,10],[12,1,14,1],[12,2,14,2],[9,1,10,1],[9,2,10,2],[3,9,5,9],[16,11,17,11],[19,1,20,1],[19,2,20,2],[19,7,20,7]]}
[]
[null,"INSTALL SIGN TYPE C",null,null,null,null,null,null,null,null,null,"ST-B"]
[null,"SIGN\nNUMBER","QUANTITY\n(EACH)","PANEL",null,null,null,"MOUNTING\nHEIGHT\n(FEET)","POSTS/MOUNTING"]
[null,null,null,"LEGEND","SIZE\n(INCHES)",null,null,null,"NUMBER OF POSTS","POST TYPE","RISER POST\nSIZE\n(INCHES)","SURFACE TYPE"]
[]
[]
[null,"C-201",2,"EXIT 30 MPH",48,"x",60,7,1,"SQ","2-1/2","SOIL"]
[null,"C-202",12,"CHEVRON",36,"x",48,7,1,"SQ","2-1/2","SOIL"]
[null," ",1,"MILE 164",12,"x",36,7,1,"SQ","2","SOIL"]
[null," ",2,"CURVE",48,"x",48,7,2,"SQ","2-1/2","SOIL"]
[null,null,null,"30 MPH",30,"x",30,null,null,null,"2-1/2","SOIL"]
[null," ",2,"RAMP 30 MPH",48,"x",60,7,1,"SQ","2-1/2","SOIL"]
[null," ",1,"ALTERNATE ROUTE TO",24,"x",12,7,1,"SQ","2","SOIL"]
[null,null,null,"EAST",24,"x",12]
[null,null,null,"INTERSTATE 94",24,"x",24]
[null," ",1,"ADVANCED RIGHT TURN ARROW",21,"x",15]
[null," ",2,"ONE WAY(RIGHT)",54,"x",18,7,1,"SQ","2-1/2","SOIL"]
[null,null,null,"STOP",36,"x",36]
[null," ",6,"ONE WAY (LEFT)",54,"x",18,7,1,"SQ","2","SOIL"]
[null," ",2,"ONE WAY (LEFT)",54,"x",18,7,1,"SQ","2-1/2","SOIL"]
[null,null,null,"YIELD",36]
[null," ",4,"ONE WAY (RIGHT)",54,"x",18,7,1,"SQ","2","SOIL"]
[null," ",4,"DO NOT ENTER",48,"x",48,7,1,"SQ","2","SOIL"]
[null," ",2,"PEDS BIKES PROHIBITED",18,"x",24,7,1,"SQ","2-1/2","SOIL"]
[null," ",2,"WRONG WAY",42,"x",30,7,1,"SQ","2-1/2","SOIL"]
[null,"TOTAL",{"$f":"+SUM(C7:C25)","v":43}]
[null,null,null,null,null," "]
[null,null,null,null,null,null,null,null,null,null,null," "]
[null,"SPECIFIC NOTE(S):"]
[]
[null,"GENERAL NOTE(S):"]
[null,"1.  MOUNTING HEIGHT IS MINIMUM (WITH A +6 INCH TOLERANCE)  "]
[null,"2.  POST TYPE ABBREVIATIONS (SQ = SQUARE TUBE,  R = ROUND POST, CR = CONCRETE RAIL - POST TYPE)"]
[null,"3.  SEE THE CURRENT MnDOT STANDARD SIGNS AND MARKINGS MANUAL FOR STANDARD SIGN DESIGNS, SPLICE PLATES, STRINGERS AND PUNCHING CODES. "]
[null,"4.  SEE SQUARE TUBE SIGN MOUNTING DETAIL FOR ATTACHMENT."]
[null,"5.  SEE STANDARD PLAN 5-297.701 FOR PLACEMENT."]
[null,"6.  SEE SQUARE TUBE SLIP BASE DETAIL FOR 2-1/2 INCH RISER POST.      "]
[null,"7.  SEE SQUARE TUBE FIN BASE DETAIL FOR 2 INCH RISER POST IN SOIL."]
[null,"8.  SEE SQUARE TUBE SHEAR BOLT BASE DETAIL FOR 2 INCH RISER POST ON CONCRETE."]
[null,"9.  SEE STANDARD PLAN 5-297.721 FOR 1-3/4 INCH RISER POST USE SQUARE TUBE THREE WALL BASE. "]
[null,"10. SEE STANDARD PLAN 5-297.730 FOR SIGN MOUNTING TO ROUND POST."]
[null,"11. SEE STANDARD PLAN 5-297.703 FOR SIGN PLACEMENT AT RAMP GORES."]
[null,"12. SEE STANDARD PLAN 5-297.740 FOR CONCRETE RAIL MOUNTED SIGN STRUCTURES."]
[null,"13. SEE CONCRETE WALL MOUNTED SIGN DETAIL FOR WALL MOUNTED SIGN STRUCTURES."]

{"sheet":"C SAL","index":16,"n_rows":27,"n_cols":9,"rows_kept":27,"cut":false,"hidden":false,"merged":[[1,1,1,3],[1,4,1,6],[2,1,5,1],[2,2,5,2],[2,3,2,6],[3,4,5,6],[19,1,20,1],[19,2,20,2],[20,4,20,6],[9,1,10,1],[9,2,10,2],[12,1,14,1],[12,2,14,2],[16,1,17,1],[16,2,17,2]]}
[]
[null,"SALVAGE SIGN TYPE C",null,null,"ST-"]
[null,"SIGN\nNUMBER","QUANTITY\n(EACH)","PANEL"]
[null,null,null,null,"SIZE\n(INCHES)"]
[null,null,null,"LEGEND",null,null,null,null,"add same note as D SAL"]
[]
[null,"C-201",2,"EXIT 30 MPH",48,"x",60]
[null,"C-202",12,"CHEVRON",36,"x",48]
[null,"C-203",1,"MILE 164",12,"x",36]
[null," ",2,"CURVE",48,"x",48]
[null,null,null,"30 MPH",30,"x",30]
[null," ",2,"RAMP 30 MPH",48,"x",60]
[null," ",1,"ALTERNATE ROUTE TO",24,"x",12]
[null,null,null,"EAST",24,"x",12]
[null,null,null,"INTERSTATE 94",24,"x",24]
[null," ",1,"ADVANCED RIGHT TURN ARROW",21,"x",15]
[null," ",2,"ONE WAY(RIGHT)",54,"x",18]
[null,null,null,"STOP",36,"x",36]
[null," ",6,"ONE WAY (LEFT)",54,"x",18]
[null," ",2,"ONE WAY (LEFT)",54,"x",18]
[null,null,null,"YIELD",36]
[null," ",4,"ONE WAY (RIGHT)",54,"x",18]
[null," ",4,"DO NOT ENTER",48,"x",48]
[null," ",2,"PEDS BIKES PROHIBITED",18,"x",24]
[null," ",2,"WRONG WAY",42,"x",30]
[null,"TOTAL",{"$f":"+SUM(C7:C25)","v":43}]
[null,null,null,null,null," "]

{"sheet":"REM C PANEL","index":17,"n_rows":42,"n_cols":7,"rows_kept":42,"cut":false,"hidden":false,"merged":[[3,4,5,6],[11,1,13,1],[11,2,13,2],[9,1,10,1],[9,2,10,2],[2,2,5,2],[1,4,1,6],[1,1,1,3],[2,3,2,6],[35,1,36,1],[35,2,36,2],[31,1,34,1],[31,2,34,2],[22,4,22,6],[27,1,30,1],[27,2,30,2],[21,1,22,1],[21,2,22,2],[18,1,19,1],[18,2,19,2],[14,1,17,1],[14,2,17,2]]}
[]
[null,"REMOVE SIGN PANEL TYPE C",null,null,"ST-C"]
[null,null,"QUANTITY\n(EACH)"]
[null,"SIGN",null,null,"SIZE\n(INCHES)"]
[null,"NUMBER",null,"LEGEND"]
[]
[null,"C-1",1,null,18,"x",6]
[null,"C-2",0," ",36,"x",48]
[null,"C-3",0," ",12,"x",36]
[null,"C-4",0," ",48,"x",48]
[null,null,null," ",30,"x",30]
[null,"C-5",0," ",24,"x",12]
[null,null,null," ",24,"x",12]
[null,null,null," ",21,"x",15]
[null,"C-6",0," ",24,"x",12]
[null,null,null," ",24,"x",12]
[null,null,null," ",24,"x",24]
[null,null,null," ",21,"x",15]
[null,"C-7",0," ",54,"x",18]
[null,null,null," ",36,"x",36]
[null,"C-8",0," ",54,"x",18]
[null,"C-9",0," ",54,"x",18]
[null,null,null," ",36]
[null,"C-10",0,"  ",54,"x",18]
[null,"C-11",0," ",48,"x",48]
[null,"C-12",0," ",18,"x",24]
[null,"C-13",0," ",42,"x",30]
[null,"C-14",0,null,24,"x",12]
[null,null,null,null,24,"x",12]
[null,null,null,null,24,"x",24]
[null,null,null,null,21,"x",15]
[null,"C-15",0,null,24,"x",12]
[null,null,null,null,24,"x",12]
[null,null,null,null,24,"x",24]
[null,null,null,null,21,"x",15]
[null,"C-16",0,null,48,"x",48]
[null,null,null,null,42,"x",18]
[null,"TOTAL",{"$f":"SUM(C7:C37)","v":1}]
[]
[null,"SPECIFIC NOTE(S):"]
[]
[null,"GENERAL NOTE(S):"]

{"sheet":"C REM","index":18,"n_rows":41,"n_cols":5,"rows_kept":41,"cut":false,"hidden":false,"merged":[[0,0,0,1],[16,4,18,8]]}
["REMOVE SIGN TYPE C"]
["PAGE NO.","QUANTITY"]
[1,24]
[2,5]
[3,3]
[4,4]
[5,9]
[6,8]
[7,25]
[8,42]
[9,6]
[10,2,null,0]
[11,0]
[12,6]
[13,4]
[14,14]
[15,1,null,null,"THIS CHART DOES NOT GO IN PLAN SETS"]
[16,19]
[17,4]
[18,7]
[19,15]
[20,1]
[21,0]
[22,22]
[23,2]
[24,6]
[25,11]
[26,7]
[27,6]
[28,13]
[29,5]
[30,2]
[31,12]
[32,2]
[33,2]
[34,1]
[35,14]
[36,11]
[37,5]
[38,7]
["TOTAL",{"$f":"SUM(B3:B40)","v":327}]

{"sheet":"D REM","index":19,"n_rows":41,"n_cols":5,"rows_kept":41,"cut":false,"hidden":false,"merged":[[0,0,0,1],[16,4,18,8]]}
["REMOVE SIGN TYPE D"]
["PAGE NO.","QUANTITY"]
[1,24]
[2,5]
[3,3]
[4,4]
[5,9]
[6,8]
[7,25]
[8,42]
[9,6]
[10,2,null,0]
[11,0]
[12,6]
[13,4]
[14,14]
[15,1,null,null,"THIS CHART DOES NOT GO IN PLAN SETS"]
[16,19]
[17,4]
[18,7]
[19,15]
[20,1]
[21,0]
[22,22]
[23,2]
[24,6]
[25,11]
[26,7]
[27,6]
[28,13]
[29,5]
[30,2]
[31,12]
[32,2]
[33,2]
[34,1]
[35,14]
[36,11]
[37,5]
[38,7]
["TOTAL",{"$f":"SUM(B3:B40)","v":327}]

{"sheet":"D REM PANEL","index":20,"n_rows":21,"n_cols":7,"rows_kept":21,"cut":false,"hidden":false,"merged":[[2,1,5,1],[2,2,5,2],[1,4,1,6],[1,1,1,3],[2,3,2,6],[3,4,5,6],[3,3,5,3]]}
[]
[null,"REMOVE SIGN PANEL TYPE D",null,null,"ST-B"]
[null,"SIGN\nNUMBER","QUANTITY\n(EACH)","PANEL"]
[null,null,null,"LEGEND","(1)\nSIZE\n(INCHES)"]
[]
[]
[null,"D-101",1,"ROCKVILLE COLD SPRING PAYNESVILLE / WAITE PARK",72,"x",60]
[null,"D-102",1,"3RD ST R",96,"x",72]
[null,"D-103",1,"VANBUREN AVE DBL",114,"x",48]
[null,"D-104",0,null,90,"x",54]
[null,"D-105",0,null,72,"x",72]
[null,"D-106",0,null,54,"x",66]
[null,"D-107",0,null,54,"x",66]
[null,"D-108",0,null,72,"x",72]
[null,"TOTAL",{"$f":"SUM(C7:C14)","v":3}]
[]
[]
[null,"SPECIFIC NOTE(S):"]
[null,"(1) SIZES ARE APPROXIMATE"]
[]
[null,"GENERAL NOTE(S):"]

{"sheet":"D SIGN","index":21,"n_rows":54,"n_cols":15,"rows_kept":54,"cut":false,"hidden":false,"merged":[[2,14,5,14],[3,3,5,4],[2,1,5,1],[2,10,2,13],[3,10,5,10],[2,2,5,2],[2,3,2,8],[1,1,1,13],[3,5,5,7],[3,8,5,8],[10,3,10,4],[9,3,9,4],[6,3,6,4],[7,3,7,4],[8,3,8,4],[3,11,5,11],[3,13,5,13],[2,9,5,9],[3,12,5,12],[35,2,37,12],[38,2,40,12],[41,2,43,12],[44,2,46,12],[11,3,11,4]]}
[]
[null,"SIGN PANELS TYPE D",null,null,null,null,null,null,null,null,null,null,null,null,"ST-D"]
[null,"SIGN\nNUMBER","QUANTITY","PANEL",null,null,null,null,null,"MOUNTING\nHEIGHT\n(FEET)","POSTS / MOUNTING",null,null,null,"TOTAL\nAREA\n(SQ FT)"]
[null,null,null,"LEGEND",null,"SIZE\n(INCH)",null,null,"AREA\n(SQ FT)",null,"NUMBER OF\nPOSTS","POST TYPE","RISER POST\nSIZE\n(INCHES)","SURFACE TYPE"]
[]
[]
[null,"D-1",2,"182ND AVE DOUBLE HEADED ARROW",null,102,"x",48,{"$f":"(F7*H7)/144","v":34},7,3,"SQ","2-1/2","SOIL",{"$f":"I7*C7","v":68}]
[null,"D-2",1,"STILLWATER 10",null,96,"x",18,12,7,2,"SQ","2-1/2","SOIL",{"$f":"I8*C8","v":12}]
[null,"D-3",2,"JCT 94 1/4 MILE",null,72,"x",66,33,7,2,"SQ","2-1/2","SOIL",{"$f":"I9*C9","v":66}]
[null,"D-4",2,"MN 95 DOUBLE ARROW",null,42,"x",54,15.75,7,1,"SQ","2","SOIL",{"$f":"I10*C10","v":31.5}]
[null,"D-5",1,"EXIT 129 ARW",null,72,"x",84,42,7,3,"SQ","2-1/2","CONCRETE",{"$f":"I11*C11","v":42}]
[null,"TOTAL",null,null,null,null,null,null,null,null,null,null,null,null,{"$f":"SUM(O7:O11)","v":219.5}]
[null,null,null,null,null,null," "]
[]
[null,"SPECIFIC NOTE(S):"]
[]
[null,"GENERAL NOTE(S):"]
[null,"1.  MOUNTING HEIGHT IS MINIMUM (WITH A +6 INCH TOLERANCE)  "]
[null,"2.  POST TYPE ABBREVIATIONS (SQ = SQUARE TUBE,  R = ROUND POST, CR = CONCRETE RAIL - POST TYPE, BR-SN = BRIDGE MOUNTED STREET NAME, BR-MG = BRIDGE MOUNTED MINOR GUIDE)"]
[null,"3.  SEE THE CURRENT MnDOT STANDARD SIGNS AND MARKINGS MANUAL FOR STANDARD SIGN DESIGNS, SPLICE PLATES, STRINGERS AND PUNCHING CODES. "]
[null,"4.  SEE PANEL LAYOUTS FOR PANEL DESIGNS."]
[null,"5.  SEE SQUARE TUBE SIGN MOUNTING DETAIL FOR ATTACHMENT."]
[null,"6.  SEE STANDARD PLAN 5-297.701 FOR PLACEMENT."]
[null,"7.  SEE SQUARE TUBE SLIP BASE DETAIL FOR 2-1/2 INCH RISER POST.      "]
[null,"8.  SEE SQUARE TUBE FIN BASE DETAIL FOR 2 INCH RISER POST IN SOIL."]
[null,"9.  SEE SQUARE TUBE SHEAR BOLT BASE DETAIL FOR 2 INCH RISER POST ON CONCRETE."]
[null,"10. SEE STANDARD PLAN 5-297.721 FOR 1-3/4 INCH RISER POST USE SQUARE TUBE THREE WALL BASE. "]
[null,"11. SEE STANDARD PLAN 5-297.730 FOR SIGN MOUNTING TO ROUND POST."]
[null,"12. SEE STANDARD PLAN 5-297.703 FOR SIGN PLACEMENT AT RAMP GORES."]
[null,"13. SEE STANDARD PLAN 5-297.740 FOR CONCRETE RAIL MOUNTED SIGN STRUCTURES."]
[null,"14. SEE CONCRETE WALL MOUNTED SIGN DETAIL FOR WALL MOUNTED SIGN STRUCTURES."]
[null,"15. SEE STANDARD PLAN 5-297.741 FOR STRUCTURAL DETAIL FOR BRIDGE MOUNTED STREET NAME SIGNS."]
[null,"16. SEE STANDARD PLAN 5-297.742 FOR STRUCTURAL DETAIL FOR BRIDGE MOUNTED MINOR GUIDE SIGNS."]
[]
[]
[]
[]
[]
[]
[]
[]
[]
[]
[]
[]
[]
[]
[]
[]
[]
[]
[null,null,null,null,"POST SPACING INFORMATION IS FOUND ON THE WINDLOAD CHART"]
[null,null,null,null,"SEE OTE WEBSITE FOR WINDLOAD CHART (found under \"Design Tools\")"]
[null,null,null,null,"http://www.dot.state.mn.us/trafficeng/signing/plans.html "]

{"sheet":"D SIGN INSTALL","index":22,"n_rows":32,"n_cols":16,"rows_kept":32,"cut":false,"hidden":false,"merged":[[9,3,9,4],[10,3,10,4],[3,14,5,14],[4,3,4,4],[5,3,5,4],[3,3,3,4],[3,10,5,10],[3,11,5,11],[3,5,5,7],[3,8,5,8],[5,15,5,16],[6,3,6,4],[7,3,7,4],[8,3,8,4],[2,10,2,14],[2,15,4,16],[3,12,5,12],[2,1,5,1],[2,2,5,2],[2,3,2,8],[2,9,5,9],[1,1,1,12],[34,2,36,13],[37,2,39,13],[40,2,42,13],[43,2,45,13],[11,3,11,4]]}
[]
[null,"INSTALL SIGN TYPE D",null,null,null,null,null,null,null,null,null,null,null,null,"ST-S"]
[null,"SIGN\nNUMBER","SIGNS\nQUANTITY\n(EACH)","PANEL",null,null,null,null,null,"MOUNTING\nHEIGHT\n(FEET)","POSTS / MOUNTING",null,null,null,null,"TOTAL\nAREA"]
[null,null,null,null,null,"SIZE\n(INCHES)",null,null,"AREA\n(SQ FT)",null,"NUMBER OF\nPOSTS","POST\nTYPE","RISER POST\nSIZE\n(INCHES)","KNEE","SURFACE TYPE"]
[null,null,null,"LEGEND",null,null,null,null,null,null,null,null,null,"BRACES"]
[null,null,null,null,null,null,null,null,null,null,null,null,null,"QTY",null,"SQ FT"]
[null,"D-301",2,"182ND AVE DOUBLE HEADED ARROW",null,102,"x",48,{"$f":"(F7*H7)/144","v":34},7,3,"SQ","2-1/2",1,"SOIL",{"$f":"I7*C7","v":68}]
[null," ",1,"STILLWATER 10",null,96,"x",18,12,7,1,"SQ","2-1/2",1,"SOIL",{"$f":"I8*C8","v":12}]
[null," ",1,"JCT 94 1/4 MILE",null,72,"x",66,33,7,2,"SQ","2-1/2",1,"SOIL",{"$f":"I9*C9","v":33}]
[null," ",2,"MN 95 DOUBLE ARROW",null,42,"x",54,15.75,7,1,"SQ","2",1,"CONCRETE",{"$f":"I10*C10","v":31.5}]
[null," ",1,"TREASURE ISLAND CASINO",null,114,"x",60,47.5,7,3,"SQ","2-1/2",1,"SOIL",{"$f":"I11*C11","v":47.5}]
[null,"TOTAL",{"$f":"SUM(C7:C11)","v":7},null,null,null,null,null,null,null,null,null,null,null,null,{"$f":"SUM(P7:P11)","v":192}]
[null,null,null,null,null,null," "]
[null,null,null,null,null,null,null,null,null,null,null,null,null,null," "]
[null,"SPECIFIC NOTE(S):"]
[]
[null,"GENERAL NOTE(S):"]
[null,"1.  MOUNTING HEIGHT IS MINIMUM (WITH A +6 INCH TOLERANCE)  "]
[null,"2.  POST TYPE ABBREVIATIONS (SQ = SQUARE TUBE,  R = ROUND POST, CR = CONCRETE RAIL - POST TYPE, BR-SN = BRIDGE MOUNTED STREET NAME, BR-MG = BRIDGE MOUNTED MINOR GUIDE)"]
[null,"3.  SEE THE CURRENT MnDOT STANDARD SIGNS AND MARKINGS MANUAL FOR STANDARD SIGN DESIGNS, SPLICE PLATES, STRINGERS AND PUNCHING CODES. "]
[null,"4.  SEE SQUARE TUBE SIGN MOUNTING DETAIL FOR ATTACHMENT."]
[null,"5.  SEE STANDARD PLAN 5-297.701 FOR PLACEMENT."]
[null,"6.  SEE SQUARE TUBE SLIP BASE DETAIL FOR 2-1/2 INCH RISER POST.      "]
[null,"7.  SEE SQUARE TUBE FIN BASE DETAIL FOR 2 INCH RISER POST IN SOIL."]
[null,"8.  SEE SQUARE TUBE SHEAR BOLT BASE DETAIL FOR 2 INCH RISER POST ON CONCRETE."]
[null,"9.  SEE STANDARD PLAN 5-297.721 FOR 1-3/4 INCH RISER POST USE SQUARE TUBE THREE WALL BASE. "]
[null,"10. SEE STANDARD PLAN 5-297.730 FOR SIGN MOUNTING TO ROUND POST."]
[null,"11. SEE STANDARD PLAN 5-297.703 FOR SIGN PLACEMENT AT RAMP GORES."]
[null,"12. SEE STANDARD PLAN 5-297.741 FOR STRUCTURAL DETAIL FOR BRIDGE MOUNTED STREET NAME SIGNS."]
[null,"13. SEE STANDARD PLAN 5-297.742 FOR STRUCTURAL DETAIL FOR BRIDGE MOUNTED MINOR GUIDE SIGNS."]
[null,"14. SEE STANDARD PLAN 5-297.740 FOR CONCRETE RAIL MOUNTED SIGN STRUCTURES."]
[null,"15. SEE CONCRETE WALL MOUNTED SIGN DETAIL FOR WALL MOUNTED SIGN STRUCTURES."]

{"sheet":"D SIGN S & I","index":23,"n_rows":31,"n_cols":16,"rows_kept":31,"cut":false,"hidden":false,"merged":[[2,15,4,16],[1,1,1,12],[2,10,2,14],[3,3,3,4],[3,10,5,10],[5,15,5,16],[2,1,5,1],[2,2,5,2],[2,3,2,8],[3,5,5,7],[3,8,5,8],[10,3,10,4],[3,11,5,11],[3,14,5,14],[4,3,4,4],[5,3,5,4],[6,3,6,4],[7,3,7,4],[8,3,8,4],[9,3,9,4],[2,9,5,9],[3,12,5,12],[33,2,35,13],[36,2,38,13],[39,2,41,13],[42,2,44,13],[11,3,11,4]]}
[]
[null,"SALVAGE AND INSTALL SIGN TYPE D",null,null,null,null,null,null,null,null,null,null,null,null,"ST-T"]
[null,"SIGN\nNUMBER","SIGNS\nQUANTITY\n(EACH)","PANEL",null,null,null,null,null,"MOUNTING\nHEIGHT\n(FEET)","NEW POSTS / MOUNTING",null,null,null,null,"TOTAL\nAREA"]
[null,null,null,null,null,"SIZE\n(INCHES)",null,null,"AREA\n(SQ FT)",null,"NUMBER OF\nPOSTS","POST\nTYPE","RISER POST\nSIZE\n(INCHES)","KNEE","SURFACE TYPE"]
[null,null,null,"LEGEND",null,null,null,null,null,null,null,null,null,"BRACES"]
[null,null,null,null,null,null,null,null,null,null,null,null,null,"QTY",null,"SQ FT"]
[null,"D-201",2,"182ND AVE DOUBLE HEADED ARROW",null,102,"x",48,{"$f":"(F7*H7)/144","v":34},7,3,"SQ","2-1/2",1,"SOIL",{"$f":"I7*C7","v":68}]
[null," ",1,"STILLWATER 10",null,96,"x",18,12,7,1,"SQ","2-1/2",1,"SOIL",{"$f":"I8*C8","v":12}]
[null," ",1,"JCT 94 1/4 MILE",null,72,"x",66,33,7,2,"SQ","2-1/2",1,"SOIL",{"$f":"I9*C9","v":33}]
[null," ",2,"MN 95 DOUBLE ARROW",null,42,"x",54,15.75,7,1,"SQ","2",1,"CONCRETE",{"$f":"I10*C10","v":31.5}]
[null," ",1,"TREASURE ISLAND CASINO",null,114,"x",60,47.5,7,3,"SQ","2-1/2",1,"SOIL",{"$f":"I11*C11","v":47.5}]
[null,"TOTAL",{"$f":"SUM(C7:C11)","v":7},null,null,null,null,null,null,null,null,null,null,null,null,{"$f":"SUM(P7:P11)","v":192}]
[null,null,null,null,null,null," "]
[null,"SPECIFIC NOTE(S):"]
[]
[null,"GENERAL NOTE(S):"]
[null,"1.  MOUNTING HEIGHT IS MINIMUM (WITH A +6 INCH TOLERANCE)  "]
[null,"2.  POST TYPE ABBREVIATIONS (SQ = SQUARE TUBE,  R = ROUND POST, CR = CONCRETE RAIL - POST TYPE, BR-SN = BRIDGE MOUNTED STREET NAME, BR-MG = BRIDGE MOUNTED MINOR GUIDE)"]
[null,"3.  SEE THE CURRENT MnDOT STANDARD SIGNS AND MARKINGS MANUAL FOR STANDARD SIGN DESIGNS, SPLICE PLATES, STRINGERS AND PUNCHING CODES. "]
[null,"4.  SEE SQUARE TUBE SIGN MOUNTING DETAIL FOR ATTACHMENT."]
[null,"5.  SEE STANDARD PLAN 5-297.701 FOR PLACEMENT."]
[null,"6.  SEE SQUARE TUBE SLIP BASE DETAIL FOR 2-1/2 INCH RISER POST.      "]
[null,"7.  SEE SQUARE TUBE FIN BASE DETAIL FOR 2 INCH RISER POST IN SOIL."]
[null,"8.  SEE SQUARE TUBE SHEAR BOLT BASE DETAIL FOR 2 INCH RISER POST ON CONCRETE."]
[null,"9.  SEE STANDARD PLAN 5-297.721 FOR 1-3/4 INCH RISER POST USE SQUARE TUBE THREE WALL BASE. "]
[null,"10. SEE STANDARD PLAN 5-297.730 FOR SIGN MOUNTING TO ROUND POST."]
[null,"11. SEE STANDARD PLAN 5-297.703 FOR SIGN PLACEMENT AT RAMP GORES."]
[null,"12. SEE STANDARD PLAN 5-297.741 FOR STRUCTURAL DETAIL FOR BRIDGE MOUNTED STREET NAME SIGNS."]
[null,"13. SEE STANDARD PLAN 5-297.742 FOR STRUCTURAL DETAIL FOR BRIDGE MOUNTED MINOR GUIDE SIGNS."]
[null,"14. SEE STANDARD PLAN 5-297.740 FOR CONCRETE RAIL MOUNTED SIGN STRUCTURES."]
[null,"15. SEE CONCRETE WALL MOUNTED SIGN DETAIL FOR WALL MOUNTED SIGN STRUCTURES."]

{"sheet":"D SAL","index":24,"n_rows":19,"n_cols":8,"rows_kept":19,"cut":false,"hidden":false,"merged":[[6,6,6,7],[7,6,7,7],[8,6,8,7],[9,6,9,7],[5,6,5,7],[3,3,5,5],[4,10,4,11],[1,1,1,6],[3,6,3,7],[4,6,4,7],[2,1,5,1],[2,2,5,2],[2,3,2,7],[18,1,18,6],[16,1,16,6],[17,1,17,6],[7,1,8,1],[11,6,11,7],[12,6,12,7],[13,6,13,7],[14,6,14,7],[10,6,10,7],[7,2,8,2]]}
[]
[null,"SALVAGE SIGN TYPE D",null,null,null,null,null,"ST-W"]
[null,"SIGN\nNUMBER","SIGNS\nQUANTITY\n(EACH)","PANEL"]
[null,null,null,"SIZE\n(INCHES)"]
[null,null,null,null,null,null,"LEGEND"]
[]
[null,"D-101",1,48,"x",60,"EXIT 40 MPH"]
[null,"D-102",2,24,"x",15,"NORTH"]
[null,null,null,24,"x",24,"INTERSTATE 35"]
[null,null,null,null,"x"]
[null,null,null,null,"x"]
[null,null,null,null,"x"]
[null,null,null,null,"x"]
[null,null,null,null,"x"]
[null,"TOTAL",{"$f":"SUM(C7:C14)","v":3}]
[null,null,null,null," "]
[null,"SPECIFIC NOTE(S):"]
[]
[null,"GENERAL NOTE(S):"]

{"sheet":"MASTARM","index":25,"n_rows":58,"n_cols":10,"rows_kept":58,"cut":false,"hidden":false,"merged":[[34,1,34,9],[36,1,36,9],[22,1,22,9],[37,1,40,1],[37,2,40,2],[37,3,37,9],[38,3,40,3],[38,4,40,4],[38,5,40,5],[38,6,40,8],[38,9,40,9],[1,1,1,9],[4,13,4,14],[2,1,5,1],[2,2,5,2],[2,3,2,9],[3,3,5,3],[3,4,5,4],[3,5,5,5],[3,6,5,8],[3,9,5,9]]}
[]
[null,"SIGN PANELS ON SIGNALS"]
[null,"POLE\nNUMBER","\"A\"\nDISTANCE\n(FEET)\nOR POLE","PANEL"]
[null,null,null,"QTY","CODE\nNUMBER","LEGEND","SIZE\n(INCHES)",null,null,"AREA\n(SQ FT)"]
[]
[]
[null,1,0,1,"R10-X12","LEFT TURN YIELD ON FLASHING YELLOW ARROW",42,"x",48,{"$f":"(G7*I7)/144","v":14}]
[null,1,27,1," ","GRAND AVE",84,"x",24,{"$f":"(G8*I8)/144","v":14}]
[null,1,"POLE",1,"R6-1R","ONE WAY RIGHT",54,"x",18,{"$f":"(G9*I9)/144","v":6.75}]
[null,1,"POLE",1,"R6-1L","ONE WAY LEFT",54,"x",18,{"$f":"(G10*I10)/144","v":6.75}]
[null,2,0,1,"R10-X12","LEFT TURN YIELD ON FLASHING YELLOW ARROW",42,"x",48,{"$f":"(G11*I11)/144","v":14}]
[null,2,13,1," ","MN156 DBL",48,"x",54,{"$f":"(G12*I12)/144","v":18}]
[null,2,"POLE",1,"R6-1R","ONE WAY RIGHT",54,"x",18,{"$f":"(G13*I13)/144","v":6.75}]
[null,2,"POLE",1,"R6-1L","ONE WAY LEFT",54,"x",18,{"$f":"(G14*I14)/144","v":6.75}]
[null,4,0,1,"R10-X12","LEFT TURN YIELD ON FLASHING YELLOW ARROW",42,"x",48,14]
[null,4,27,1," ","GRAND AVE",84,"x",24,14]
[null,4,"POLE",1,"R6-1R","ONE WAY RIGHT",54,"x",18,{"$f":"(G17*I17)/144","v":6.75}]
[null,4,"POLE",1,"R6-1L","ONE WAY LEFT",54,"x",18,{"$f":"(G18*I18)/144","v":6.75}]
[null,5,0,1,"R10-X12","LEFT TURN YIELD ON FLASHING YELLOW ARROW",42,"x",48,14]
[null,5,13,1," ","MN156 DBL",48,"x",54,18]
[null,5,"POLE",1,"R6-1R","ONE WAY RIGHT",54,"x",18,{"$f":"(G21*I21)/144","v":6.75}]
[null,5,"POLE",1,"R6-1L","ONE WAY LEFT",54,"x",18,{"$f":"(G22*I22)/144","v":6.75}]
[]
[null,"SPECIFIC NOTE(S):"]
[]
[null,"GENERAL NOTE(S):"]
[null,"1.  SEE THE CURRENT MnDOT STANDARD SIGNS AND MARKINGS MANUAL FOR STANDARD SIGN DESIGNS, ARROW DETAILS AND SPLICE PLATE DETAILS. "]
[null,"2.  FOR NON STANDARD SIGN DESIGNS, LAYOUTS ARE INCLUDED. SIGN PANEL DIMENSIONS ARE IN INCHES."]
[null,"3.  SEE STANDARD PLAN 5-297.731 FOR SIGN MOUNTING TO MAST ARM."]
[null,"4.  SEE STANDARD PLAN 5-297.730 FOR SIGN MOUNTING TO ROUND POST."]
[null,"5.  MOUNTING HEIGHT OF POLE MOUNTED SIGN PANELS MUST BE 7 FOOT MINIMUM. "]
[null,"    MOUNTING HEIGHT IS MEASURED FROM BOTTOM OF SIGN PANEL TO SURFACE IMMEDIATELY BELOW THE SIGN PANEL. "]
[null,"6.  \"A\" DISTANCE = DISTANCE FROM THE END OF THE MAST ARM TO THE EDGE OF EACH SIGN PANEL. "]
[]
[]
[]
[null,"SIGN PANELS ON MAST ARMS"]
[null,"SIGN\nNUMBER","\"A\"\nDISTANCE\n(FEET)\nOR POLE","PANEL"]
[null,null,null,"QTY","CODE\nNUMBER","LEGEND","SIZE\n(INCHES)",null,null,"AREA\n(SQ FT)"]
[]
[]
[null,"C-45",0,1,"R10-X12","LEFT TURN YIELD ON FLASHING YELLOW ARROW",42,"x",48,{"$f":"(G42*I42)/144","v":14}]
[null,"D-13",27,1," ","GRAND AVE",84,"x",24,{"$f":"(G43*I43)/144","v":14}]
[null,"C-45",0,1,"R10-X12","LEFT TURN YIELD ON FLASHING YELLOW ARROW",42,"x",48,{"$f":"(G44*I44)/144","v":14}]
[null,"D-14",13,1," ","MN156 DBL",48,"x",54,{"$f":"(G45*I45)/144","v":18}]
[null,"C-45",0,1,"R10-X12","LEFT TURN YIELD ON FLASHING YELLOW ARROW",42,"x",48,{"$f":"(G46*I46)/144","v":14}]
[null,"D-12",27,1," ","GRAND AVE",84,"x",24,14]
[null,"C-45",0,1,"R10-X12","LEFT TURN YIELD ON FLASHING YELLOW ARROW",42,"x",48,{"$f":"(G48*I48)/144","v":14}]
[null,"D-14",13,1," ","MN156 DBL",48,"x",54,18]
[null,"TOTAL",null,null,null,null,null,null,null,{"$f":"SUM(J42:J49)","v":120}]
[]
[null,"SPECIFIC NOTE(S):"]
[]
[null,"GENERAL NOTE(S):"]
[null,"1.  SEE THE CURRENT MnDOT STANDARD SIGNS AND MARKINGS MANUAL FOR STANDARD SIGN DESIGNS, ARROW DETAILS AND SPLICE PLATE DETAILS. "]
[null,"2.  FOR NON STANDARD SIGN DESIGNS, LAYOUTS ARE INCLUDED. SIGN PANEL DIMENSIONS ARE IN INCHES."]
[null,"3.  SEE STANDARD PLAN 5-297.731 FOR SIGN MOUNTING TO MAST ARM."]
[null,"4.  \"A\" DISTANCE = DISTANCE FROM THE END OF THE MAST ARM TO THE EDGE OF EACH SIGN PANEL. "]

{"sheet":"DEL & MARK","index":26,"n_rows":47,"n_cols":8,"rows_kept":47,"cut":false,"hidden":false,"merged":[[2,7,3,7],[27,6,28,6],[1,1,1,6],[26,1,26,5],[2,1,3,1],[2,2,3,2],[2,6,3,6],[27,1,28,1],[27,2,28,2],[27,3,28,5],[2,3,3,5]]}
[]
[null,"DELINEATOR / MARKER SIGN",null,null,null,null,null,"ST-W"]
[null,"CODE\nNUMBER","DESCRIPTION","SIZE\n(INCHES)",null,null,"SURFACE\nTYPE","QUANTITY\n(EACH)"]
[]
[null,"OM1-2","OBJECT MARKER / YELLOW ON BLACK",18,"x",18,"SOIL",1]
[null,"OM3-L","OBJECT MARKER LEFT / BLACK ON YELLOW",12,"x",36,"SOIL",1]
[null,"OM3-C","OBJECT MARKER CENTER / BLACK ON YELLOW",12,"x",24,"CONCRETE",1]
[null,"OM3-R","OBJECT MARKER RIGHT / BLACK ON YELLOW",12,"x",36,"CONCRETE",1]
[null,"X2-2","BRIDGE NUMBER / 12345",6,"x",18,"SOIL",1]
[null,"X4-1","GUIDE DELINEATOR / BLACK ON WHITE",8,"x",24,"SOIL",1]
[null,"X4-1","GUIDE DELINEATOR / BLACK ON YELLOW",8,"x",24,"SOIL",1]
[null,"X4-2","1/10 MILE DELINEATOR / WHITE",4,"x",4,"SOIL",1]
[null,"X4-3","WRAP AROUND DELINEATOR / BLACK ON WHITE",3,"x",12,"SOIL",1]
[null,"X4-3","WRAP AROUND DELINEATOR / BLACK ON YELLOW",3,"x",12,"SOIL",1]
[null,"TOTAL",null,null,null,null,null,{"$f":"SUM(H5:H14)","v":10}]
[]
[null,"SPECIFIC NOTE(S):"]
[]
[null,"GENERAL NOTE(S):"]
[null,"1.  SEE THE CURRENT MnDOT STANDARD SIGNS AND MARKINGS MANUAL FOR STANDARD SIGN DESIGNS AND PUNCHING CODES. "]
[null,"2.  SEE SQUARE TUBE SIGN MOUNTING DETAIL FOR ATTACHMENT."]
[null,"3.  SEE STANDARD PLAN 5-297.702 FOR PLACEMENT."]
[null,"4.  SEE STANDARD PLAN 5-297.721 FOR SQUARE TUBE THREE WALL BASE STRUCTURE."]
[null,"5.  SEE STANDARD PLAN 5-297.703 FOR PLACEMENT IN GORES."]
[]
[]
[null,"DELINEATOR / MARKER PANEL",null,null,null,null,"ST-Y"]
[null,"CODE\nNUMBER","DESCRIPTION","SIZE\n(INCHES)",null,null,"QUANTITY\n(EACH)"]
[]
[null,"OM1-2","OBJECT MARKER / YELLOW ON BLACK",18,"x",18,1]
[null,"OM3-L","OBJECT MARKER LEFT / BLACK ON YELLOW",12,"x",36,1]
[null,"OM3-C","OBJECT MARKER CENTER / BLACK ON YELLOW",12,"x",24,1]
[null,"OM3-R","OBJECT MARKER RIGHT / BLACK ON YELLOW",12,"x",36,1]
[null,"X2-1","OH SIGN ID PLATE / 494-121",12,"x",6,1]
[null,"X4-1","GUIDE DELINEATOR / BLACK ON WHITE",8,"x",24,1]
[null,"X4-1","GUIDE DELINEATOR / BLACK ON YELLOW",8,"x",24,1]
[null,"X4-3","WRAP AROUND DELINEATOR / BLACK ON WHITE",3,"x",12,1]
[null,"X4-3","WRAP AROUND DELINEATOR / BLACK ON YELLOW",3,"x",12,1]
[null,"TOTAL",null,null,null,null,{"$f":"SUM(G30:H38)","v":9}]
[]
[null,"SPECIFIC NOTE(S):"]
[]
[null,"GENERAL NOTES:"]
[null,"1.  SEE THE CURRENT MnDOT STANDARD SIGNS AND MARKINGS MANUAL FOR STANDARD SIGN DESIGNS AND PUNCHING CODES. "]
[null,"2.  SEE SQUARE TUBE SIGN MOUNTING DETAIL FOR ATTACHMENT."]
[null,"3.  SEE STANDARD PLAN 5-297.702 FOR PLACEMENT."]
[null,"4.  SEE STANDARD PLAN 5-297.730 FOR SIGN MOUNTING TO ROUND POST."]

{"sheet":"REF SIGN","index":27,"n_rows":7,"n_cols":2,"rows_kept":7,"cut":false,"hidden":false,"merged":[]}
[]
[]
[]
[]
[null,"DO NOT USE THIS PAY ITEM. "]
[null,"USE PAY ITEM SIGN PANEL TYPE C."]
[null,"MAKE SURE MOUNTING HEIGHT IS 4 FEET."]

{"sheet":"SAL REF SIGN","index":28,"n_rows":5,"n_cols":2,"rows_kept":5,"cut":false,"hidden":false,"merged":[]}
[]
[]
[]
[null,"DO NOT USE THIS PAY ITEM. "]
[null,"USE PAY ITEM SALVAGE SIGN TYPE C."]

{"sheet":"REF SIGN S&I","index":29,"n_rows":5,"n_cols":2,"rows_kept":5,"cut":false,"hidden":false,"merged":[]}
[]
[]
[null,"DO NOT USE THIS PAY ITEM. "]
[null,"USE PAY ITEMS SALVAGE AND INSTALL SIGN TYPE C."]
[null,"MAKE SURE MOUNTING HEIGHT IS 4 FEET."]

{"sheet":"OL","index":30,"n_rows":14,"n_cols":14,"rows_kept":14,"cut":false,"hidden":false,"merged":[[13,1,15,10],[6,9,6,10],[2,3,3,3],[2,9,3,10],[4,9,4,10],[5,9,5,10],[10,2,10,9],[2,4,3,6],[2,7,3,7],[2,8,3,8],[1,18,1,19],[7,4,7,6],[7,9,7,10],[1,2,1,9],[2,2,3,2]]}
[null,null,null,null,null,null,null,null,null,null,null,null,null," "]
[null,null,"SIGN PANELS TYPE OVERLAY",null,null,null,null,null,null,null,"ST-K"]
[null,null,"CODE\nNUMBER","QUANTITY","SIZE\n(INCHES)",null,null,"AREA\n(SQ FT)","TOTAL\n(SQ FT)","LEGEND"]
[]
[null,null,null,0,null,"x",null,{"$f":"E5*G5/144","v":0},{"$f":"D5*H5","v":0}]
[null,null,null,0,null,"x",null,{"$f":"E6*G6/144","v":0},{"$f":"D6*H6","v":0}]
[null,null," ",0," ","x"," ",{"$f":"E7*G7/144","v":0},{"$f":"D7*H7","v":0}," "]
[null,null,"TOTAL",null,null,null,null,null,{"$f":"SUM(I5:I7)","v":0}]
[]
[]
[null,null,"SPECIFIC NOTE(S):"]
[]
[null,null,"GENERAL NOTE(S):"]
[null,"* ONLY USE FOR OVERLAYING A PORTION OF AN EXISTING SIGN"]

{"sheet":"S&I SPEC","index":31,"n_rows":17,"n_cols":13,"rows_kept":17,"cut":false,"hidden":false,"merged":[[12,1,12,6],[8,3,8,8],[2,1,5,1],[2,2,5,2],[2,4,5,4],[2,5,2,8],[3,5,5,5],[3,6,5,6],[3,8,5,8],[10,1,10,6],[1,1,1,7],[4,11,4,12],[6,1,7,1],[6,2,7,2],[6,4,7,4],[6,5,7,5],[6,6,7,6],[6,7,7,7],[6,8,7,8],[3,7,5,7]]}
[]
[null,"SALVAGE & INSTALL SIGN TYPE SPECIAL",null,null,null,null,null,null,"ST-W"]
[null,"SIGN\nNUMBER","QUANTITY\n(EACH)",null,"MOUNTING\nHEIGHT\n(FEET)","NEW POSTS / MOUNTING"]
[null,null,null,"PANEL",null,"NUMBER OF POSTS","POST\nTYPE","RISER POST \nSIZE\n(INCHES)","SURFACE TYPE"]
[null,null,null,"LEGEND",null,null,null,null,null,null,null,"DEFAULT VALUES"]
[null,null,null,null,null,null,null,null,null,null,null,"POST LB","POST TYPE"]
[null,"S-201",1,"ROCHESTER BLVD",7,1,"SQ",2,"SOIL",null,null,"2.5","U"]
[null,null,null,"250TH ST E",null,null,null,null,null,null,null,"2.5","U"]
[null,"TOTAL ",{"$f":"SUM(C7:C8)","v":1}]
[]
[null,"SPECIFIC NOTE(S):"]
[]
[null,"GENERAL NOTE(S):"]
[null,"1.  MOUNTING HEIGHT IS MINIMUM (WITH A +6 INCH TOLERANCE)  "]
[null,"2.  POST TYPE ABBREVIATIONS (SQ = SQUARE TUBE,  R = ROUND POST, CR = CONCRETE RAIL - POST TYPE)"]
[null,"3.  SEE SQUARE TUBE FIN BASE DETAIL FOR 2 INCH RISER POST IN SOIL."]
[null,"4.  SEE STANDARD PLAN 5-297.701 FOR PLACEMENT."]

{"sheet":"A REM FOOT","index":32,"n_rows":26,"n_cols":5,"rows_kept":26,"cut":false,"hidden":false,"merged":[[15,3,15,4],[10,3,10,4],[11,3,11,4],[12,3,12,4],[13,3,13,4],[14,3,14,4],[5,3,5,4],[6,3,6,4],[7,3,7,4],[8,3,8,4],[9,3,9,4],[1,1,1,3],[2,2,3,2],[2,3,2,4],[3,3,3,4],[4,3,4,4]]}
[]
[null,"REMOVE SIGN FOOTING-TYPE A",null,null,{"$f":"'SEQ-PSTAB'!#REF!","v":{"$error":"#REF!"}}]
[null,"SIGN","LOCATION","FOOTING DEPTH"]
[null,"NUMBER",null,"(FEET)"]
[null,"A I94-528","142+00 SB",6]
[null,"A I90-874","212+75 NB",7.5]
[null,null,null," "]
[null,null,null," "]
[null,null,null," "]
[null,null,null," "]
[null,null,null," "]
[null,null,null," "]
[null,null,null," "]
[null,null,null," "]
[null,null,null," "]
[null,null,null," "]
[]
[]
[null,"TOTAL",{"$f":"COUNTA(B5:B16)","v":2}]
[]
[]
[null,"USER NOTES:"]
[null,"Sign is crushed and the CONCRETE base is left sitting and needs "]
[null,"to be removed before new sign can be installed"]
[null,"INCLUDED IN 2104.509 REMOVE SIGN BASE (EACH)"]
[null,"Remember that there are two footings for each sign!!  "]

{"sheet":"SIGN PANELS TYPE A EXTRUDED","index":33,"n_rows":23,"n_cols":9,"rows_kept":23,"cut":false,"hidden":false,"merged":[[1,1,1,7],[2,3,2,6],[3,3,3,6],[6,7,6,8],[7,7,7,8],[2,2,5,2],[2,7,2,8],[3,7,3,8],[4,7,4,8],[5,7,5,8],[4,3,5,5],[4,6,5,6]]}
[]
[null," SIGN PANELS TYPE A (EXTRUDED)",null,null,null,null,null,null,{"$f":"'SEQ-PSTAB'!#REF!","v":{"$error":"#REF!"}}]
[null,null,"LOCATION","F & I",null,null,null,"REQUIRED"]
[null,"SIGN",null,"PANEL SECTIONS",null,null,null,"PANEL"]
[null,"NUMBER",null,"SIZE\n(INCHES)",null,null,"AREA\n(SQ FT)","SIZE"]
[null,null,null,null,null,null,null,"(INCH)"]
[null,"A I35-025","142+00 SB",0,"x",12,{"$f":"D7*F7/144","v":0},"132 x 102"]
[null,"A I35-026","212+75 NB",0,"x",12,{"$f":"D8*F8/144","v":0},"138 x 96"]
[null,null,null,null,"x",null,0]
[null,null,null,null,"x",null,0]
[null,null,null,null,"x",null,0]
[null,null,null,null,"x",null,0]
[null,null,null,null,"x",null,0]
[null,null,null,null,"x",null,0]
[null,null,null,null,"x",null,0]
[null,"TOTAL",null,null,null,null,{"$f":"SUM(G7:G15)","v":0}]
[null,null,null,null," "]
[null,"USER NOTES:"]
[null,"Paid for 2564.531 as Sign Panels Type A (sq. ft.)"]
[null,"wrong title; Rick to get us the correct title"]
[null,"roadway note will say : F and I extruded panel sections.  "]
[null,"this chart pays for the extruded panels but then the sign overlay is INCLUDED IN SIGN PANEL OVERLAY TYPE A."]
[null,"you'll then need a second chart for the whole sign called SIGN PANEL OVERLAY TYPE A."]

{"sheet":"AEXTRM","index":34,"n_rows":17,"n_cols":10,"rows_kept":17,"cut":false,"hidden":false,"merged":[[1,7,1,9],[3,7,3,9],[2,7,2,9],[1,1,1,6],[2,3,2,6],[2,2,4,2],[3,3,3,6],[4,3,4,9],[2,1,4,1]]}
[null,null," "]
[null,"REMOVE EXTRUDED PANEL SECTIONS TYPE A",null,null,null,null,null,"AA"]
[null,"SIGN\nNO","LOCATION","PANEL SIZE",null,null,null,"PANEL SIZE"]
[null,null,null,"EXISTING",null,null,null,"MODIFIED"]
[null,null,null,"INCH"]
[null,"A I94-587","142+00 SB",132,"x",12,null,"102","x","78"]
[null,"A I94-588","212+75 NB",186,"x",12,null,"186","x","102"]
[null,null,null,null,"x",null,null,null,"x"]
[null,null,null,null,"x",null,null,null,"x"]
[null,null,null,null,"x",null,null,null,"x"]
[]
[null,null,null,null," ",null," "]
[null,"NOTE:"]
[null,"1. INCLUDED IN SIGN PANEL OVERLAY TYPE A.  "]
[]
[null,"USER NOTES:"]
[null,"No matching PAY ITEM.  This is incidental to SIGN PANEL OVERLAY TYPE A (thus you need to have a chart for the sign panel overlay type A)"]

{"sheet":"AEXTSA","index":35,"n_rows":20,"n_cols":11,"rows_kept":20,"cut":false,"hidden":false,"merged":[[1,9,1,10],[1,1,1,8],[3,3,3,6],[3,7,3,10],[2,2,4,2],[2,3,2,10],[4,3,4,10],[2,1,4,1]]}
[null,null," "]
[null,"SALVAGE EXTRUDED PANEL SECTIONS TYPE A",null,null,null,null,null,null,null,{"$f":"'SEQ-PSTAB'!#REF!","v":{"$error":"#REF!"}}]
[null,"SIGN\nNO","LOCATION","PANEL SIZE"]
[null,null,null,"EXISTING",null,null,null,"MODIFIED"]
[null,null,null,"INCH"]
[null,"A I94-587","142+00 SB",132,"x",12,null,102,"x",78]
[null,"A I94-588","212+75 NB",186,"x",12,null,186,"x",102]
[null,null,null,null,"x",null,null,null,"x"]
[null,null,null,null,"x",null,null,null,"x"]
[null,null,null,null,"x",null,null,null,"x"]
[null,null,null,null,"x",null,null,null,"x"]
[null,null,null,null,"x",null,null,null,"x"]
[null,null,null,null,"x",null,null,null,"x"]
[null,null,null,null,"x",null,null,null,"x"]
[null,null,null,null,"x",null,null,null,"x"]
[null,null,null,null,"x",null,null,null,"x"]
[null,null,null,null," ",null," ",null," ",null," "]
[null,"What total is transferred to the SEQ?"]
[null,"There is no pay item for this yet.  Haven't used this in years.  Could be incidental to "]
[null,"another pay item."]

{"sheet":"APSTMOD","index":36,"n_rows":26,"n_cols":12,"rows_kept":26,"cut":false,"hidden":false,"merged":[[1,1,1,10],[2,1,2,10],[1,11,2,12],[3,3,3,12],[3,2,6,2],[6,4,6,8],[4,4,4,8],[5,4,5,8],[5,9,5,10],[5,11,5,12],[4,11,4,12],[6,11,6,12],[6,9,6,10],[4,9,4,10]]}
[]
[null,"MODIFY TYPE A SIGN POST",null,null,null,null,null,null,null,null,null,{"$f":"IF('SEQ-PSTAB'!#REF!>0,'SEQ-PSTAB'!#REF!,'SEQ-PSTAB'!#REF!)","v":{"$error":"#REF!"}}]
[null,"SEE SHEETS     FOR DETAILS"]
[null,null,"LOCATION","POST "]
[null,"SIGN",null,null,null,null,null,null,null,"EXTEND",null,"SHORTEN"]
[null,"NO",null,"NO","EXISTING",null,null,null,null,"APPROX",null,"APPROX"]
[null,null,null,null,null,null,null,null,null,"FEET",null,"FEET"]
[null,"A I94-587","142+00 SB",2,"W",6,"x",20,null,1.5]
[null,"A I94-588","212+75 NB",2,"W",8,"x",24,null,null,null,2]
[null," ",null,null,null,null,"x"]
[null," ",null,null,null,null,"x"]
[null,null,null,null,null,null,"x"]
[null,null,null,null,null,null,"x"]
[null,null,null,null,null,null,"x"]
[null,null,null,null,null,null,"x"]
[null,null,null,null,null,null,"x"]
[]
[]
[null,"USER NOTES:"]
[null,"If you remove extruded panel sections you need to saw the posts then you use this chart."]
[null,"If you add extruded panel sections then you need to extend the posts and then you use this chart."]
[null,"Roadway note is going to be \"modify post.\""]
[null,"This chart is used for shortening or extending posts."]
[null,"There is no pay item for this chart, it is incidental to SIGN PANEL OVERLAY TYPE A"]
[]
[null,"TOTAL",{"$f":"COUNTIF(B10:B21,\"<>\"\"\")","v":5},"(this total should not appear on the chart in the plan, but should be automatic in the SEQ-PSTAB)"]

{"sheet":"AREM","index":37,"n_rows":22,"n_cols":25,"rows_kept":22,"cut":false,"hidden":false,"merged":[[1,1,1,22],[1,24,1,25],[4,4,4,7],[4,8,4,11],[2,3,5,3],[5,4,5,11],[5,22,5,23],[2,4,2,11],[2,12,2,25],[3,12,3,21],[4,12,5,16],[4,17,4,21],[5,17,5,21],[2,2,4,2],[3,22,4,23],[3,24,4,25],[5,24,5,25],[3,4,3,7],[3,8,3,11],[21,1,21,3]]}
[]
[null,"REMOVE SIGN TYPE A",null,null,null,null,null,null,null,null,null,null,null,null,null,null,null,null,null,null,null,null,null,null,{"$f":"'SEQ-PSTAB'!#REF!","v":{"$error":"#REF!"}}]
[null,null,"QTY","LOCATION","PANEL SIZE",null,null,null,null,null,null,null,"POSTS"]
[null,"SIGN",null,null,"EXTRUDED",null,null,null,"FLAT",null,null,null,"SIZE",null,null,null,null,null,null,null,null,null,"L1",null,"L2"]
[null,"NO",null,null,"TYPE",null,null,null,"SHEET",null,null,null,"BREAK-AWAY",null,null,null,null,"NON"]
[null,null,"EACH",null,"INCH",null,null,null,null,null,null,null,null,null,null,null,null,"BREAK-AWAY",null,null,null,null,"FEET",null,"FEET"]
[null,"A I94-587",0,"142+00 SB",132,"x",78,null,null,"x",null,null,"W",6,"x",20,null,null,null,"x",null,null,13.5,null,14.5]
[null,"A I94-588",0,"212+75 NB",186,"x",102,null,null,"x",null,null,"W",8,"x",24,null,null,null,"x",null,null,14,null,15]
[null,"A MN65-144",0,null,null,"x",null,null,null,"x",null,null,null,null,"x",null,null,null,null,"x"]
[null,null,null,null,null,"x",null,null,null,"x",null,null,null,null,"x",null,null,null,null,"x"]
[null,null,null,null,null,"x",null,null,null,"x",null,null,null,null,"x",null,null,null,null,"x"]
[null,null,null,null,null,"x",null,null,null,"x",null,null,null,null,"x",null,null,null,null,"x"]
[null,null,null,null,null,"x",null,null,null,"x",null,null,null,null,"x",null,null,null,null,"x"]
[null,null,null,null,null,"x",null,null,null,"x",null,null,null,null,"x",null,null,null,null,"x"]
[null,null,null,null,null,"x",null,null,null,"x",null,null,null,null,"x",null,null,null,null,"x"]
[null,null,null,null,null,"x",null,null,null,"x",null,null,null,null,"x",null,null,null,null,"x"]
[null,null,null,null,null,"x",null,null,null,"x",null,null,null,null,"x",null,null,null,null,"x"]
[null,"TOTAL",{"$f":"SUM(C7:C17)","v":0}]
[]
[]
[null,"GENERAL NOTE:"]
[null,"1. SIZES ARE APPROXIMATE"]

{"sheet":"AS&IHP","index":38,"n_rows":29,"n_cols":23,"rows_kept":29,"cut":false,"hidden":false,"merged":[[1,1,1,19],[2,8,2,19],[3,13,3,19],[4,17,4,19],[2,20,5,20],[2,21,5,21],[5,13,5,14],[4,13,4,16],[3,22,5,22],[6,4,6,7],[6,8,6,12],[5,15,5,16],[5,17,5,18],[2,4,5,7],[3,8,5,12],[6,13,6,19]]}
[]
[null,"SALVAGE & INSTALL SIGN TYPE A "]
[null,null,null,null,"PANEL\nSIZE",null,null,null,"POST",null,null,null,null,null,null,null,null,null,null,null,"SALVAGE\nQTY","INSTALL\nQTY","ADDITIONAL"]
[null,null,null,null,null,null,null,null,"SIZE",null,null,null,null,"LENGTH",null,null,null,null,null,null,null,null,"STRUCT STEEL-\nPOSTS FOR\nTYPE A SIGNS"]
[null,"SIGN","PRESENT","NEW",null,null,null,null,null,null,null,null,null,"EXISTING",null,null,null,"REQUIRED"]
[null,"NO","LOCATION","LOCATION",null,null,null,null,null,null,null,null,null,"L1",null,"L2",null,"L1",null,"L2"]
[null,null,null,null,"INCH",null,null,null,"INCH",null,null,null,null,"FEET",null,null,null,null,null,null,"EACH","EACH","POUND"]
[null,"A US10-154","142+00 SB","143+00 SB",132,"x",78,null,"W",6,"x",20,null,13.5,null,14.5,null,13,null,14,1,1,688]
[null,"A I94-872","212+75 NB","213+00 NB",186,"x",102,null,"W",8,"x",24,null,14,null,15,null,14,null,14.5,1,1,812]
[null,null,null,null,null,"x",null,null,null,null,"x"]
[null,null,null,null,null,"x",null,null,null,null,"x"]
[null,null,null,null,null,"x",null,null,null,null,"x"]
[null,null,null,null,null,"x",null,null,null,null,"x"]
[null,null,null,null,null,"x",null,null,null,null,"x"]
[null,null,null,null,null,"x",null,null,null,null,"x"]
[null,"TOTAL",null,null,null,null,null,null,null,null,null,null,null,null,null,null,null,null,null,null,{"$f":"SUM(U8:U15)","v":2},{"$f":"SUM(V8:V15)","v":2},{"$f":"SUM(W8:W15)","v":1500}]
[null,null,null,null,null," ",null," "]
[]
[null,"USER NOTES:"]
[null,"This chart is used to replace footings."]
[null,"This chart needs to be reviewed by Rick before we use it!!  In fact Rick promises that he will get us a new and BETTER box:)"]
[null,"Use pay items:"]
[null,"SALVAGE SIGN TYPE A"]
[null,"INSTALL SIGN TYPE A"]
[null,"STRUCTURAL STEEL POSTS FOR TYPE A SIGNS"]
[]
[null,"GENERAL NOTES:"]
[null,"1. FOOTING POSTS SHALL NOT BE REINSTALLED"]
[null,"2. PORTION OF RISER POST BETWEEN BASE CONNECTION AND FRICTION FUSE MAY BE SHORTENED BUT SHALL NOT BE LENGTHENED. "]

{"sheet":"ASAL","index":39,"n_rows":23,"n_cols":24,"rows_kept":23,"cut":false,"hidden":false,"merged":[[2,2,5,2],[1,1,1,22],[1,23,1,24],[3,3,3,6],[4,11,5,15],[3,11,3,20],[2,11,2,24],[4,16,4,20],[5,16,5,20],[4,3,4,6],[4,7,4,10],[5,21,5,22],[5,23,5,24],[3,23,4,24],[3,21,4,22],[5,3,5,10],[3,7,3,10],[2,3,2,10]]}
[]
[null,"SALVAGE SIGN TYPE A",null,null,null,null,null,null,null,null,null,null,null,null,null,null,null,null,null,null,null,null,null,{"$f":"'SEQ-PSTAB'!#REF!","v":{"$error":"#REF!"}}]
[null,null,"LOCATION","PANEL SIZE",null,null,null,null,null,null,null,"POSTS"]
[null,"SIGN",null,"EXTRUDED\nTYPE",null,null,null,"FLAT\nSHEET",null,null,null,"SIZE",null,null,null,null,null,null,null,null,null,"L1",null,"L2"]
[null,"NO",null,"TYPE",null,null,null,"SHEET",null,null,null,"BREAK-AWAY",null,null,null,null,"NON"]
[null,null,null,"INCH",null,null,null,null,null,null,null,null,null,null,null,null,"BREAK-AWAY",null,null,null,null,"FEET",null,"FEET"]
[null,"A I90-458","142+00 SB",132,"x",78,null,null,"x",null,null,"W",6,"x",20,null,null,null,"x",null,null,13.5,null,14.5]
[null,"A I90-765","212+75 NB",186,"x",102,null,null,"x",null,null,"W",8,"x",24,null,null,null,"x",null,null,14,null,15]
[null,null,null,null,"x",null,null,null,"x",null,null,null,null,"x",null,null,null,null,"x"]
[null,null,null,null,"x",null,null,null,"x",null,null,null,null,"x",null,null,null,null,"x"]
[null,null,null,null,"x",null,null,null,"x",null,null,null,null,"x",null,null,null,null,"x"]
[null,null,null,null,"x",null,null,null,"x",null,null,null,null,"x",null,null,null,null,"x"]
[null,null,null,null,"x",null,null,null,"x",null,null,null,null,"x",null,null,null,null,"x"]
[null,null,null,null,"x",null,null,null,"x",null,null,null,null,"x",null,null,null,null,"x"]
[null,null,null,null,"x",null,null,null,"x",null,null,null,null,"x",null,null,null,null,"x"]
[null,null,null,null,"x",null,null,null,"x",null,null,null,null,"x",null,null,null,null,"x"]
[null,null,null,null,"x",null,null,null,"x",null,null,null,null,"x",null,null,null,null,"x"]
[null,null,null,null,"x",null,null,null,"x",null,null,null,null,"x",null,null,null,null,"x"]
[]
[null,"Pay item:"]
[null,"SALVAGE SIGN TYPE A"]
[null,"We don't expect that we would use this chart.  It is typically going to be under salvage and install.  "]
[null,"We could use this as a salvage only and not install the sign back."]

{"sheet":" A SIGN 14' PILE (prefered ver)","index":40,"n_rows":28,"n_cols":14,"rows_kept":28,"cut":false,"hidden":false,"merged":[[27,1,30,9],[13,9,13,10],[14,9,14,10],[2,19,2,22],[7,9,7,10],[8,9,8,10],[6,11,6,12],[6,13,6,14],[14,3,14,5],[12,9,12,10],[9,9,9,10],[10,9,10,10],[11,9,11,10],[5,9,5,10],[6,3,6,5],[6,9,6,10],[3,6,5,6],[3,7,6,7],[3,8,6,8],[1,13,1,14],[2,3,2,6],[2,7,2,8],[2,9,2,10],[2,11,5,12],[2,13,5,14],[3,3,5,5],[1,1,1,9],[3,9,3,10],[4,9,4,10]]}
[]
[null,"SIGN TYPE A ",null,null,null,null,null,null,null,null,"XX",null,null,"XX"]
[null,null,null,"PANEL",null,null,null,"POST",null,"TOTAL",null,"\"X\"",null,"\"H\""]
[null,null,null,"SIZE",null,null,"AREA","SIZE","NO.\nOF\nPOSTS","WEIGHT"]
[null,"SIGN","LOCATION",null,null,null,null,null,null,"STRUCTURAL"]
[null,"NO",null,null,null,null,null,null,null,"STEEL"]
[null,null,null,"INCH",null,null,"SQ FT",null,null,"POUND",null,"FEET",null,"FEET"]
[null," "," "," ","x"," "," ","W4X13"," ",1414,null,30,null,7]
[null," "," "," ","x"," "," ","W6X20",2,696,null,30,null,7]
[null," "," "," ","x"," "," ","W8X24"," "," ",null,30,null,7]
[null," "," "," ","x"," "," ","W8X31"," "," ",null,30,null,7]
[null," "," "," ","x"," "," ","W10X39"," "," ",null,30,null,7]
[null," "," ","  ","x"," "," "," "," "," ",null,30,null,7]
[null," "," "," ","x"," "," "," "," "," ",null,30,null,7]
[null,null,null,"TOTAL",null,null,{"$f":"SUM(G8:G14)","v":0},null,null,{"$f":"SUM(J8:J14)","v":2110}]
[]
[null,"GENERAL NOTE:"]
[null,"1. SEE SIGNING PANEL LAYOUT SHEETS FOR PANEL DESIGNS."]
[null,"USER NOTES",null,null,null,null,null,null," "]
[null,"This is all new sign"]
[null,"pay items:"]
[null,"SIGN PANELS TYPE A"]
[null,"STRUCTURAL STEEL POSTS FOR TYPE A SIGN"]
[]
[]
[]
[]
[null,"USE A SIGN COMPUTATION SHEET\nTO DETERMINE THESE QUANTITIES"]

{"sheet":"SIGN PANELS TYPE A","index":41,"n_rows":22,"n_cols":19,"rows_kept":22,"cut":false,"hidden":false,"merged":[[1,1,1,6],[2,1,2,6],[1,7,2,8],[2,10,3,17],[5,18,5,19],[5,15,5,16],[5,12,5,13],[1,10,1,17],[1,18,1,19],[2,18,3,18],[17,3,17,5],[3,3,3,6],[4,3,4,6],[3,2,4,2],[4,7,4,8],[3,7,3,8]]}
[]
[null,"SIGN PANELS TYPE A",null,null,null,null,null,{"$f":"'SEQ-PSTAB'!#REF!","v":{"$error":"#REF!"}}]
[null,"SEE SHEETS     FOR PANEL",null,null,null,null,null,null,null,null,"SIGN PANELS TYPE A",null,null,null,null,null,null,null,"AA"]
[null,"SIGN","LOCATION","SIZE",null,null,null,"AREA"]
[null,"NO",null,"INCH",null,null,null,"SQ FT",null,null,null,"SP XXXXX",null,null,"SP XXXXX",null,null,"SP XXXXX"]
[null,"A I94-528","142+00 SB",0,"x",78,null,{"$f":"D6*F6/144","v":0},null,null,"SIGN NO ","QTY","AREA\n(SQ FT)",null,"QTY","AREA\n(SQ FT)",null,"QTY","AREA"]
[null,"A I90-874","212+75 NB",0,"x",102,null,{"$f":"D7*F7/144","v":0},null,null,null,null,{"$f":"-G6*L7/144","v":0},null,null,{"$f":"-K7*O7/144","v":0},null,null,{"$f":"-N7*R7/144","v":0}]
[null,null,null,null,"x",null,null,0,null,null,null,null,0,null,null,0,null,null,0]
[null,null,null,null,"x",null,null,0,null,null,null," ",0,null,null,0,null,null,0]
[null,null,null,null,"x",null,null,0,null,null,null,null,0,null,null,0,null,null,0]
[null,null,null,null,"x",null,null,0,null,null,null,null,0,null,null,0,null,null,0]
[null,null,null,null,"x",null,null,0,null,null,null,null,0,null,null,0,null,null,0]
[null,null,null,null,"x",null,null,0,null,null,null,null,0,null,null,0,null,null,0]
[null,null,null,null,"x",null,null,0,null,null,null,null,0,null,null,0,null,null,0]
[null,null,null,null,"x",null,null,0,null,null,null,null,0,null,null,0,null,null,0]
[null,null,null,null,"x",null,null,0,null,null,null,null,0,null,null,0,null,null,0]
[null,null,null,null,"x",null,null,0,null,null,null,null,0,null,null,0,null,null,0]
[null,null,null,"TOTAL",null,null,null,{"$f":"SUM(H6:H17)","v":0},null,null,null,null,0,null,null,0,null,null,0]
[null,null,null,null,null,null,null,null,null,null,"TOTALS",null,0,null,null,0,null,null,0]
[]
[null,null,null,null,null,null,null,null,null,null,"Use this chart for split in quantities for several SP's.  "]
[null,"New sign panel on an inplace sign structure.  If the new panel is wider then make sure the structure can handle the new sign panel.  If not, you need new posts and not this chart anymore."]

{"sheet":"ASPNLIN","index":42,"n_rows":16,"n_cols":7,"rows_kept":16,"cut":false,"hidden":false,"merged":[[2,4,2,7],[3,4,3,7],[2,3,3,3],[1,1,1,5],[1,6,1,7]]}
[]
[null,"INSTALL SIGN PANEL TYPE A",null,null,null,null,{"$f":"'SEQ-PSTAB'!#REF!","v":{"$error":"#REF!"}}]
[null,"SIGN","QTY","LOCATION","SIZE"]
[null,"NO","EACH",null,"INCH"]
[null,"A I94-528",0,"142+00 SB",132,"x",78]
[null,"A I90-874",0,"212+75 NB",186,"x",102]
[null,null,null,null,null,"x"]
[null,null,null,null,null,"x"]
[null,null,null,null,null,"x"]
[null,null,null,null,null,"x"]
[null,null,null,null,null,"x"]
[null,"TOTAL",{"$f":"SUM(C5:C11)","v":0}]
[]
[]
[null,"Chances you won't use this chart.  A panel is usually salvaged and installed,"]
[null,"and in the salvage and install chart.  "]

{"sheet":"ASPNLOL","index":43,"n_rows":22,"n_cols":19,"rows_kept":22,"cut":false,"hidden":false,"merged":[[1,1,2,6],[1,7,2,8],[2,10,3,17],[20,1,20,11],[4,11,5,11],[4,15,4,16],[3,3,3,6],[4,14,5,14],[17,3,17,5],[3,2,4,2],[4,7,4,8],[4,3,4,6],[3,7,3,8],[5,18,5,19],[4,18,4,19],[1,10,1,17],[1,18,1,19],[4,17,5,17],[5,15,5,16],[2,18,3,19]]}
[null,null,null,null,null,null,null,null,null,null,null,null,null," "]
[null,"SIGN PANEL OVERLAY TYPE A ",null,null,null,null,null,"AA"]
[null,null,null,null,null,null,null,null,null,null,"SIGN PANEL OVERLAY TYPE A",null,null,null,null,null,null,null,"AA"]
[null,"SIGN","LOCATION","OVERLAY",null,null,null,"AREA"]
[null,"NO",null,"INCH",null,null,null,"SQ FT",null,null,"SIGN","QTY","AREA",null,"QTY","AREA",null,"QTY","AREA"]
[null,"A I94-528","S",0,"x",78,null,{"$f":"D6*F6/144","v":0},null,null,"NO",null,"SQ FT",null,null,"SQ FT",null,null,"SQ FT"]
[null,"A I90-874","212+75 NB",0,"x",102,null,0,null,null,{"$f":"B6","v":"A I94-528"},2,{"$f":"(D6*F6)/144","v":0},null,null,{"$f":"-K7*O7/144","v":0},null,null,{"$f":"-N7*R7/144","v":0}]
[null,null,null,null,"x",null,null,0,null,null,{"$f":"B7","v":"A I90-874"},3,{"$f":"(D7*F7)/144","v":0},null,null,0,null,null,0]
[null,null,null,null,"x",null,null,0,null,null,0,null,0,null,null,0,null,null,0]
[null,null,null,null,"x",null,null,0,null,null,0," ",0,null,null,0,null,null,0]
[null,null,null,null,"x",null,null,0,null,null,0,null,0,null,null,0,null,null,0]
[null,null,null,null,"x",null,null,0,null,null,0,null,0,null,null,0,null,null,0]
[null,null,null,null,"x",null,null,0,null,null,0,null,0,null,null,0,null,null,0]
[null,null,null,null,"x",null,null,0,null,null,0,null,0,null,null,0,null,null,0]
[null,null,null,null,"x",null,null,0,null,null,0,null,0,null,null,0,null,null,0]
[null,null,null,null,"x",null,null,0,null,null,0,null,0,null,null,0,null,null,0]
[null,null,null,null,"x",null,null,0,null,null,0,null,0,null,null,0,null,null,0]
[null,null,null,"TOTAL",null,null,null,{"$f":"SUM(H6:H17)","v":0},null,null,0,null,0,null,null,0,null,null,0]
[null,null,null,null,null,null,null,null,null,null,"TOTALS",null,{"$f":"SUM(M7:M18)","v":0},null,null,0,null,null,0]
[null,"GENERAL NOTE:"]
[null,"1.  SEE SIGN PANEL OVERLAYS."]
[null,null,null,null,null,null,null,null,null,null,"this chart is for each SP"]

{"sheet":"ASPNLSAL","index":44,"n_rows":17,"n_cols":6,"rows_kept":17,"cut":false,"hidden":false,"merged":[[1,1,1,4],[5,3,5,5],[2,2,5,2],[2,3,4,5]]}
[]
[null,"SALVAGE SIGN PANEL TYPE A",null,null,null,{"$f":"'SEQ-PSTAB'!#REF!","v":{"$error":"#REF!"}}]
[null,null,"LOCATION","PANEL\nSIZE"]
[null,"SIGN"]
[null,"NO"]
[null,null,null,"INCHES"]
[null,"A I94-100","142+00 SB",102,"x",78]
[null,"A I90-887","212+75 NB",174,"x",102]
[null,null,null,null,"x"]
[null,null,null,null,"x"]
[null,null,null,null,"x"]
[null,null,null,null,"x"]
[null,null,null,null,"x"]
[null,null,null,null,"x"]
[null,null,null,null,"x"]
[null,null,null,null,"x"]
[null,null,null,null," "]

{"sheet":"ASPNLSAW","index":45,"n_rows":20,"n_cols":12,"rows_kept":20,"cut":false,"hidden":false,"merged":[[1,11,1,12],[1,1,1,9],[2,2,4,2],[3,3,3,6],[2,11,2,12],[4,11,4,12],[3,7,3,10],[2,3,2,10],[4,3,4,10],[3,11,3,12],[2,1,4,1]]}
[]
[null,"SAW SIGN PANEL TYPE A",null,null,null,null,null,null,null,null,null,{"$f":"'SEQ-PSTAB'!#REF!","v":{"$error":"#REF!"}}]
[null,"SIGN\nNO","LOCATION","PANEL SIZE",null,null,null,null,null,null,null,"LENGTH"]
[null,null,null,"EXISTING",null,null,null,"MODIFIED",null,null,null,"OF CUT"]
[null,null,null,"INCH",null,null,null,null,null,null,null,"FEET"]
[null,"A MN23-132","142+00 SB",132,"x",78,null,102,"x",78,null,{"$f":"F6/12","v":6.5}]
[null,"A MN23-133","212+75 NB",186,"x",102,null,174,"x",102,null,{"$f":"F7/12","v":8.5}]
[null,null,null,null,"x",null,null,null,"x",null,null,0]
[null,null,null,null,"x",null,null,null,"x",null,null,0]
[null,null,null,null,"x",null,null,null,"x",null,null,0]
[null,null,null,null,"x",null,null,null,"x",null,null,0]
[null,null,null,null,"x",null,null,null,"x",null,null,0]
[null,null,null,null,"x",null,null,null,"x",null,null,0]
[null,null,null,null,"x",null,null,null,"x",null,null,0]
[null,null,null,null,"x",null,null,null,"x",null,null,0]
[null,null,null,null,null,null,null,null,null,"TOTAL",null,{"$f":"SUM(L6:L15)","v":15}]
[null,null,null,null," ",null," ",null," ",null," "]
[null,"just what it means, we need to saw it because it is too wide.  You will then have SIGN PANEL OVERLAY TYPE A"]
[null,"It would be incidental to SIGN PANEL OVERLAY TYPE A"]
[null,"But there is a pay item for it just as the title is."]

{"sheet":"AFF","index":46,"n_rows":17,"n_cols":5,"rows_kept":17,"cut":false,"hidden":false,"merged":[[1,1,1,3],[2,3,3,3]]}
[]
[null,"FRICTION FUSE",null,null,"SA"]
[null,"SIGN","QTY","LOCATION","POST "]
[null,"NO","EACH",null,"SIZE"]
[null,"A-1",2,"142+00 SB","W6X20"]
[null,"A-2",2,"212+75 NB","W8X24"]
[]
[]
[]
[]
[]
[]
[]
[]
[]
[]
[null,"TOTAL",{"$f":"SUM(C5:C16)","v":4}]

{"sheet":"A REM PANEL","index":47,"n_rows":12,"n_cols":4,"rows_kept":12,"cut":false,"hidden":false,"merged":[[2,3,3,3],[1,1,1,2],[2,1,4,1],[2,2,4,2]]}
[null,"AREMPAN"]
[null,"REMOVE SIGN PANEL TYPE A",null,"AA"]
[null,"SIGN\nNO","LOCATION","SIZE"]
[]
[null,null,null,"INCH"]
[null,"A MN23-132"," "]
[null,"A MN23-133"," "]
[]
[]
[]
[]
[null,"TOTAL",{"$f":"COUNTA(B6:B11)","v":2}]

{"sheet":"AKP","index":48,"n_rows":17,"n_cols":5,"rows_kept":17,"cut":false,"hidden":false,"merged":[[1,1,1,3],[2,3,3,3]]}
[]
[null,"KEEPER PLATE",null,null,"SA"]
[null,"SIGN","QTY","LOCATION","POST   "]
[null,"NO","EACH",null,"SIZE"]
[null,"A MN23-132",0,"142+00 SB","W6X20"]
[null,"A MN23-133",0,"212+75 NB","W8X24"]
[]
[]
[]
[]
[]
[]
[]
[]
[]
[]
[null,"TOTAL",{"$f":"SUM(C5:C16)","v":0}]

{"sheet":"EA","index":49,"n_rows":26,"n_cols":11,"rows_kept":26,"cut":false,"hidden":false,"merged":[[2,10,5,10],[1,1,1,9],[21,1,21,9],[2,2,5,2],[2,3,5,3],[2,4,2,9],[3,8,5,8],[3,4,5,7]]}
[]
[null,"SIGN PANELS TYPE EA ",null,null,null,null,null,null,null,null,"G"]
[null,null,"QTY","LOCATION","PANEL",null,null,null,null,null,"LEGEND"]
[null,"SIGN",null,null,"SIZE\n(INCH)",null,null,null,"AREA\n(SQ FT)","TOTAL"]
[null,"NO",null,null,null,null,null,null,null,"AREA"]
[null,null,null,null,null,null,null,null,null,"(SQ FT)"]
[null,"EA-1",3,"A US75-246, A US75-247 & A US75-249",102,"x",0,null,{"$f":"E7*G7/144","v":0},{"$f":"I7*C7","v":0},"EXIT 157"]
[null,"EA-2",2,"A US75-247, US75-250",162,"x",0,null,{"$f":"E8*G8/144","v":0},{"$f":"I8*C8","v":0},"EXITS 159A&B"]
[null,"EA-3",1,"A I90-621",120,"x",0,null,0,0,"EXIT 159A"]
[null,null,null,null,null,"x",null,null,0,0]
[null,null,null,null,null,"x",null,null,0,0]
[null,null,null,null,null,"x",null,null,0,0]
[null,null,null,null,null,"x",null,null,0,0]
[null,null,null,null,null,"x",null,null,0,0]
[null,null,null,null,null,"x",null,null,0,0]
[null,null,null,null,null,"x",null,null,0,0]
[null,null,null,null,null,"x",null,null,0,0]
[null,null,null,null,null,"x",null,null,0,0]
[null,"TOTAL",null,null,null,null,null,null,null,{"$f":"SUM(J7:J18)","v":0}]
[]
[]
[]
[null,"GENERAL NOTES:"]
[null,"1. SEE STANDARD PLAN 5-297.710 FOR STRUCTURAL DETAILS."]
[null,"2. POST SPACING MAY BE VARIED TO MISS MEMBERS OF A SIGN STRUCTURE"]
[null,"3. SEE SIGNING PANEL LAYOUT SHEETS FOR PANEL DESIGNS."]

{"sheet":"EAOL","index":50,"n_rows":15,"n_cols":12,"rows_kept":15,"cut":false,"hidden":false,"merged":[[1,1,1,10],[2,1,4,1],[2,4,2,10],[3,8,3,9],[3,4,3,7],[4,4,4,7],[4,8,4,9]]}
[]
[null,"SIGN PANEL OVERLAY TYPE EA",null,null,null,null,null,null,null,null,null,{"$f":"'SEQ-PSTAB'!#REF!","v":{"$error":"#REF!"}}]
[null,"SIGN\nNO",null,null,"PANEL OVERLAY",null,null,null,null,null,null,"LEGEND"]
[null,null,"QTY","LOCATION","SIZE",null,null,null,"AREA",null,"TOTAL"]
[null,null,null,null,"INCH",null,null,null,"SQ FT",null,"SQ FT"]
[null,"EA-1",2,"A I90-454, A I90-455",150,"x",0,null,{"$f":"(E6*G6)/144","v":0},null,{"$f":"I6*C6","v":0},"EXITS 52B&A"]
[null,"EA-2",1,"A I90-560",96,"x",0,null,{"$f":"(E7*G7)/144","v":0},null,{"$f":"I7*C7","v":0},"EXIT 48"]
[null,null,null,null,null,"x"]
[null,null,null,null,null,"x"]
[null,null,null,null,null,"x"]
[null,null,null,null,null,"x"]
[null,null,null,null,null,"x"]
[null,null,null,null,null,"x"]
[null,null,null,null,null,"x"]
[null,"TOTAL"," ",null,null,null,null,null,null,null,{"$f":"SUM(K6:K14)","v":0}]

{"sheet":"EAREM","index":51,"n_rows":14,"n_cols":10,"rows_kept":14,"cut":false,"hidden":false,"merged":[[1,1,1,8],[2,1,4,1],[3,5,3,8],[4,5,4,8],[2,5,2,8],[2,4,4,4],[2,2,3,2]]}
[]
[null,"REMOVE SIGN TYPE EA",null,null,null,null,null,null,null,"AA"]
[null,"SIGN\nNO","QTY",null,"POSTS\nNO & TYPE","PANEL"]
[null,null,null,"LOCATION",null,"SIZE",null,null,null,"LEGEND"]
[null,null,"EACH",null,null,"(INCH)"]
[null,"EA-101",0,"A I35W-024","3-U",102,"x",24,null,"EXIT 157"]
[null,"EA-102",0,"A MN100-041","4-U",162,"x",24,null,"EXITS 159A&B"]
[null,null,null,null,null,null,"x"]
[null,null,null,null,null,null,"x"]
[null,null,null,null,null,null,"x"]
[null,null,null,null,null,null,"x"]
[null,null,null,null,null,null,"x"]
[null,null,null,null,null,null,"x"]
[null,"TOTAL",{"$f":"SUM(C6:C13)","v":0}]

{"sheet":"EAEXTFI","index":52,"n_rows":9,"n_cols":14,"rows_kept":9,"cut":false,"hidden":false,"merged":[[8,8,8,9],[5,11,5,14],[2,11,4,14],[5,8,5,9],[6,8,6,9],[7,8,7,9],[2,4,2,10],[3,4,4,7],[3,8,4,9],[1,13,1,14],[1,1,1,12],[5,4,5,7],[2,2,5,2],[2,3,5,3]]}
[]
[null,"SIGN PANELS TYPE EA (EXTRUDED PANEL SECTIONS)",null,null,null,null,null,null,null,null,null,null,null,"AA"]
[null,null,"QTY","LOCATION","PANEL",null,null,null,null,null,null,"REQUIRED\nPANEL SIZE"]
[null,"SIGN",null,null,"SIZE",null,null,null,"AREA",null,"TOTAL"]
[null,"NO",null,null,null,null,null,null,null,null,"AREA"]
[null,null,null,null,"INCH",null,null,null,"SQ FT",null,"SQ FT","INCH"]
[null,"EA-201",0,"A MN280-002",96,"x",6,null,{"$f":"E7*G7/144","v":4},null,{"$f":"C7*I7","v":0},96,"x",30]
[null,"EA-202",0,"A MN280-003, A MN280-004",96,"x",6,null,{"$f":"E8*G8/144","v":4},null,{"$f":"C8*I8","v":0},96,"x",30]
[null,"TOTAL ",null,null,null,null,null,null,null,null,{"$f":"SUM(K7:K8)","v":0}]

{"sheet":"PANEL OL, EXT PAN, PMP","index":53,"n_rows":45,"n_cols":28,"rows_kept":45,"cut":false,"hidden":false,"merged":[[54,23,54,26],[55,16,55,22],[55,23,55,26],[56,16,56,26],[38,1,38,3],[39,1,39,3],[53,2,53,22],[54,4,56,4],[54,16,54,22],[23,4,23,6],[23,8,23,10],[23,11,23,13],[23,16,23,18],[53,23,53,26],[25,1,25,23],[27,4,27,6],[27,8,27,10],[27,11,27,13],[27,16,27,18],[29,4,29,6],[29,11,29,13],[29,16,29,18],[29,19,29,20],[36,1,36,22],[37,1,37,3],[3,19,8,19],[3,20,8,20],[3,21,8,21],[10,1,10,23],[17,0,18,0],[9,11,9,13],[9,16,9,18],[3,8,8,10],[3,11,8,14],[3,16,8,18],[1,1,1,22],[1,26,1,27],[1,28,1,29],[2,1,9,1],[2,2,9,2],[2,3,2,7],[2,8,2,18],[2,19,2,23],[3,3,9,3],[3,4,8,7],[3,22,8,22],[3,23,9,23],[3,26,8,26],[3,27,8,27],[9,4,9,6],[9,8,9,10]]}
[]
[null,"PANEL OVERLAYS, EXTRUDED PANELS AND PANEL MOUNTING POSTS",null,null,null,null,null,null,null,null,null,null,null,null,null,null,null,null,null,null,null,null,null,"ST-B"]
[null,"SIGN\nSUPPORT\nNUMBER","PANEL\nNUMBER","PANEL OVERLAY",null,null,null,null,"EXTRUDED PANEL",null,null,null,null,null,null,null,null,null,null,"PANEL MOUNTING POSTS   "]
[null,null,null,"PANEL LEGEND","PANEL OVERLAY\n",null,null,null,"EXISTING\nEXTRUDED\nPANEL ",null,null,"F. & I.\nEXTRUDED\nPANEL ",null,null,null,null,"REMOVE\nEXTRUDED PANEL\nSECTIONS\n",null,null,"NO.","TYPE\n(1)","LENGTH","STRUCTURAL\nSTEEL-PANEL\nMOUNTING\nPST FOR\nOH SIGNS\n(2)","ATTACH\nTO\nTRUSS \nTYPE\n(3)",null,null,"EXTEND\nAPPROX.\n","SHORTEN\nAPPROX.\n"]
[null,null,null,null,null,null,null,null,null,null,null,null,null,null,null,"REMOVE"]
[null,null,null,null,null,null,null,null,null,null,null,null,null,null,null,"EXTRUDED"]
[null,null,null,null,null,null,null,null,null,null,null,null,null,null,null,"PANEL"]
[]
[]
[null,null,null,null,"INCH",null,null,"SQ FT","INCH",null,null,"INCH",null,null,"SQ FT","EACH","INCH",null,null,null,null,"INCH","POUND",null,null,null,"INCH","INCH"]
[null,"   SP 1010-001"]
[null,"IB MN101-020","P-1","EXIT 40",96,"x",30,{"$f":"E12*G12/144","v":20}," ","x",null,96,"x",30,{"$f":"L12*N12/144","v":20},null,null,"x",null,2,"U",null,42]
[null,"IB MN101-020","P-2","COUNTY 144-141ST AVE 1/2 MILE",144,"x",108,108,null,"x",null,144,"x",108,{"$f":"L13*N13/144","v":108},null,null,"x"]
[null,"IB MN101-021"," ","EXIT 40",96,"x",30,20," ","x",null,96,"x",30,{"$f":"L14*N14/144","v":20},null,null,"x",null,2,"U",null,42]
[null,"IB MN101-021"," ","COUNTY 144-141ST AVE 45 DEG ARROW",144,"x",126,126,144,"x",126,null,null,null,null,null,null,"x"]
[null,"IB MN101-023"," ","EXIT 39",96,"x",30,20," ","x",null,96,"x",30,{"$f":"L16*N16/144","v":20},null,null,"x",null,2,"U",null,42]
[null,"IB MN101-023"," ","MN SCHOOL OF BARTENDING 1/2 MILE",240,"x",96,160,240,"x",126,null,null,null,null,null,240,"x",30,null,null,null,null,null,null,null,null,30]
[null,"OH MN101-521"," ","EXIT 43",96,"x",30,20," ","x"," ",96,"x",30,{"$f":"L18*N18/144","v":20},null," ","x"," ",2,"U",null,42]
[null,"OH MN101-521",null,"MN 51 ST PAUL MINNEAPOLIS 1 MILE EXIT ONLY",174,"x",156,188.5,174,"x",126,174,"x",30,36.25,null," ","x"," ",3,"W6x12",160,534,"C","(4)"]
[null,"OH MN101-522"," ","EXIT 44",96,"x",30,20," ","x"," ",96,"x",30,20,null," ","x"," ",2,"U",null,42]
[null,"OH MN101-522"," ","HAMLINE AVE 1 MILE",126,"x",90,78.75," ","x"," ",126,"x",90,78.75,null," ","x"," ",2,"S4x7.7",94,156,"B"]
[null,"OH MN101-522"," ","EXIT 43",96,"x",30,20," ","x"," ",96,"x",30,20,null," ","x"," ",2,"U",null,42]
[null,"OH MN101-522"," ","MN 51 ST PAUL MINNEAPOLIS EXIT ONLY",174,"x",144,174," ","x"," ",174,"x",144,174,null," ","x"," ",3,"W6x12",148,498,"C"]
[null,"SUBTOTAL \nSP 1010-001",null,null,null,null,null,{"$f":"SUM(H12:H23)","v":955.25},null,null,null,null,null,null,{"$f":"SUM(O12:O23)","v":517},null,null,null,null,null,null,null,{"$f":"SUM(W12:W23)","v":1440}]
[]
[null,"   SP 2020-002"]
[null,"OH MN101-989"," ","McKNIGHT RD 1/2 ,MN 120 CENTURY AVE 1 1/4, I694 I494 2",258,"x",96,172," ","x"," ",258,"x",96,172,null," ","x"," "," ",null,null," "]
[null,"SUBTOTAL \nSP 2020-002",null,null,null,null,null,{"$f":"SUM(H27)","v":172},null,null,null,null,null,null,{"$f":"SUM(O27)","v":172}]
[]
[null,"TOTAL",null,null,null,null,null,{"$f":"SUM(H24+H28)","v":1127.25},null,null,null,null,null,null,{"$f":"SUM(O24+O28)","v":689},null,null,null,null,null,null,null,{"$f":"SUM(W24+W28)","v":1440}]
[]
[]
[null,"SPECIFIC NOTE(S):"]
[null,"(X) INCLUDES SAWCUTTING PANEL MOUNTING POSTS OR I BEAMS TO SPECIFICATIONS SHOWN IN STANDARD PLANS."]
[null,"(1) POST TYPE ABBREVIATIONS ( U = U CHANNEL )"]
[null,"(2) FURNISH & INSTALL NEW PANEL MOUNTING POSTS PER STANDARD PLAN 5-297.771."]
[null,"(3) TRUSS DEPTH AND CHORD ANGLE INFORMATION FOR PANEL MOUNTING POSTS ARE BASED ON TRUSS TYPE AND APPLY TO DESIGN B, INTERIM DESIGN B AND DESIGN D STRUCTURES.    "]
[null,"    TRUSS TYPE A: TRUSS DEPTH = 72 INCHES, CHORD ANGLES = 6 x 6 x 1/2"]
[null,"    TRUSS TYPE B: TRUSS DEPTH = 72 INCHES, CHORD ANGLES = 6 x 6 x 3/4"]
[null,"    TRUSS TYPE C: TRUSS DEPTH = 72 INCHES, CHORD ANGLES = 8 x 8 x 5/8"]
[null,"(4) REMOVE EXISTING PANEL MOUNTING POSTS. "]
[]
[]
[null,"GENERAL NOTE(S):"]
[null,"1.  SEE SIGN PANEL LAYOUTS FOR PANEL OVERLAY DESIGNS."]

{"sheet":"EOREM","index":54,"n_rows":14,"n_cols":11,"rows_kept":14,"cut":false,"hidden":false,"merged":[[1,1,1,9],[2,6,2,9],[2,3,4,3],[2,1,4,1],[3,6,3,9],[4,6,4,9],[2,4,4,5],[2,2,3,2]]}
[]
[null,"REMOVE SIGN TYPE EO",null,null,null,null,null,null,null,null,"AA"]
[null,"SIGN\nNO","QTY","LOCATION","POSTS\nNO & TYPE",null,"PANEL"]
[null,null,null,null,null,null,"SIZE",null,null,null,"LEGEND"]
[null,null,"EACH",null,null,null,"(INCH)"]
[null,"EO-101",0,"OH I90-014",{"$f":"IF(G6>180.1,\"ERROR\",IF(G6>149.9,\"4\",IF(G6>101.9,\"3\",IF(G6>47.9,\"2\"))))","v":"3"},"-U",102,"x",24,null,"EXIT 157"]
[null,"EO-102",0,"OH I90-017(R), OH I90-018(M), OH I90-036",{"$f":"IF(G7>180.1,\"ERROR\",IF(G7>149.9,\"4\",IF(G7>101.9,\"3\",IF(G7>47.9,\"2\"))))","v":"3"},"-U",120,"x",24,null,"EXITS 159A"]
[null,null,null,null,"2","-U",84,"x"]
[null,null,null,null,false,"-U",null,"x"]
[null,null,null,null,false,"-U",null,"x"]
[null,null,null,null,null,null,null,"x"]
[null,null,null,null,null,null,null,"x"]
[null,null,null,null,null,null,null,"x"]
[null,"TOTAL",{"$f":"SUM(C6:C13)","v":0}]

{"sheet":"EO","index":55,"n_rows":22,"n_cols":11,"rows_kept":22,"cut":false,"hidden":false,"merged":[[1,1,1,9],[2,10,5,10],[2,4,2,9],[21,1,21,9],[3,4,5,7],[3,8,5,8],[3,2,4,2]]}
[]
[null,"SIGN PANELS TYPE EO  ",null,null,null,null,null,null,null,null,"AA"]
[null,null,null,null,"PANEL",null,null,null,null,null,"LEGEND"]
[null,"SIGN","QTY",null,"SIZE\n(INCH)",null,null,null,"AREA\n(SQ FT)","TOTAL"]
[null,"NO",null,"LOCATION",null,null,null,null,null,"AREA"]
[null,null,null,null,null,null,null,null,null,"(SQ FT)"]
[null,"EO-1",0,"OH I90-014",108,"x",30,null,{"$f":"E7*G7/144","v":22.5},{"$f":"I7*C7","v":0},"EXIT 154"]
[null,"EO-2",0,"OH I90-017(R), OH I90-018(M) & OH I90-036",108,"x",30,null,22.5,0,"EXIT 159A"]
[null,"EO-3",0,"OH I90-017(M), OH I90-018(R) & OH I90-037(R)",108,"x",30,null,22.5,0,"EXIT 159B"]
[null,null,null,null,108,"x",null,null,0,0]
[null,null,null,null,108,"x",null,null,0,0]
[null,null,null,null,108,"x",null,null,0,0]
[null,null,null,null,108,"x",null,null,0,0]
[null,null,null,null,108,"x",null,null,0,0]
[null,"TOTAL",null,null,null,null,null,null,null,{"$f":"SUM(J7:J14)","v":0}]
[]
[null,"SPECIFIC NOTES:"]
[]
[null,"GENERAL NOTES:"]
[null,"1.  SEE STANDARD PLAN 5-297.710 FOR STRUCTURAL DETAILS."]
[null,"2.  POST SPACING MAY BE VARIED TO MISS MEMBERS OF OH SIGN STRUCTURES."]
[null,"3.  SEE SIGNING PANEL LAYOUT SHEETS FOR PANEL DESIGNS."]

{"sheet":"EOOL","index":56,"n_rows":20,"n_cols":12,"rows_kept":20,"cut":false,"hidden":false,"merged":[[19,1,19,10],[1,1,1,10],[2,1,4,1],[2,4,2,10],[3,8,3,9],[3,4,3,7],[4,4,4,7],[4,8,4,9]]}
[]
[null,"SIGN PANEL OVERLAY TYPE EO",null,null,null,null,null,null,null,null,null,{"$f":"'SEQ-PSTAB'!B25","v":0}]
[null,"SIGN\nNO",null,null,"PANEL OVERLAY"]
[null,null,"QTY","LOCATION","SIZE",null,null,null,"AREA",null,"TOTAL","LEGEND"]
[null,null,null,null,"INCH",null,null,null,"SQ FT",null,"SQ FT"]
[null,"EO-1",0,"OH I694-037",150,"x",30,null,{"$f":"(E6*G6)/144","v":31.25},null,{"$f":"I6*C6","v":0},"EXITS 52B&A"]
[null,"EO-2",0,"OH I694-066(R), OH I694-101(R)",96,"x",30,null,{"$f":"(E7*G7)/144","v":20},null,{"$f":"I7*C7","v":0},"EXIT 48"]
[null,null,null,null,null,"x"]
[null,null,null,null,null,"x"]
[null,null,null,null,null,"x"]
[null,null,null,null,null,"x"]
[null,null,null,null,null,"x"]
[null,null,null,null,null,"x"]
[null,null,null,null,null,"x"]
[null,"TOTAL"," ",null,null,null,null,null,null,null,{"$f":"SUM(K6:K14)","v":0}]
[]
[]
[]
[null,"GENERAL NOTES:"]
[null,"1.  SEE SIGNING PANEL LAYOUT SHEETS FOR PANEL DESIGNS."]

{"sheet":"EO EXT PAN SECT","index":57,"n_rows":21,"n_cols":10,"rows_kept":21,"cut":false,"hidden":false,"merged":[[2,1,5,1],[2,2,5,2],[2,3,5,3],[2,4,2,8],[2,9,5,9],[3,4,5,6],[3,7,5,7],[3,8,5,8],[1,1,1,8],[7,7,8,7],[7,8,8,8],[7,9,8,9],[10,1,11,1],[10,2,11,2],[10,4,11,4],[10,5,11,5],[10,6,11,6],[10,7,11,7],[10,8,11,8],[10,9,11,9],[7,1,8,1],[7,2,8,2],[7,4,8,4],[7,5,8,5],[7,6,8,6],[12,7,13,7],[12,8,13,8],[12,9,13,9],[14,1,15,1],[14,2,15,2],[14,4,15,4],[14,5,15,5],[14,6,15,6],[14,7,15,7],[14,8,15,8],[14,9,15,9],[12,1,13,1],[12,2,13,2],[12,4,13,4],[12,5,13,5],[12,6,13,6],[16,8,17,8],[16,9,17,9],[16,1,17,1],[16,2,17,2],[16,4,17,4],[16,5,17,5],[16,6,17,6],[16,7,17,7]]}
[null,"EOEXTFI"]
[null,"   SIGN PANELS TYPE EO (EXTRUDED PANEL SECTIONS)",null,null,null,null,null,null,null,"SS"]
[null,"SIGN\nNO","QTY","LOCATION","PANEL",null,null,null,null,"REQUIRED\nPANEL SIZE\n(INCH)"]
[null,null,null,null,"SIZE \n(INCH) ",null,null,"AREA\n(SQ FT)","TOTAL\nAREA\n(SQ FT)"]
[]
[]
[null,"EA-201",0,"OH I94-0, OH I94-046, OH I94-056",108,"x",6,{"$f":"E7*G7/144","v":4.5},{"$f":"C7*H7","v":0},"108 x 30"]
[null,"EO-202",0,"OH I94-052-94  OH I94-055,  OH I94-488(R)",108,"x",6,4.5,0,"108 x 30"]
[null,null,null,"OH I94-489  OH I94-095(L)"]
[null,"EO-203",0,"OH I94-097(L)",126,"x",6,{"$f":"E10*G10/144","v":5.25},{"$f":"C10*H10","v":0},"126 x 30"]
[null,"EO-204",0,"OH I94-488(L)   OH I94-092",126,"x",6,{"$f":"E11*G11/144","v":5.25},0,"126 x 30"]
[null,null,null,"OH I94-094(R)  OH I94-095(R) OH I94-572(L)"]
[null," ",0," ",0,"x",0,{"$f":"E13*G13/144","v":0},0,"108 x 30"]
[null,null,null," "]
[null," ",0," ",0,"x",0,{"$f":"E15*G15/144","v":0},0,"126 x 30"]
[null,null,null," "]
[null," ",0," ",0,"x",0,{"$f":"E17*G17/144","v":0},0,"126 x 30"]
[null,null,null," "]
[null,"EO-208",0," ",126,"x",6,{"$f":"E19*G19/144","v":5.25},{"$f":"C19*H19","v":0}," 96 x 30"]
[null,"TOTAL",null,null,null,null,null,null,{"$f":"SUM(I7:I19)","v":0}]
[null," "]

{"sheet":"ESALINS","index":58,"n_rows":42,"n_cols":20,"rows_kept":42,"cut":false,"hidden":false,"merged":[[1,1,1,13],[30,1,31,1],[30,2,31,2],[30,12,31,12],[30,13,31,13],[30,14,31,14],[33,1,34,1],[33,2,34,2],[33,12,34,12],[24,12,25,12],[24,13,25,13],[33,13,34,13],[24,14,25,14],[24,1,25,1],[24,2,25,2],[24,4,25,4],[24,5,25,5],[30,4,31,4],[30,5,31,5],[30,6,31,6],[30,7,31,7],[33,4,34,4],[33,5,34,5],[33,6,34,6],[33,7,34,7],[18,1,20,1],[18,2,20,2],[18,12,20,12],[15,1,17,1],[15,2,17,2],[18,6,20,6],[18,7,20,7],[21,4,23,4],[21,5,23,5],[21,6,23,6],[21,7,23,7],[18,4,20,4],[18,5,20,5],[18,11,20,11],[21,1,23,1],[21,2,23,2],[21,12,23,12],[18,10,20,10],[24,6,25,6],[24,7,25,7],[18,8,20,8],[18,9,20,9],[33,9,34,9],[13,1,14,1],[13,2,14,2],[9,1,10,1],[9,2,10,2],[9,6,10,6],[9,7,10,7],[13,4,14,4],[9,8,10,8],[2,1,4,1],[9,4,10,4],[9,5,10,5],[3,4,3,7],[4,4,4,7],[3,8,3,11],[4,8,4,11],[2,2,3,2],[15,6,17,6],[15,7,17,7],[9,10,10,10],[9,11,10,11],[13,8,14,8],[13,9,14,9],[13,10,14,10],[13,11,14,11],[9,9,10,9],[15,8,17,8],[15,9,17,9],[15,10,17,10],[15,11,17,11],[30,8,31,8],[33,8,34,8],[21,8,23,8],[33,11,34,11],[21,9,23,9],[21,10,23,10],[21,11,23,11],[24,8,25,8],[2,14,4,14],[2,12,2,13],[13,12,14,12],[13,13,14,13],[9,14,10,14],[15,13,17,13],[3,12,4,12],[3,13,4,13],[9,12,10,12],[9,13,10,13],[2,4,2,11],[13,5,14,5],[13,6,14,6],[13,7,14,7],[15,4,17,4],[15,5,17,5],[33,18,34,18],[33,19,34,19],[30,9,31,9],[30,10,31,10],[30,11,31,11],[13,14,14,14],[18,13,20,13],[18,14,20,14],[24,11,25,11],[33,14,34,14],[21,13,23,13],[21,14,23,14],[24,9,25,9],[15,14,17,14],[15,12,17,12],[24,10,25,10],[33,10,34,10],[3,18,3,19],[24,18,25,18],[24,19,25,19],[30,18,31,18],[30,19,31,19],[18,18,20,18],[18,19,20,19],[21,18,23,18],[21,19,23,19],[13,18,14,18],[9,18,10,18],[9,19,10,19],[13,19,14,19],[15,18,17,18],[15,19,17,19]]}
[]
[null,"SALVAGE & INSTALL SIGN TYPE EO",null,null,null,null,null,null,null,null,null,null,null,null,{"$f":"'SEQ-PSTAB'!B42","v":0}]
[null,"SIGN\nNO","QTY",null,"PANEL SIZE",null,null,null,null,null,null,null,"POSTS",null,"LEGEND "]
[null,null,null,"INSTALL LOCATION","SALVAGE",null,null,null,"INSTALL",null,null,null,"NO. &\nTYPE","SPACING",null,null,null,null,"DEFAULT VALUES"]
[null,null,"EACH",null,"INCH",null,null,null,"INCH",null,null,null,null,null,null,null,null,null,"POST #","POST TYPE"]
[null,"EO-201",0,"OH I494-299(L)",96,"x",24,null,90,"x",30,null,{"$f":"Epostnumb(I6)&\"-\"&T6","v":{"$error":"#VALUE!"}},{"$f":"epostspace(I6)","v":{"$error":"#NAME?"}},"EXIT 21",null,null,null,"3","U"]
[null,"EO-202",0,"OH 494-299(R)  OH I94-318(L)",96,"x",24,null,96,"x",30,null,{"$f":"Epostnumb(I7)&\"-\"&T7","v":{"$error":"#VALUE!"}},{"$f":"epostspace(I7)","v":{"$error":"#NAME?"}},"EXIT 22",null,null,null,"3","U"]
[null,"EO-203",0,"OH I494-317     OH I494-318(R)",96,"x",24,null,96,"x",30,null,{"$f":"Epostnumb(I8)&\"-\"&T8","v":{"$error":"#VALUE!"}},{"$f":"epostspace(I8)","v":{"$error":"#NAME?"}},"EXIT 23",null,null,null,"3","U"]
[null,"EO-204",0,"OH I494-101(R)  OH I494-124",96,"x",24,null,96,"x",30,null,{"$f":"Epostnumb(I9)&\"-\"&T9","v":{"$error":"#VALUE!"}},{"$f":"epostspace(I9)","v":{"$error":"#NAME?"}},"EXIT 26",null,null,null,"3","U"]
[null,"EO-205",0," ",96,"x",24,null,96,"x",30,null,{"$f":"Epostnumb(I10)&\"-\"&T10","v":{"$error":"#VALUE!"}},{"$f":"epostspace(I10)","v":{"$error":"#NAME?"}},"EXIT 27",null,null,null,"3","U"]
[null,null,null," "]
[null,"EO-206",0," ",114,"x",24,null,114,"x",30,null,{"$f":"Epostnumb(I12)&\"-\"&T12","v":{"$error":"#VALUE!"}},{"$f":"epostspace(I12)","v":{"$error":"#NAME?"}},"EXIT 35A",null,null,null,"3","U"]
[null,"EO-207",0," ",114,"x",24,null,114,"x",30,null,{"$f":"Epostnumb(I13)&\"-\"&T13","v":{"$error":"#VALUE!"}},{"$f":"epostspace(I13)","v":{"$error":"#NAME?"}},"EXIT 35B",null,null,null,"3","U"]
[null,"EO-208",0," ",114,"x",24,null,114,"x",30,null,{"$f":"Epostnumb(I14)&\"-\"&T14","v":{"$error":"#VALUE!"}},"42","EXIT 35C",null,null,null,"3","U"]
[null,null,null," "]
[null,"EO-209",0," ",150,"x",24,null,150,"x",30,null,{"$f":"Epostnumb(I16)&\"-\"&T16","v":{"$error":"#VALUE!"}},"42","EXITS 35C&B",null,null,null,"3","U"]
[null,null,null," "]
[null,null,null," "]
[null,"EO-210",0," ",96,"x",24,null,96,"x",30,null,{"$f":"Epostnumb(I19)&\"-\"&T19","v":{"$error":"#VALUE!"}},"42","EXIT 36",null,null,null,"3","U"]
[null,null,null," "]
[null,null,null," "]
[null,"EO-211",0," ",96,"x",24,null,96,"x",30,null,{"$f":"Epostnumb(I22)&\"-\"&T22","v":{"$error":"#VALUE!"}},"42","EXIT 37",null,null,null,"3","U"]
[null,null,null," "]
[null,null,null," "]
[null,"EO-212",0," ",114,"x",24,null,114,"x",30,null,{"$f":"Epostnumb(I25)&\"-\"&T25","v":{"$error":"#VALUE!"}},"42","EXIT 38",null,null,null,"3","U"]
[null,null,null," "]
[null,"EO-213",0," ",114,"x",24,null,114,"x",30,null,{"$f":"Epostnumb(I27)&\"-\"&T27","v":{"$error":"#VALUE!"}},{"$f":"epostspace(I27)","v":{"$error":"#NAME?"}},"EXIT 39",null,null,null,"3","U"]
[null,"EO-214",0," ",108,"x",24,null,108,"x",30,null,{"$f":"Epostnumb(I28)&\"-\"&T28","v":{"$error":"#VALUE!"}},{"$f":"epostspace(I28)","v":{"$error":"#NAME?"}},"EXIT 41A",null,null,null,"3","U"]
[null,"EO-215",0," ",108,"x",24,null,108,"x",30,null,{"$f":"Epostnumb(I29)&\"-\"&T29","v":{"$error":"#VALUE!"}},{"$f":"epostspace(I29)","v":{"$error":"#NAME?"}},"EXIT 41B",null,null,null,"3","U"]
[null,"EO-216",0," ",150,"x",24,null,150,"x",30,null,{"$f":"Epostnumb(I30)&\"-\"&T30","v":{"$error":"#VALUE!"}},{"$f":"epostspace(I30)","v":{"$error":"#NAME?"}},"EXITS 41A&B",null,null,null,"3","U"]
[null,"EO-217",0," ",114,"x",24,null,114,"x",30,null,{"$f":"Epostnumb(I31)&\"-\"&T31","v":{"$error":"#VALUE!"}},"42","EXIT 42A",null,null,null,"3","U"]
[null,null,null," "]
[null,"EO-218",0," ",114,"x",24,null,114,"x",30,null,{"$f":"Epostnumb(I33)&\"-\"&T33","v":{"$error":"#VALUE!"}},{"$f":"epostspace(I33)","v":{"$error":"#NAME?"}},"EXIT 42B",null,null,null,"3","U"]
[null,"EO-219",0," ",114,"x",24,null,114,"x",30,null,{"$f":"Epostnumb(I34)&\"-\"&T34","v":{"$error":"#VALUE!"}},"42","EXIT 43A",null,null,null,"3","U"]
[null,null,null," "]
[null,"EO-220",0," ",114,"x",24,null,114,"x",30,null,{"$f":"Epostnumb(I36)&\"-\"&T36","v":{"$error":"#VALUE!"}},{"$f":"epostspace(I36)","v":{"$error":"#NAME?"}},"EXIT 43B",null,null,null,"3","U"]
[null,"EO-221",0," ",96,"x",24,null,96,"x",30,null,{"$f":"Epostnumb(I37)&\"-\"&T37","v":{"$error":"#VALUE!"}},{"$f":"epostspace(I37)","v":{"$error":"#NAME?"}},"EXIT 45",null,null,null,"3","U"]
[null,"TOTAL ",{"$f":"SUM(C6:C37)","v":0}]
[null," "]
[null,"GENERAL NOTES:"]
[null,"1.  SEE STANDARD PLAN 5-297.710 FOR TYPE EO STRUCTURAL DETAILS."]
[null,"2.  TYPE EO POST SPACING MAY BE VARIED TO MISS MEMBERS OF OH SIGN STRUCTURES."]

{"sheet":"EO SAW","index":59,"n_rows":10,"n_cols":10,"rows_kept":10,"cut":false,"hidden":false,"merged":[[2,1,2,9],[3,1,5,1],[3,2,5,2],[3,3,3,8],[3,9,5,9],[4,3,5,5],[4,6,5,8]]}
[]
[]
[null,"SAW SIGN PANELS TYPE EO (1)"]
[null,"SIGN NO","LOCATION","PANEL SIZE (INCH)",null,null,null,null,null,"LENGTH\nOF\nCUT (FT)"]
[null,null,null,"EXISTING ",null,null,"MODIFIED"]
[]
[null,"EO-204","BR 6850",96,"x",30,78,"x",30,2.5]
[]
[null,"SPECIFIC NOTE:"]
[null,"(1) PAID FOR UNDER SIGN PANEL OVERLAY TYPE EO"]

{"sheet":"OH REM","index":60,"n_rows":14,"n_cols":10,"rows_kept":14,"cut":false,"hidden":false,"merged":[[1,4,1,8],[2,8,3,8],[2,9,3,9],[2,4,3,4],[2,5,3,5],[2,6,3,6],[2,7,3,7]]}
[]
[null,null,null,null,"REMOVE SIGN TYPE OH",null,null,null,null,"AA"]
[null,null,null,null,"SIGN NO","LOCATION","TYPE","POST\nTYPE","SPAN","REMARKS"]
[]
[null,null,null,null,"OH I35W-068"," ","SIGN BRIDGE","III-S","93'-0\"","SEE SPECIAL PROVISIONS"]
[null,null,null,null,null," ","CANTILEVER"]
[null,null,null,null,null,null,"BR MNTD"]
[null,null,null,null,null,null,"BR MNTD"]
[null,null,null,null,null,null,"CANTILEVER"]
[null,null,null,null,null,null,"SIGN BRIDGE"]
[null,null,null,null,null,null,"SIGN BRIDGE - CANTILEVER"]
[null,null,null,null,null,null,"BUTTERFLY CANTILEVER"]
[]
[null,null,null,null,"total",{"$f":"COUNTA(E5:E12)","v":1}]

{"sheet":"OH SAL PN","index":61,"n_rows":9,"n_cols":7,"rows_kept":9,"cut":false,"hidden":false,"merged":[[3,6,4,6],[2,1,2,5],[3,5,5,5],[3,1,5,1],[3,2,5,2],[3,3,5,3],[3,4,5,4]]}
[]
[]
[null,"SALVAGE SIGN PANEL TYPE OH",null,null,null,null,"AA"]
[null,"SIGN NO","LOCATION","PANEL\nSIZE\n(INCH)","PANEL\nSIZE\n(INCH)","PANEL\nSIZE\n(INCH)","TOTAL\nPANELS "]
[]
[null,null,null,null,null,null,"EACH"]
[null,"OH I90-046"]
[]
[null,"TOTAL"," ",null," ",null,{"$f":"SUM(G7:G8)","v":0}]

{"sheet":"OHREPOSPNL","index":62,"n_rows":14,"n_cols":30,"rows_kept":14,"cut":false,"hidden":false,"merged":[[2,15,3,15],[1,1,1,14],[2,1,4,1],[2,2,4,2],[2,11,2,14],[3,11,3,14],[4,3,4,6],[4,7,4,10],[4,11,4,14],[2,3,2,6],[3,3,3,6],[2,7,2,10],[3,7,3,10],[2,29,3,29],[1,18,1,28],[2,18,3,18],[2,19,3,19],[2,20,3,20],[2,21,3,21],[2,22,2,28]]}
[]
[null,"REPOSITION SIGN PANEL TYPE OH",null,null,null,null,null,null,null,null,null,null,null,null,null,{"$f":"'SEQ-PSTAB'!B149","v":0},null,null,"OH STRUCTURE REPOSITONED PANEL LOCATIONS"]
[null,"SIGN NO","LOCATION","PANEL",null,null,null,"PANEL",null,null,null,"PANEL",null,null,null,"TOTAL\nPANELS ",null,null,"SIGN\nNO","LOCATION","TYPE","SPAN","PANEL SIZES AND LOCATION",null,null,null,null,null,null,"REMARKS"]
[null,null,null,"SIZE",null,null,null,"SIZE",null,null,null,"SIZE",null,null,null,null,null,null,null,null,null,null,"E","F x W","G","H x W","J","K x W","L"]
[null,null,null,"INCH",null,null,null,"INCH",null,null,null,"INCH",null,null,null,"EACH",null,null,"OH MN55-025 FWBT","1590+00 NB","SPAN","42'-0'","60\"","120\"","36\"","144\"","48\"","96\"","54\""]
[null,"OH I494-043","695+35 NB",84,"x",102,null,132,"x",126,null,162,"x",108,null,3]
[null,"OH I694-512","705+60 SB",168,"x",84,null,null,null,null,null,null,null,null,null,1]
[]
[]
[]
[null,null," ",null,null,null,null,null,null,null,null,null,null,"TOTAL",null,{"$f":"SUM(P6:P10)","v":4}]
[]
[]
[null,null,null,null," ",null," ",null," ",null," ",null," ",null," "]

{"sheet":"OH STRUCT QUAN","index":63,"n_rows":15,"n_cols":11,"rows_kept":15,"cut":false,"hidden":false,"merged":[[2,1,7,1],[1,1,1,8],[18,1,18,4],[2,2,6,2],[2,3,6,3],[2,4,6,4],[2,5,6,5],[2,9,6,9],[2,10,6,10],[2,6,6,6],[2,7,6,7],[2,8,6,8]]}
[]
[null," OVERHEAD SIGN STRUCTURE QUANTITIES ",null,null,null,null,null,null,null,null,"AA"]
[null,"OH SIGN NO","STRUCTURAL\nSTEEL-POSTS FOR\nOH SIGNS\n (D)","STRUCTURAL\n STEEL-TRUSSES\nFOR\nOH SIGNS\n(D)","STRUCTURAL\nSTEEL-WALKWAY\nSUPPORT FOR\nOH SIGNS\n(D)","STRUCTURAL\nSTEEL-WALKWAY\nGRATING FOR\nOH SIGNS\n(D)","STRUCTURAL\nSTEEL-PANEL MOUNT PST\nFOR OH SIGNS\n(D)","MEDIAN\nBARRIER\nFOOTING\n(SHAFT)","MEDIAN\nBARRIER\nFOOTING\n(SPREAD)","CONCRETE\nFOOTING\n(TYPE OH \nSPREAD)","CONCRETE FOOTINGS (TYPE OH SHAFT)"]
[]
[]
[]
[]
[null,null,"POUND","POUND","POUND","POUND","POUND","CU YD","CU YD","CU YD","CU TD"]
[null,"I94-697",5788,5712,0,0,664,0,0,0,15.9]
[null,"I94-698",5681,4428,0,0,230,0,0,0,15.9]
[null," ",0,0,0,0,0,0,0,0,0]
[null," ",0,0,0,0,0,0,0,0,0]
[null," ",0,0,0,0,0,0,0,0,0]
[null," ",0,0,0,0,0,0,0,0,0]
[null,"TOTAL",{"$f":"SUM(C9:C14)","v":11469},{"$f":"SUM(D9:D14)","v":10140},0,0,894,{"$f":"SUM(H9:H14)","v":0},0,{"$f":"SUM(J9:J14)","v":0},31.8]

{"sheet":"S & I_OH B","index":64,"n_rows":36,"n_cols":21,"rows_kept":36,"cut":false,"hidden":false,"merged":[[2,18,2,20],[2,6,5,6],[2,7,2,10],[2,11,5,11],[2,12,2,14],[2,15,2,17],[1,1,1,20],[3,15,4,16],[3,17,5,17],[3,18,4,19],[3,20,5,20],[2,1,5,1],[2,2,5,2],[3,7,5,7],[3,8,5,8],[3,9,5,9],[3,10,5,10],[3,12,4,13],[3,14,5,14],[2,3,5,3],[2,4,5,4],[2,5,5,5]]}
[]
[null,"SALVAGE AND INSTALL OVERHEAD SIGN STRUCTURES"]
[null,"INPLACE SIGN NO","INPLACE STATION","NEW SIGN NO.","NEW STATION","BRIDGE\nTYPE","TRUSS\nTYPE","SPAN LENGTHS",null,null,null,"LOW STEEL\nELEVATION\n(1)","LEFT POST",null,null,"CENTER POST",null,null,"RIGHT POST"]
[null,null,null,null,null,null,null,"LEFT\nCANT","RIGHT\nCANT","SPAN OR\nLEFT SPAN","RIGHT\nSPAN",null,"ELEVATION\n(1)",null,"TYPE","ELEVATION\n(1)",null,"TYPE","ELEVATION\n(1)",null,"TYPE"]
[]
[null,null,null,null,null,null,null,null,null,null,null,null,"A","B",null,"A","B",null,"A","B"]
[null,"OH I90-056",null,"OH I90-347",null,null,null,null,null,null,null,null," "]
[]
[]
[]
[]
[]
[null,null,null,"SPECIFIC NOTES:"]
[null,null,null,"(1)  CENTER LINE ELEVATION= 100.00"]
[null,null,null,"(2)  BASED ON TABULATED ELEVATIONS AND DIMENSIONS."]
[null,null,null,"     REVISE IF NECESSARY USING QUANTITY TABLES ON SHEET XX"]
[null,null,null,"(3)  SEE SHEET XX"]
[null,null,null,"(4)  DRILLED SHAFT FOOTING."]
[]
[]
[]
[]
[]
[]
[]
[]
[]
[]
[null,null,null,"* THIS CHART is ALWAYS used along with \"TABULATION OF OVERHEAD SIGN STRUCTURE QUANTITIES\" chart on the OH tabulation sheet with the Bridge Type figure drawings"]
[]
[null,null,null,"The SPECIFIC NOTES  are  COMBINED  on the two charts."]
[]
[]
[null,null,null,"NOTES (1) (4) are on the SALVAGE AND INSTALL OVERHEAD SIGN STRUCTURE chart"]
[]
[null,null,null,"NOTES (2) (3) are on the TABULATION OF OVERHEAD SIGN STRUCTURE QUANTITIES chart"]

{"sheet":"OH OL","index":65,"n_rows":21,"n_cols":16,"rows_kept":21,"cut":false,"hidden":false,"merged":[[20,1,20,11],[3,15,5,15],[2,1,2,14],[3,1,5,1],[3,2,5,2],[3,3,3,6],[3,7,3,10],[4,3,5,5],[4,6,5,6],[4,7,5,9],[4,10,5,10],[4,11,5,13],[4,14,5,14],[3,11,3,14]]}
[]
[]
[null,"SIGN PANEL OVERLAY TYPE OH ",null,null,null,null,null,null,null,null,null,null,null,null,null,"GG"]
[null,"SIGN NO","LOCATION","PANEL OVERLAY",null,null,null,"PANEL OVERLAY",null,null,null,"PANEL OVERLAY",null,null,null,"TOTAL\nAREA\n(SQ FT)"]
[null,null,null,"SIZE\n(INCH)",null,null,"AREA\n(SQ FT)","SIZE\n(INCH)",null,null,"AREA\n(SQ FT)","SIZE\n(INCH)",null,null,"AREA\n(SQ FT)"]
[]
[null,"OH I35W-314","39+00 NB",0,"x",114,{"$f":"D7*F7/144","v":0},0,"x",120,{"$f":"H7*J7/144","v":0},0,"x",90,{"$f":"L7*N7/144","v":0},{"$f":"SUM(G7+K7+O7)","v":0}]
[null,"OH I35W-315","40+80 NB",0,"x",120,{"$f":"D8*F8/144","v":0},null,null,null,null,null,null,null,null,{"$f":"SUM(G8+K8+O8)","v":0}]
[null,null," "]
[null,null," "]
[]
[]
[]
[]
[]
[]
[null,"TOTAL",null,null,null,null,null,null,null,null,null,null,null,null,null,{"$f":"SUM(P7:P16)","v":0}]
[]
[]
[null,"GENERAL NOTES:"]
[null,"1.  SEE SIGNING PANEL LAYOUT SHEETS FOR PANEL DESIGNS."]

{"sheet":"OH INSPN","index":66,"n_rows":9,"n_cols":7,"rows_kept":9,"cut":false,"hidden":false,"merged":[[3,6,4,6],[2,1,2,5],[3,5,5,5],[3,1,5,1],[3,2,5,2],[3,3,5,3],[3,4,5,4]]}
[]
[]
[null,"INSTALL SIGN PANEL TYPE OH",null,null,null,null,"AA"]
[null,"SIGN NO","LOCATION","PANEL\nSIZE\n(INCH)","PANEL\nSIZE\n(INCH)","PANEL\nSIZE\n(INCH)","TOTAL\nPANELS "]
[]
[null,null,null,null,null,null,"EACH"]
[null,"OH MN36-084","667+00 C D ROAD","114 x 126","126 x 126",null,0]
[]
[null,"TOTAL"," ",null," ",null,{"$f":"SUM(G7:G8)","v":0}]

{"sheet":"SIGN PANELS TYPE OH","index":67,"n_rows":23,"n_cols":16,"rows_kept":23,"cut":false,"hidden":false,"merged":[[24,1,24,11],[20,1,20,11],[2,1,2,14],[22,1,22,20],[4,7,5,9],[4,10,5,10],[4,11,5,13],[4,14,5,14],[3,11,3,14],[3,15,5,15],[4,3,5,5],[4,6,5,6],[3,1,5,1],[3,2,5,2],[3,3,3,6],[3,7,3,10]]}
[]
[]
[null,"SIGN PANELS TYPE OH ",null,null,null,null,null,null,null,null,null,null,null,null,null,"AA"]
[null,"SIGN NO","LOCATION","PANEL",null,null,null,"PANEL",null,null,null,"PANEL",null,null,null,"TOTAL\nAREA\n(SQ FT)"]
[null,null,null,"SIZE\n(INCH)",null,null,"AREA\n(SQ FT)","SIZE\n(INCH)",null,null,"AREA\n(SQ FT)","SIZE\n(INCH)",null,null,"AREA\n(SQ FT)"]
[]
[null,"OH I694-314","39+00 NB",0,"x",114,{"$f":"D7*F7/144","v":0},0,"x",120,{"$f":"H7*J7/144","v":0},0,"x",90,{"$f":"L7*N7/144","v":0},{"$f":"SUM(G7+K7+O7)","v":0}]
[null,"OH I694-315","40+80 NB",0,"x",120,{"$f":"D8*F8/144","v":0},null,null,null,null,null,null,null,null,{"$f":"SUM(G8+K8+O8)","v":0}]
[null,null," "]
[null,null," "]
[]
[]
[]
[]
[]
[]
[null,"TOTAL",null,null,null,null,null,null,null,null,null,null,null,null,null,{"$f":"SUM(P7:P16)","v":0}]
[]
[]
[null,"GENERAL NOTES:"]
[null,"1.  SEE SIGNING PANEL LAYOUT SHEETS FOR PANEL DESIGNS."]
[]
[null,"* THIS QUANTITY GETS COMBINED WITH  \"SIGN PANEL TYPE OH (EXTRUDED PANEL)\" QUANTITY ON THE SEQ(STATEMENT OF EST. QUANTITIES)"]

{"sheet":"OH ID ","index":68,"n_rows":19,"n_cols":5,"rows_kept":19,"cut":false,"hidden":false,"merged":[[1,1,1,3],[2,1,3,1],[2,3,3,3],[2,4,3,4]]}
[]
[null,"OH SIGN IDENTIFICATION PLATE",null,null,"KO"]
[null,"SIGN NO","QTY","LOCATION","IDENTIFICATION\nPLATE NO"]
[null,null,"EACH"]
[null,"OH MN610-045",0,"39+00 NB","610-045"]
[null,"OH MN280-035",0,"40+80 NB","280-035"]
[]
[]
[]
[]
[]
[]
[]
[null,"TOTAL ",{"$f":" SUM(C5:C13)","v":0}]
[]
[]
[null,"GENERAL NOTES:"]
[null,"1. SEE 2020 MNDOT STANDARD SIGNS AND MARKINGS MANUAL FOR OH SIGN IDENTIFICATION PLATE (X2-1) "]
[null,"2. SEE STANDARD PLAN 5-297.730 FOR MOUNTING DETAILS."]

{"sheet":"OH EXT REM","index":69,"n_rows":17,"n_cols":5,"rows_kept":17,"cut":false,"hidden":false,"merged":[[1,1,1,3],[26,2,26,3],[2,1,3,1],[2,2,3,2],[2,3,2,4],[18,2,18,5],[19,2,20,2],[19,3,20,3],[19,4,19,5]]}
[null,"OHEXTREM"]
[null,"REMOVE EXTRUDED PANEL SECTIONS TYPE OH (1)",null,null,"XX"]
[null,"SIGN NO","LOCATION","PANEL SIZE  (INCH)"]
[null,null,null,"REMOVE"," MODIFIED"]
[null,"OH I35W-64 (R)","35+00 SB","162 x 24","162 x 90"]
[null,"OH I35W-314 (L)","39+00 NB","204 x 24","204 x 90"]
[]
[]
[]
[]
[]
[]
[]
[]
[]
[]
[null,"(1) INCLUDED IN SIGN PANEL OVERLAY TYPE OH"]

{"sheet":"OH REMPAN","index":70,"n_rows":14,"n_cols":7,"rows_kept":14,"cut":false,"hidden":false,"merged":[[2,6,3,6],[1,1,1,5],[2,5,4,5],[2,1,4,1],[2,2,4,2],[2,3,4,3],[2,4,4,4]]}
[]
[null,"REMOVE SIGN PANEL TYPE OH",null,null,null,null,"AA"]
[null,"SIGN NO","LOCATION","PANEL\nSIZE\n(INCH)","PANEL\nSIZE\n(INCH)","PANEL\nSIZE\n(INCH)","TOTAL\nPANELS "]
[]
[null,null,null,null,null,null,"EACH"]
[null,"OH I494-043","695+35 NB","  84 x 102","132 x 126","162 x 108",3]
[null,"OH I494-045","705+60 SB","168 x   84",null,null,1]
[]
[]
[]
[]
[]
[]
[null,null," ",null," ","TOTAL",{"$f":"SUM(G6:G13)","v":4}]

{"sheet":"OH SAW","index":71,"n_rows":11,"n_cols":10,"rows_kept":11,"cut":false,"hidden":false,"merged":[[2,1,2,9],[3,1,5,1],[3,2,5,2],[3,3,3,8],[3,9,5,9],[4,3,5,5],[4,6,5,8]]}
[]
[]
[null,"SAW SIGN PANELS TYPE OH (1)"]
[null,"SIGN NO","LOCATION","PANEL SIZE (INCH)",null,null,null,null,null,"LENGTH\nOF\nCUT (FT)"]
[null,null,null,"EXISTING ",null,null,"MODIFIED"]
[]
[null,"OH US61-007",null,156,"x",96,132,"x",96,{"$f":"(I7)/12","v":8}]
[null,null,null,null,"x",null,null,"x",null,{"$f":"(I8)/12","v":0}]
[]
[null,"SPECIFIC NOTE:"]
[null,"(1) PAID FOR UNDER SIGN PANEL OVERLAY TYPE OH"]

{"sheet":"OH PMP","index":72,"n_rows":8,"n_cols":7,"rows_kept":8,"cut":false,"hidden":false,"merged":[[1,1,1,5],[2,5,4,5],[2,6,4,6],[2,1,4,1],[2,2,4,2],[2,3,4,3],[2,4,4,4]]}
[]
[null,"PANEL MOUNTING POSTS (S4x7.7)",null,null,null,null,"AA"]
[null,"SIGN NO","TRUSS\nDEPTH\n(INCH)","CHORD \nANGLES\n(INCH)","NO.\nOF\nPOSTS","LENGTH\nAPPROX\n(INCH)","WEIGHT\n(POUND)"]
[]
[]
[null,"OH US7-015",72,"6 x 6 x 1/2",2,88,148]
[]
[null,null,null,null," ","TOTAL",{"$f":"SUM(G6:G7)","v":148}]

{"sheet":"OH PMP MOD","index":73,"n_rows":32,"n_cols":6,"rows_kept":32,"cut":false,"hidden":false,"merged":[[30,1,30,8],[31,1,32,8],[27,1,27,6],[21,2,21,7],[2,1,2,5],[3,1,6,1],[3,2,3,5],[4,2,6,2],[4,3,6,3],[4,4,6,4],[4,5,6,5],[20,1,20,8]]}
[]
[]
[null,"MODIFY POST    (1) (2)"]
[null,"SIGN NO","PANEL MOUNTING POSTS   "]
[null,null," NO.","SIZE","EXTEND\nAPPROX.\n(INCH)","SHORTEN\nAPPROX.\n(INCH)"]
[null,null,null,null,null," "]
[]
[null,"OH I35E-139 (L)",2,"S4x7.7",18]
[null,"OH I35E-139 (R)",3,"S4x7.7",18]
[null,"OH I35E-238 (R)",2,"S4x7.7",12]
[]
[null,"SPECIFIC NOTES:"]
[null," (1)  SEE STANDARD PLAN 5-297.750 FOR DETAILS.  "]
[null," (2)  INCLUDED IN SIGN PANEL OVERLAY TYPE OH."]
[]
[]
[]
[]
[]
[]
[null,"* Panel Mounting Post SIZES (FROM NOTE 3 ON Standard Plan 5-297.771)"]
[null,null,"PANEL HEIGHT DETERMINES PMP SIZE."]
[null,null,"SIZE","S4x7.7","IF PANEL HEIGHT IS 11'-0\" OR LESS"]
[null,null,"SIZE","W6x12","IF PANEL HEIGHT IS 11'-6\" OR GREATER "]
[]
[]
[null,"   Size S4x7.7 posts should not be extended beyond 11'-0\"."]
[null," IF PANEL HEIGHT is less than 11'-0\" and is increasing to GREATER than 11'-0\" \nthe panel mounting posts should be REPLACED rather than extended"]
[]
[]
[null,"DO NOT ADD MORE THAN 3 FEET of extension to the Panel Mounting Post(s)"]
[null,"If it needs to be extended more than 3 FEET, it is preferable to replace the Panel Mounting Post"]

{"sheet":"BMST","index":74,"n_rows":13,"n_cols":4,"rows_kept":13,"cut":false,"hidden":false,"merged":[[1,1,1,2]]}
[]
[null,"STRUCT. STEEL TRUSSES TYPE OH BR. MTD (1)",null,"AA"]
[null,"SIGN NO","BRIDGE NO","POUND"]
[null,"OH MN22-014",52007,0]
[]
[]
[]
[]
[null,"TOTAL",null,{"$f":"SUM(D4:D8)","v":0}]
[]
[]
[null,"SPECIFIC NOTES:"]
[null,"(1) INCLUDES F & I OH SIGN IDENTIFICATION PLATE (X2-1)"]

{"sheet":"SIGN PANELS TYPE OH (EXT PAN )","index":75,"n_rows":15,"n_cols":10,"rows_kept":15,"cut":false,"hidden":false,"merged":[[1,1,1,6],[14,1,14,18],[4,9,7,10],[2,1,5,1],[2,2,5,2],[2,3,3,6],[2,7,5,7],[4,3,5,5],[4,6,5,6]]}
[null,"OHEXTFI"]
[null," SIGN PANELS TYPE OH (EXTRUDED PANEL SECTIONS)",null,null,null,null,null,"AA"]
[null,"SIGN NO","LOCATION","EXTRUDED\nPANEL SECTIONS",null,null,null,"REQUIRED\nPANEL \nSIZE\n(INCH)"]
[]
[null,null,null,"SIZE\n(INCH)",null,null,"AREA\n(SQ FT)",null,null,"used for adding extruded panel sections to an OH sign panel."]
[]
[null,"OH I94-100 (L)","EB TH 94 STA 228+40",0,"x",6,{"$f":"D7*F7/144","v":0},"144 x 102"]
[null,"TOTAL",null,null,null,null,{"$f":"SUM(G7:G7)","v":0}]
[]
[]
[]
[]
[]
[]
[null,"* THIS QUANTITY GETS COMBINED WITH  \"SIGN PANEL TYPE OH\" QUANTITY ON THE SEQ(STATEMENT OF EST. QUANTITIES)"]

{"sheet":"REMOVE EXT PANEL SECT","index":76,"n_rows":10,"n_cols":8,"rows_kept":10,"cut":false,"hidden":false,"merged":[[1,1,1,6],[2,1,5,1],[2,2,5,2],[2,3,3,6],[2,7,5,7],[4,3,5,5],[4,6,5,6]]}
[null,"OHEXTFI"]
[null,"REMOVE (EXTRUDED PANEL SECTIONS)(1)",null,null,null,null,null,"TAA"]
[null,"SIGN NO","LOCATION","EXTRUDED\nPANEL SECTIONS",null,null,null,"REQUIRED\nPANEL \nSIZE\n(INCH)"]
[]
[null,null,null,"SIZE\n(INCH)",null,null,"AREA\n(SQ FT)"]
[]
[null,"OH I94-468(R)","EB TH 94 STA 95+00",0,"x",12,{"$f":"D7*F7/144","v":0},"150 x 96"]
[null,"TOTAL",null,null,null,null,{"$f":"SUM(G7)","v":0}]
[]
[null,"(1) INCLUDED IN SIGN PANEL OVERLAY TYPE OH"]

{"sheet":"OH REM FOOT","index":77,"n_rows":15,"n_cols":4,"rows_kept":15,"cut":false,"hidden":false,"merged":[[2,1,3,1],[2,2,3,2],[2,3,3,3],[1,1,1,2]]}
[null,"OHREMFTG"]
[null,"REMOVE SIGN FOOTING - TYPE OH",null,"AA"]
[null,"SIGN NO","LOCATION","FOOTING DEPTH\n(FT)"]
[]
[null,"OH MN100-053"," "," "]
[null,null," "," "]
[null,null,null," "]
[null,null,null," "]
[null,null,null," "]
[null,null,null," "]
[]
[]
[]
[]
[null,"TOTAL",{"$f":"COUNTA(B5:B10)","v":1}]

{"sheet":"OH SGN SUP CANT","index":78,"n_rows":14,"n_cols":6,"rows_kept":14,"cut":false,"hidden":false,"merged":[[3,1,4,1],[3,2,4,2],[3,3,4,3],[2,1,2,4]]}
[]
[]
[null,"CANTILEVER SIGN SUPPORT",null,null,null,"STZ"]
[null,"SIGN NO","LOCATION","SPAN","PANEL","POST"]
[null,null,null,null," ELEV. A"," ELEV. B"]
[null,"OH MN65-024","208+85 NB","30'-0\"",117.46,101.55]
[null,null,"208+85 NB","13'-0\"",117.11,100.39]
[]
[]
[]
[]
[]
[]
["TOTAL",{"$f":"COUNTA(B6:B11)","v":1}]

{"sheet":"OH SIGN SUP BRIDGE","index":79,"n_rows":18,"n_cols":7,"rows_kept":18,"cut":false,"hidden":false,"merged":[[2,6,3,6],[1,1,1,5],[2,1,4,1],[2,2,4,2],[2,3,4,3],[2,4,3,4],[2,5,3,5]]}
["","OHSSSB"]
[null,"SIGN BRIDGE SIGN SUPPORT",null,null,null,null,"PIL"]
[null,"SIGN\nNO","LOCATION","SPAN","PANEL","LEFT\nPOST","RIGHT\nPOST"]
[]
[null,null,null,null," Elev A"," Elev B"," Elev B"]
[null,"OH MN47-008","1590+00 NB","67'-0\"",117.33,98.5,99.5]
[]
[]
[]
[]
[]
[]
[]
[]
[]
[]
[]
[null,"TOTAL",{"$f":"COUNTA(B6:B13)","v":1}]

{"sheet":"OH REM WKWY","index":80,"n_rows":13,"n_cols":5,"rows_kept":13,"cut":false,"hidden":false,"merged":[[2,1,3,1],[2,2,3,2],[2,3,3,3],[2,4,3,4],[1,1,1,3]]}
[]
[null,"REMOVE SIGN WALKWAY  (1)(2)(3)",null,null,"AA"]
[null,"SIGN NO","LOCATION","LENGTH\n(FT)","NUMBER OF FIXTURES"]
[]
[null,"OHI 35E-164"]
[]
[]
[null,null,"TOTAL ",{"$f":"SUM(D5:D7)","v":0}]
[]
[null,"SPECIFIC NOTES:"]
[null,"(1)  INCLUDES SIGN LIGHTING SYSTEM"]
[null,"(2)  REMOVE FEED POINT IDENTIFICATION PLATE NUMBER."]
[null,"(3)  SEE DIVISION ST FOR SPECIAL PROVISIONS."]

{"sheet":"OH REM LT SYS","index":81,"n_rows":15,"n_cols":7,"rows_kept":15,"cut":false,"hidden":false,"merged":[[1,1,1,5],[2,1,4,1],[2,2,4,2],[2,5,4,5],[2,6,4,6],[2,3,3,4]]}
[]
[null,"REMOVE SIGN LIGHTING SYSTEM",null,null,null,null,"AA"]
[null,"SIGN NO","OH DESIGN","FIXTURES",null,"SOURCE OF    POWER    VOLTAGE","FEED POINT ID          PLATE NO "]
[]
[null,null,null,"125 W","250 W"]
[null,"OH I35W-025","BR # ",null,4,"240/480","N2L/P"]
[null,null,null,null,null," "]
[]
[]
[]
[null,null,null,null,null," "]
[null,null,null,null,null," "]
[]
[]
[null,"TOTAL",{"$f":"COUNTA(B6:B12)","v":1}]

{"sheet":"safety cable","index":82,"n_rows":15,"n_cols":5,"rows_kept":15,"cut":false,"hidden":false,"merged":[[2,1,3,1],[2,2,3,2],[2,3,3,3],[1,1,1,3]]}
[]
[null,"SAFETY CABLE",null,null,{"$f":"'SEQ-PSTAB'!B137","v":0}]
[null,"SIGN NO","LOCATION","DESIGN","LENGTH"]
[null,null,null,null,"FEET"]
[null,"OH MN101-016","1079+80 WB","BR MTD",33]
[null,"OH MN101-024","21+50 LOOP B","B",33]
[null,"OH MN101-037","9+00 LEG A","A",30]
[null,null,null,"CANT"]
[]
[]
[]
[]
[]
[]
[null,null,null,"TOTAL ",{"$f":"SUM(E5:E14)","v":96}]

{"sheet":"REMOVE BRIDGE MTD OH LIGHT SYST","index":83,"n_rows":12,"n_cols":5,"rows_kept":12,"cut":false,"hidden":false,"merged":[[2,1,3,1],[2,2,3,2],[2,3,3,3],[2,4,3,4],[1,1,1,3]]}
[]
[null,"REMOVE SIGN LIGHTING SYSTEM   (1)",null,null,"TQ"]
[null,"SIGN NO","LOCATION","TYPE","NUMBER OF FIXTURES"]
[]
[null,"OH I94-458","BR 62878","BRIDGE MOUNTED",4]
[null,"OH I94-459","BR 62878","BRIDGE MOUNTED",4]
[null,"OH I94-459","BR 62878","BRIDGE MOUNTED",3]
[null,"TOTAL (EACH)",3]
[]
[null,"SPECIFIC NOTES:"]
[]
[null,"(1)  REMOVE FEED POINT IDENTIFICATION NUMBER."]

{"sheet":"SEQ-4Copy","index":84,"n_rows":10,"n_cols":10,"rows_kept":10,"cut":false,"hidden":false,"merged":[[4,1,4,6],[4,7,4,8],[5,2,7,2],[5,7,5,8],[6,7,6,8],[7,7,7,8]]}
[]
[]
[]
[]
[null,{"$f":"IF('SEQ-PSTAB'!F1<>\"\",'SEQ-PSTAB'!G1,IF('SEQ-PSTAB'!F2<>\"\",'SEQ-PSTAB'!G2,'SEQ-PSTAB'!G3))","v":"PERMANENT SIGNING TABULATION"},null,null,null,null,null,"X"]
[null,null,"SHEET\nNO",null,null,null,null,"TOTAL"]
[null,"TAB",null,"ITEM NO",null,"ITEM","UNIT","ESTIMATED"]
[null,null,null,null,null,null,null,"QUANTITIES"]
[null,null,null,null,null,null,null,null,null,"x"]
[null,null,null,null,null,null,null,null,null,"x"]

{"sheet":"Conc Rail Calc","index":85,"n_rows":22,"n_cols":25,"rows_kept":22,"cut":false,"hidden":false,"merged":[[20,20,21,20],[20,21,21,21],[20,22,21,22],[20,23,21,23],[20,24,21,24],[20,19,21,19],[19,3,19,5],[19,8,19,24],[20,6,21,6],[20,7,21,7],[20,8,21,8],[20,9,21,9],[20,10,21,10],[20,11,21,11],[20,12,21,12],[20,13,21,13],[20,14,21,14],[20,15,21,15],[20,16,21,16],[20,17,21,17],[20,18,21,18],[17,24,18,24],[17,13,18,13],[17,14,18,14],[17,15,18,15],[17,16,18,16],[17,17,18,17],[17,18,18,18],[17,19,18,19],[17,20,18,20],[17,21,18,21],[17,22,18,22],[17,23,18,23],[13,24,15,24],[16,3,16,5],[16,8,16,24],[17,6,18,6],[17,7,18,7],[17,8,18,8],[17,9,18,9],[17,10,18,10],[17,11,18,11],[17,12,18,12],[13,18,15,18],[13,19,15,19],[13,20,15,20],[13,21,15,21],[13,22,15,22],[13,23,15,23],[13,17,15,17],[2,23,3,23],[2,24,3,24],[12,3,12,5],[12,8,12,24],[13,6,15,6],[13,7,15,7],[13,8,15,8],[13,9,15,9],[13,10,15,10],[13,11,15,11],[13,12,15,12],[13,13,15,13],[13,14,15,14],[13,15,15,15],[13,16,15,16],[1,3,1,5],[1,7,1,24],[2,3,2,4],[2,6,3,6],[2,7,2,10],[2,14,3,14],[2,15,3,15],[2,16,2,20],[2,21,3,21],[2,22,3,22]]}
[]
[null,null,null,"Input Parameters",null,null,"Output","Output Conditions"]
[null,null,null,"Sign Size",null,"Configuration","STRUCTURE \nTYPE",null,null,null,null,null,null,null,"NOMINAL POST SIZE (IN.)","NOMINAL ARM SIZE (IN.)","CONCRETE ANCHOR",null,null,null,null,"FILL PLATE THICKNESS (IN.)","BENT PLATE THICKNESS (IN.)","SIDE PLATE THICKNESS (IN.)","STRUCTURE TYPE"]
[null,null,null,"Panel Width \"B\" (in)","Panel Height \"H\" (in)","Square or Diamond",null,"Arm Spacing \"0.6H\" (in)","Sign Area (SF)","Arm, \"A\" (in)","Maximum Arm (in)","Arm Condition 1","Arm Condtion 2","Arm Condition 3",null,null,"DIAMETER (IN.)","EMBEDMENT (IN.)","NUMBER REQUIRED","TORQUE \n(FT-LBS)","PROOF LOAD (KIPS)"]
[null,null,null,144,24,"square",{"$f":"Y5","v":"III"},{"$f":"MROUND(0.6*E5,3)","v":15},{"$f":"D5*E5/144","v":24},{"$f":"IF(F5=\"Square\",2+D5/2,2+(SQRT(2)/2)*D5)","v":74},{"$f":"IF(OR(I5<'[1]TABLE DATA'!$D$7,I5='[1]TABLE DATA'!$D$7),717.75/I5,IF(AND('[1]TABLE DATA'!$D$7<I5,OR(I5<'[1]TABLE DATA'!$D$8,I5='[1]TABLE DATA'!$D$8)),1695/I5,IF(AND('[1]TABLE DATA'!$D$8<I5,OR(I5<'[1]TABLE DATA'!$D$9,I5='[1]TABLE DATA'!$D$9)),2268/I5,IF(I5=\"Arm Too Long\", \"Reduce V or W\",\"Sign Too Wide\"))))","v":29.91},{"$f":"717.75/'[1]Input-Output Data'!I5","v":29.91},{"$f":"1695/I5","v":70.63},{"$f":"2268/I5","v":94.5},{"$f":"IF(I5=\"Arm Too Long\", \"Reduce V or W\",IF($I5>'[1]TABLE DATA'!$D$9,\"SIGN TOO LARGE\",IF(AND(OR($I5<'[1]TABLE DATA'!$D$7,$I5='[1]TABLE DATA'!$D$7),OR('[1]Input-Output Data'!$J5<'[1]Input-Output Data'!$K5,'[1]Input-Output Data'!$J5='[1]Input-Output Data'!$K5)),'[1]TABLE DATA'!F$7,IF(AND(OR($I5<'[1]TABLE DATA'!$D$7,$I5='[1]TABLE DATA'!$D$7),AND($J5>$L5),OR('[1]Input-Output Data'!$J5<'[1]Input-Output Data'!$M5,'[1]Input-Output Data'!$J5='[1]Input-Output Data'!$M5)),'[1]TABLE DATA'!F$8,IF(AND(OR($I5<'[1]TABLE DATA'!$D$7,$I5='[1]TABLE DATA'!$D$7),AND($J5>$M5),OR('[1]Input-Output Data'!$J5<'[1]Input-Output Data'!$N5,'[1]Input-Output Data'!$J5='[1]Input-Output Data'!$N5)),'[1]TABLE DATA'!F$9,IF(AND(OR($I5<'[1]TABLE DATA'!$D$7,$I5='[1]TABLE DATA'!$D$7),$J5>$N5),\"SIGN TOO WIDE\",IF(AND(AND($I5>'[1]TABLE DATA'!$D$7,OR($I5<'[1]TABLE DATA'!$D$8,$I5='[1]TABLE DATA'!$D$8)),'[1]Input-Output Data'!$J5<'[1]Input-Output Data'!$K5),'[1]TABLE DATA'!F$8,IF(AND(AND($I5>'[1]TABLE DATA'!$D$7,OR($I5<'[1]TABLE DATA'!$D$8,$I5='[1]TABLE DATA'!$D$8)),AND('[1]Input-Output Data'!$J5>'[1]Input-Output Data'!$M5,OR('[1]Input-Output Data'!$J5<'[1]Input-Output Data'!$N5,'[1]Input-Output Data'!$J5='[1]Input-Output Data'!$N5))),'[1]TABLE DATA'!F$9,IF(AND(AND($I5>'[1]TABLE DATA'!$D$7,OR($I5<'[1]TABLE DATA'!$D$8,$I5='[1]TABLE DATA'!$D$8)),$J5>'[1]Input-Output Data'!$N5),\"SIGN TOO WIDE\",IF(AND(AND($I5>'[1]TABLE DATA'!$D$8,OR($I5<'[1]TABLE DATA'!$D$9,$I5='[1]TABLE DATA'!$D$9)),'[1]Input-Output Data'!$J5<'[1]Input-Output Data'!$K5),'[1]TABLE DATA'!F$9,\"SIGN TOO WIDE\"))))))))))","v":5},{"$f":"IF(I5=\"Arm Too Long\", \"Reduce V or W\",IF($I5>'[1]TABLE DATA'!$D$9,\"SIGN TOO LARGE\",IF(AND(OR($I5<'[1]TABLE DATA'!$D$7,$I5='[1]TABLE DATA'!$D$7),OR('[1]Input-Output Data'!$J5<'[1]Input-Output Data'!$K5,'[1]Input-Output Data'!$J5='[1]Input-Output Data'!$K5)),'[1]TABLE DATA'!G$7,IF(AND(OR($I5<'[1]TABLE DATA'!$D$7,$I5='[1]TABLE DATA'!$D$7),AND($J5>$L5),OR('[1]Input-Output Data'!$J5<'[1]Input-Output Data'!$M5,'[1]Input-Output Data'!$J5='[1]Input-Output Data'!$M5)),'[1]TABLE DATA'!G$8,IF(AND(OR($I5<'[1]TABLE DATA'!$D$7,$I5='[1]TABLE DATA'!$D$7),AND($J5>$M5),OR('[1]Input-Output Data'!$J5<'[1]Input-Output Data'!$N5,'[1]Input-Output Data'!$J5='[1]Input-Output Data'!$N5)),'[1]TABLE DATA'!G$9,IF(AND(OR($I5<'[1]TABLE DATA'!$D$7,$I5='[1]TABLE DATA'!$D$7),$J5>$N5),\"SIGN TOO WIDE\",IF(AND(AND($I5>'[1]TABLE DATA'!$D$7,OR($I5<'[1]TABLE DATA'!$D$8,$I5='[1]TABLE DATA'!$D$8)),'[1]Input-Output Data'!$J5<'[1]Input-Output Data'!$K5),'[1]TABLE DATA'!G$8,IF(AND(AND($I5>'[1]TABLE DATA'!$D$7,OR($I5<'[1]TABLE DATA'!$D$8,$I5='[1]TABLE DATA'!$D$8)),AND('[1]Input-Output Data'!$J5>'[1]Input-Output Data'!$M5,OR('[1]Input-Output Data'!$J5<'[1]Input-Output Data'!$N5,'[1]Input-Output Data'!$J5='[1]Input-Output Data'!$N5))),'[1]TABLE DATA'!G$9,IF(AND(AND($I5>'[1]TABLE DATA'!$D$7,OR($I5<'[1]TABLE DATA'!$D$8,$I5='[1]TABLE DATA'!$D$8)),$J5>'[1]Input-Output Data'!$N5),\"SIGN TOO WIDE\",IF(AND(AND($I5>'[1]TABLE DATA'!$D$8,OR($I5<'[1]TABLE DATA'!$D$9,$I5='[1]TABLE DATA'!$D$9)),'[1]Input-Output Data'!$J5<'[1]Input-Output Data'!$K5),'[1]TABLE DATA'!G$9,\"SIGN TOO WIDE\"))))))))))","v":3},{"$f":"IF(I5=\"Arm Too Long\", \"Reduce V or W\",IF($I5>'[1]TABLE DATA'!$D$9,\"SIGN TOO LARGE\",IF(AND(OR($I5<'[1]TABLE DATA'!$D$7,$I5='[1]TABLE DATA'!$D$7),OR('[1]Input-Output Data'!$J5<'[1]Input-Output Data'!$K5,'[1]Input-Output Data'!$J5='[1]Input-Output Data'!$K5)),'[1]TABLE DATA'!H$7,IF(AND(OR($I5<'[1]TABLE DATA'!$D$7,$I5='[1]TABLE DATA'!$D$7),AND($J5>$L5),OR('[1]Input-Output Data'!$J5<'[1]Input-Output Data'!$M5,'[1]Input-Output Data'!$J5='[1]Input-Output Data'!$M5)),'[1]TABLE DATA'!H$8,IF(AND(OR($I5<'[1]TABLE DATA'!$D$7,$I5='[1]TABLE DATA'!$D$7),AND($J5>$M5),OR('[1]Input-Output Data'!$J5<'[1]Input-Output Data'!$N5,'[1]Input-Output Data'!$J5='[1]Input-Output Data'!$N5)),'[1]TABLE DATA'!H$9,IF(AND(OR($I5<'[1]TABLE DATA'!$D$7,$I5='[1]TABLE DATA'!$D$7),$J5>$N5),\"SIGN TOO WIDE\",IF(AND(AND($I5>'[1]TABLE DATA'!$D$7,OR($I5<'[1]TABLE DATA'!$D$8,$I5='[1]TABLE DATA'!$D$8)),'[1]Input-Output Data'!$J5<'[1]Input-Output Data'!$K5),'[1]TABLE DATA'!H$8,IF(AND(AND($I5>'[1]TABLE DATA'!$D$7,OR($I5<'[1]TABLE DATA'!$D$8,$I5='[1]TABLE DATA'!$D$8)),AND('[1]Input-Output Data'!$J5>'[1]Input-Output Data'!$M5,OR('[1]Input-Output Data'!$J5<'[1]Input-Output Data'!$N5,'[1]Input-Output Data'!$J5='[1]Input-Output Data'!$N5))),'[1]TABLE DATA'!H$9,IF(AND(AND($I5>'[1]TABLE DATA'!$D$7,OR($I5<'[1]TABLE DATA'!$D$8,$I5='[1]TABLE DATA'!$D$8)),$J5>'[1]Input-Output Data'!$N5),\"SIGN TOO WIDE\",IF(AND(AND($I5>'[1]TABLE DATA'!$D$8,OR($I5<'[1]TABLE DATA'!$D$9,$I5='[1]TABLE DATA'!$D$9)),'[1]Input-Output Data'!$J5<'[1]Input-Output Data'!$K5),'[1]TABLE DATA'!H$9,\"SIGN TOO WIDE\"))))))))))","v":0.875},{"$f":"IF(I5=\"Arm Too Long\", \"Reduce V or W\",IF($I5>'[1]TABLE DATA'!$D$9,\"SIGN TOO LARGE\",IF(AND(OR($I5<'[1]TABLE DATA'!$D$7,$I5='[1]TABLE DATA'!$D$7),OR('[1]Input-Output Data'!$J5<'[1]Input-Output Data'!$K5,'[1]Input-Output Data'!$J5='[1]Input-Output Data'!$K5)),'[1]TABLE DATA'!I$7,IF(AND(OR($I5<'[1]TABLE DATA'!$D$7,$I5='[1]TABLE DATA'!$D$7),AND($J5>$L5),OR('[1]Input-Output Data'!$J5<'[1]Input-Output Data'!$M5,'[1]Input-Output Data'!$J5='[1]Input-Output Data'!$M5)),'[1]TABLE DATA'!I$8,IF(AND(OR($I5<'[1]TABLE DATA'!$D$7,$I5='[1]TABLE DATA'!$D$7),AND($J5>$M5),OR('[1]Input-Output Data'!$J5<'[1]Input-Output Data'!$N5,'[1]Input-Output Data'!$J5='[1]Input-Output Data'!$N5)),'[1]TABLE DATA'!I$9,IF(AND(OR($I5<'[1]TABLE DATA'!$D$7,$I5='[1]TABLE DATA'!$D$7),$J5>$N5),\"SIGN TOO WIDE\",IF(AND(AND($I5>'[1]TABLE DATA'!$D$7,OR($I5<'[1]TABLE DATA'!$D$8,$I5='[1]TABLE DATA'!$D$8)),'[1]Input-Output Data'!$J5<'[1]Input-Output Data'!$K5),'[1]TABLE DATA'!I$8,IF(AND(AND($I5>'[1]TABLE DATA'!$D$7,OR($I5<'[1]TABLE DATA'!$D$8,$I5='[1]TABLE DATA'!$D$8)),AND('[1]Input-Output Data'!$J5>'[1]Input-Output Data'!$M5,OR('[1]Input-Output Data'!$J5<'[1]Input-Output Data'!$N5,'[1]Input-Output Data'!$J5='[1]Input-Output Data'!$N5))),'[1]TABLE DATA'!I$9,IF(AND(AND($I5>'[1]TABLE DATA'!$D$7,OR($I5<'[1]TABLE DATA'!$D$8,$I5='[1]TABLE DATA'!$D$8)),$J5>'[1]Input-Output Data'!$N5),\"SIGN TOO WIDE\",IF(AND(AND($I5>'[1]TABLE DATA'!$D$8,OR($I5<'[1]TABLE DATA'!$D$9,$I5='[1]TABLE DATA'!$D$9)),'[1]Input-Output Data'!$J5<'[1]Input-Output Data'!$K5),'[1]TABLE DATA'!I$9,\"SIGN TOO WIDE\"))))))))))","v":8},{"$f":"IF(I5=\"Arm Too Long\", \"Reduce V or W\",IF($I5>'[1]TABLE DATA'!$D$9,\"SIGN TOO LARGE\",IF(AND(OR($I5<'[1]TABLE DATA'!$D$7,$I5='[1]TABLE DATA'!$D$7),OR('[1]Input-Output Data'!$J5<'[1]Input-Output Data'!$K5,'[1]Input-Output Data'!$J5='[1]Input-Output Data'!$K5)),'[1]TABLE DATA'!J$7,IF(AND(OR($I5<'[1]TABLE DATA'!$D$7,$I5='[1]TABLE DATA'!$D$7),AND($J5>$L5),OR('[1]Input-Output Data'!$J5<'[1]Input-Output Data'!$M5,'[1]Input-Output Data'!$J5='[1]Input-Output Data'!$M5)),'[1]TABLE DATA'!J$8,IF(AND(OR($I5<'[1]TABLE DATA'!$D$7,$I5='[1]TABLE DATA'!$D$7),AND($J5>$M5),OR('[1]Input-Output Data'!$J5<'[1]Input-Output Data'!$N5,'[1]Input-Output Data'!$J5='[1]Input-Output Data'!$N5)),'[1]TABLE DATA'!J$9,IF(AND(OR($I5<'[1]TABLE DATA'!$D$7,$I5='[1]TABLE DATA'!$D$7),$J5>$N5),\"SIGN TOO WIDE\",IF(AND(AND($I5>'[1]TABLE DATA'!$D$7,OR($I5<'[1]TABLE DATA'!$D$8,$I5='[1]TABLE DATA'!$D$8)),'[1]Input-Output Data'!$J5<'[1]Input-Output Data'!$K5),'[1]TABLE DATA'!J$8,IF(AND(AND($I5>'[1]TABLE DATA'!$D$7,OR($I5<'[1]TABLE DATA'!$D$8,$I5='[1]TABLE DATA'!$D$8)),AND('[1]Input-Output Data'!$J5>'[1]Input-Output Data'!$M5,OR('[1]Input-Output Data'!$J5<'[1]Input-Output Data'!$N5,'[1]Input-Output Data'!$J5='[1]Input-Output Data'!$N5))),'[1]TABLE DATA'!J$9,IF(AND(AND($I5>'[1]TABLE DATA'!$D$7,OR($I5<'[1]TABLE DATA'!$D$8,$I5='[1]TABLE DATA'!$D$8)),$J5>'[1]Input-Output Data'!$N5),\"SIGN TOO WIDE\",IF(AND(AND($I5>'[1]TABLE DATA'!$D$8,OR($I5<'[1]TABLE DATA'!$D$9,$I5='[1]TABLE DATA'!$D$9)),'[1]Input-Output Data'!$J5<'[1]Input-Output Data'!$K5),'[1]TABLE DATA'!J$9,\"SIGN TOO WIDE\"))))))))))","v":3},{"$f":"IF(I5=\"Arm Too Long\", \"Reduce V or W\",IF($I5>'[1]TABLE DATA'!$D$9,\"SIGN TOO LARGE\",IF(AND(OR($I5<'[1]TABLE DATA'!$D$7,$I5='[1]TABLE DATA'!$D$7),OR('[1]Input-Output Data'!$J5<'[1]Input-Output Data'!$K5,'[1]Input-Output Data'!$J5='[1]Input-Output Data'!$K5)),'[1]TABLE DATA'!K$7,IF(AND(OR($I5<'[1]TABLE DATA'!$D$7,$I5='[1]TABLE DATA'!$D$7),AND($J5>$L5),OR('[1]Input-Output Data'!$J5<'[1]Input-Output Data'!$M5,'[1]Input-Output Data'!$J5='[1]Input-Output Data'!$M5)),'[1]TABLE DATA'!K$8,IF(AND(OR($I5<'[1]TABLE DATA'!$D$7,$I5='[1]TABLE DATA'!$D$7),AND($J5>$M5),OR('[1]Input-Output Data'!$J5<'[1]Input-Output Data'!$N5,'[1]Input-Output Data'!$J5='[1]Input-Output Data'!$N5)),'[1]TABLE DATA'!K$9,IF(AND(OR($I5<'[1]TABLE DATA'!$D$7,$I5='[1]TABLE DATA'!$D$7),$J5>$N5),\"SIGN TOO WIDE\",IF(AND(AND($I5>'[1]TABLE DATA'!$D$7,OR($I5<'[1]TABLE DATA'!$D$8,$I5='[1]TABLE DATA'!$D$8)),'[1]Input-Output Data'!$J5<'[1]Input-Output Data'!$K5),'[1]TABLE DATA'!K$8,IF(AND(AND($I5>'[1]TABLE DATA'!$D$7,OR($I5<'[1]TABLE DATA'!$D$8,$I5='[1]TABLE DATA'!$D$8)),AND('[1]Input-Output Data'!$J5>'[1]Input-Output Data'!$M5,OR('[1]Input-Output Data'!$J5<'[1]Input-Output Data'!$N5,'[1]Input-Output Data'!$J5='[1]Input-Output Data'!$N5))),'[1]TABLE DATA'!K$9,IF(AND(AND($I5>'[1]TABLE DATA'!$D$7,OR($I5<'[1]TABLE DATA'!$D$8,$I5='[1]TABLE DATA'!$D$8)),$J5>'[1]Input-Output Data'!$N5),\"SIGN TOO WIDE\",IF(AND(AND($I5>'[1]TABLE DATA'!$D$8,OR($I5<'[1]TABLE DATA'!$D$9,$I5='[1]TABLE DATA'!$D$9)),'[1]Input-Output Data'!$J5<'[1]Input-Output Data'!$K5),'[1]TABLE DATA'!K$9,\"SIGN TOO WIDE\"))))))))))","v":80},{"$f":"IF(I5=\"Arm Too Long\", \"Reduce V or W\",IF($I5>'[1]TABLE DATA'!$D$9,\"SIGN TOO LARGE\",IF(AND(OR($I5<'[1]TABLE DATA'!$D$7,$I5='[1]TABLE DATA'!$D$7),OR('[1]Input-Output Data'!$J5<'[1]Input-Output Data'!$K5,'[1]Input-Output Data'!$J5='[1]Input-Output Data'!$K5)),'[1]TABLE DATA'!L$7,IF(AND(OR($I5<'[1]TABLE DATA'!$D$7,$I5='[1]TABLE DATA'!$D$7),AND($J5>$L5),OR('[1]Input-Output Data'!$J5<'[1]Input-Output Data'!$M5,'[1]Input-Output Data'!$J5='[1]Input-Output Data'!$M5)),'[1]TABLE DATA'!L$8,IF(AND(OR($I5<'[1]TABLE DATA'!$D$7,$I5='[1]TABLE DATA'!$D$7),AND($J5>$M5),OR('[1]Input-Output Data'!$J5<'[1]Input-Output Data'!$N5,'[1]Input-Output Data'!$J5='[1]Input-Output Data'!$N5)),'[1]TABLE DATA'!L$9,IF(AND(OR($I5<'[1]TABLE DATA'!$D$7,$I5='[1]TABLE DATA'!$D$7),$J5>$N5),\"SIGN TOO WIDE\",IF(AND(AND($I5>'[1]TABLE DATA'!$D$7,OR($I5<'[1]TABLE DATA'!$D$8,$I5='[1]TABLE DATA'!$D$8)),'[1]Input-Output Data'!$J5<'[1]Input-Output Data'!$K5),'[1]TABLE DATA'!L$8,IF(AND(AND($I5>'[1]TABLE DATA'!$D$7,OR($I5<'[1]TABLE DATA'!$D$8,$I5='[1]TABLE DATA'!$D$8)),AND('[1]Input-Output Data'!$J5>'[1]Input-Output Data'!$M5,OR('[1]Input-Output Data'!$J5<'[1]Input-Output Data'!$N5,'[1]Input-Output Data'!$J5='[1]Input-Output Data'!$N5))),'[1]TABLE DATA'!L$9,IF(AND(AND($I5>'[1]TABLE DATA'!$D$7,OR($I5<'[1]TABLE DATA'!$D$8,$I5='[1]TABLE DATA'!$D$8)),$J5>'[1]Input-Output Data'!$N5),\"SIGN TOO WIDE\",IF(AND(AND($I5>'[1]TABLE DATA'!$D$8,OR($I5<'[1]TABLE DATA'!$D$9,$I5='[1]TABLE DATA'!$D$9)),'[1]Input-Output Data'!$J5<'[1]Input-Output Data'!$K5),'[1]TABLE DATA'!L$9,\"SIGN TOO WIDE\"))))))))))","v":14.5},{"$f":"IF(I5=\"Arm Too Long\", \"Reduce V or W\",IF($I5>'[1]TABLE DATA'!$D$9,\"SIGN TOO LARGE\",IF(AND(OR($I5<'[1]TABLE DATA'!$D$7,$I5='[1]TABLE DATA'!$D$7),OR('[1]Input-Output Data'!$J5<'[1]Input-Output Data'!$K5,'[1]Input-Output Data'!$J5='[1]Input-Output Data'!$K5)),'[1]TABLE DATA'!M$7,IF(AND(OR($I5<'[1]TABLE DATA'!$D$7,$I5='[1]TABLE DATA'!$D$7),AND($J5>$L5),OR('[1]Input-Output Data'!$J5<'[1]Input-Output Data'!$M5,'[1]Input-Output Data'!$J5='[1]Input-Output Data'!$M5)),'[1]TABLE DATA'!M$8,IF(AND(OR($I5<'[1]TABLE DATA'!$D$7,$I5='[1]TABLE DATA'!$D$7),AND($J5>$M5),OR('[1]Input-Output Data'!$J5<'[1]Input-Output Data'!$N5,'[1]Input-Output Data'!$J5='[1]Input-Output Data'!$N5)),'[1]TABLE DATA'!M$9,IF(AND(OR($I5<'[1]TABLE DATA'!$D$7,$I5='[1]TABLE DATA'!$D$7),$J5>$N5),\"SIGN TOO WIDE\",IF(AND(AND($I5>'[1]TABLE DATA'!$D$7,OR($I5<'[1]TABLE DATA'!$D$8,$I5='[1]TABLE DATA'!$D$8)),'[1]Input-Output Data'!$J5<'[1]Input-Output Data'!$K5),'[1]TABLE DATA'!M$8,IF(AND(AND($I5>'[1]TABLE DATA'!$D$7,OR($I5<'[1]TABLE DATA'!$D$8,$I5='[1]TABLE DATA'!$D$8)),AND('[1]Input-Output Data'!$J5>'[1]Input-Output Data'!$M5,OR('[1]Input-Output Data'!$J5<'[1]Input-Output Data'!$N5,'[1]Input-Output Data'!$J5='[1]Input-Output Data'!$N5))),'[1]TABLE DATA'!M$9,IF(AND(AND($I5>'[1]TABLE DATA'!$D$7,OR($I5<'[1]TABLE DATA'!$D$8,$I5='[1]TABLE DATA'!$D$8)),$J5>'[1]Input-Output Data'!$N5),\"SIGN TOO WIDE\",IF(AND(AND($I5>'[1]TABLE DATA'!$D$8,OR($I5<'[1]TABLE DATA'!$D$9,$I5='[1]TABLE DATA'!$D$9)),'[1]Input-Output Data'!$J5<'[1]Input-Output Data'!$K5),'[1]TABLE DATA'!M$9,\"SIGN TOO WIDE\"))))))))))","v":0.75},{"$f":"IF(I5=\"Arm Too Long\", \"Reduce V or W\",IF($I5>'[1]TABLE DATA'!$D$9,\"SIGN TOO LARGE\",IF(AND(OR($I5<'[1]TABLE DATA'!$D$7,$I5='[1]TABLE DATA'!$D$7),OR('[1]Input-Output Data'!$J5<'[1]Input-Output Data'!$K5,'[1]Input-Output Data'!$J5='[1]Input-Output Data'!$K5)),'[1]TABLE DATA'!N$7,IF(AND(OR($I5<'[1]TABLE DATA'!$D$7,$I5='[1]TABLE DATA'!$D$7),AND($J5>$L5),OR('[1]Input-Output Data'!$J5<'[1]Input-Output Data'!$M5,'[1]Input-Output Data'!$J5='[1]Input-Output Data'!$M5)),'[1]TABLE DATA'!N$8,IF(AND(OR($I5<'[1]TABLE DATA'!$D$7,$I5='[1]TABLE DATA'!$D$7),AND($J5>$M5),OR('[1]Input-Output Data'!$J5<'[1]Input-Output Data'!$N5,'[1]Input-Output Data'!$J5='[1]Input-Output Data'!$N5)),'[1]TABLE DATA'!N$9,IF(AND(OR($I5<'[1]TABLE DATA'!$D$7,$I5='[1]TABLE DATA'!$D$7),$J5>$N5),\"SIGN TOO WIDE\",IF(AND(AND($I5>'[1]TABLE DATA'!$D$7,OR($I5<'[1]TABLE DATA'!$D$8,$I5='[1]TABLE DATA'!$D$8)),'[1]Input-Output Data'!$J5<'[1]Input-Output Data'!$K5),'[1]TABLE DATA'!N$8,IF(AND(AND($I5>'[1]TABLE DATA'!$D$7,OR($I5<'[1]TABLE DATA'!$D$8,$I5='[1]TABLE DATA'!$D$8)),AND('[1]Input-Output Data'!$J5>'[1]Input-Output Data'!$M5,OR('[1]Input-Output Data'!$J5<'[1]Input-Output Data'!$N5,'[1]Input-Output Data'!$J5='[1]Input-Output Data'!$N5))),'[1]TABLE DATA'!N$9,IF(AND(AND($I5>'[1]TABLE DATA'!$D$7,OR($I5<'[1]TABLE DATA'!$D$8,$I5='[1]TABLE DATA'!$D$8)),$J5>'[1]Input-Output Data'!$N5),\"SIGN TOO WIDE\",IF(AND(AND($I5>'[1]TABLE DATA'!$D$8,OR($I5<'[1]TABLE DATA'!$D$9,$I5='[1]TABLE DATA'!$D$9)),'[1]Input-Output Data'!$J5<'[1]Input-Output Data'!$K5),'[1]TABLE DATA'!N$9,\"SIGN TOO WIDE\"))))))))))","v":0.625},{"$f":"IF(I5=\"Arm Too Long\", \"Reduce V or W\",IF($I5>'[1]TABLE DATA'!$D$9,\"SIGN TOO LARGE\",IF(AND(OR($I5<'[1]TABLE DATA'!$D$7,$I5='[1]TABLE DATA'!$D$7),OR('[1]Input-Output Data'!$J5<'[1]Input-Output Data'!$K5,'[1]Input-Output Data'!$J5='[1]Input-Output Data'!$K5)),'[1]TABLE DATA'!O$7,IF(AND(OR($I5<'[1]TABLE DATA'!$D$7,$I5='[1]TABLE DATA'!$D$7),AND($J5>$L5),OR('[1]Input-Output Data'!$J5<'[1]Input-Output Data'!$M5,'[1]Input-Output Data'!$J5='[1]Input-Output Data'!$M5)),'[1]TABLE DATA'!O$8,IF(AND(OR($I5<'[1]TABLE DATA'!$D$7,$I5='[1]TABLE DATA'!$D$7),AND($J5>$M5),OR('[1]Input-Output Data'!$J5<'[1]Input-Output Data'!$N5,'[1]Input-Output Data'!$J5='[1]Input-Output Data'!$N5)),'[1]TABLE DATA'!O$9,IF(AND(OR($I5<'[1]TABLE DATA'!$D$7,$I5='[1]TABLE DATA'!$D$7),$J5>$N5),\"SIGN TOO WIDE\",IF(AND(AND($I5>'[1]TABLE DATA'!$D$7,OR($I5<'[1]TABLE DATA'!$D$8,$I5='[1]TABLE DATA'!$D$8)),'[1]Input-Output Data'!$J5<'[1]Input-Output Data'!$K5),'[1]TABLE DATA'!O$8,IF(AND(AND($I5>'[1]TABLE DATA'!$D$7,OR($I5<'[1]TABLE DATA'!$D$8,$I5='[1]TABLE DATA'!$D$8)),AND('[1]Input-Output Data'!$J5>'[1]Input-Output Data'!$M5,OR('[1]Input-Output Data'!$J5<'[1]Input-Output Data'!$N5,'[1]Input-Output Data'!$J5='[1]Input-Output Data'!$N5))),'[1]TABLE DATA'!O$9,IF(AND(AND($I5>'[1]TABLE DATA'!$D$7,OR($I5<'[1]TABLE DATA'!$D$8,$I5='[1]TABLE DATA'!$D$8)),$J5>'[1]Input-Output Data'!$N5),\"SIGN TOO WIDE\",IF(AND(AND($I5>'[1]TABLE DATA'!$D$8,OR($I5<'[1]TABLE DATA'!$D$9,$I5='[1]TABLE DATA'!$D$9)),'[1]Input-Output Data'!$J5<'[1]Input-Output Data'!$K5),'[1]TABLE DATA'!O$9,\"SIGN TOO WIDE\"))))))))))","v":0.625},{"$f":"IF(V5=0.5,\"I\",IF(V5=0.625,\"II\",IF(V5=0.75,\"III\",\"N/A\")))","v":"III"}]
[null,null,null,48,48,"Diamond",{"$f":"Y6","v":"I"},30,{"$f":"D6*E6/144","v":16},{"$f":"IF(F6=\"Square\",2+D6/2,2+(SQRT(2)/2)*D6)","v":35.9},{"$f":"IF(OR(I6<'[1]TABLE DATA'!$D$7,I6='[1]TABLE DATA'!$D$7),717.75/I6,IF(AND('[1]TABLE DATA'!$D$7<I6,OR(I6<'[1]TABLE DATA'!$D$8,I6='[1]TABLE DATA'!$D$8)),1695/I6,IF(AND('[1]TABLE DATA'!$D$8<I6,OR(I6<'[1]TABLE DATA'!$D$9,I6='[1]TABLE DATA'!$D$9)),2268/I6,IF(I6=\"Arm Too Long\", \"Reduce V or W\",\"Sign Too Wide\"))))","v":44.86},{"$f":"717.75/'[1]Input-Output Data'!I6","v":44.86},{"$f":"1695/I6","v":105.94},{"$f":"2268/I6","v":141.75},{"$f":"IF(I6=\"Arm Too Long\", \"Reduce V or W\",IF($I6>'[1]TABLE DATA'!$D$9,\"SIGN TOO LARGE\",IF(AND(OR($I6<'[1]TABLE DATA'!$D$7,$I6='[1]TABLE DATA'!$D$7),OR('[1]Input-Output Data'!$J6<'[1]Input-Output Data'!$K6,'[1]Input-Output Data'!$J6='[1]Input-Output Data'!$K6)),'[1]TABLE DATA'!F$7,IF(AND(OR($I6<'[1]TABLE DATA'!$D$7,$I6='[1]TABLE DATA'!$D$7),AND($J6>$L6),OR('[1]Input-Output Data'!$J6<'[1]Input-Output Data'!$M6,'[1]Input-Output Data'!$J6='[1]Input-Output Data'!$M6)),'[1]TABLE DATA'!F$8,IF(AND(OR($I6<'[1]TABLE DATA'!$D$7,$I6='[1]TABLE DATA'!$D$7),AND($J6>$M6),OR('[1]Input-Output Data'!$J6<'[1]Input-Output Data'!$N6,'[1]Input-Output Data'!$J6='[1]Input-Output Data'!$N6)),'[1]TABLE DATA'!F$9,IF(AND(OR($I6<'[1]TABLE DATA'!$D$7,$I6='[1]TABLE DATA'!$D$7),$J6>$N6),\"SIGN TOO WIDE\",IF(AND(AND($I6>'[1]TABLE DATA'!$D$7,OR($I6<'[1]TABLE DATA'!$D$8,$I6='[1]TABLE DATA'!$D$8)),'[1]Input-Output Data'!$J6<'[1]Input-Output Data'!$K6),'[1]TABLE DATA'!F$8,IF(AND(AND($I6>'[1]TABLE DATA'!$D$7,OR($I6<'[1]TABLE DATA'!$D$8,$I6='[1]TABLE DATA'!$D$8)),AND('[1]Input-Output Data'!$J6>'[1]Input-Output Data'!$M6,OR('[1]Input-Output Data'!$J6<'[1]Input-Output Data'!$N6,'[1]Input-Output Data'!$J6='[1]Input-Output Data'!$N6))),'[1]TABLE DATA'!F$9,IF(AND(AND($I6>'[1]TABLE DATA'!$D$7,OR($I6<'[1]TABLE DATA'!$D$8,$I6='[1]TABLE DATA'!$D$8)),$J6>'[1]Input-Output Data'!$N6),\"SIGN TOO WIDE\",IF(AND(AND($I6>'[1]TABLE DATA'!$D$8,OR($I6<'[1]TABLE DATA'!$D$9,$I6='[1]TABLE DATA'!$D$9)),'[1]Input-Output Data'!$J6<'[1]Input-Output Data'!$K6),'[1]TABLE DATA'!F$9,\"SIGN TOO WIDE\"))))))))))","v":4},{"$f":"IF(I6=\"Arm Too Long\", \"Reduce V or W\",IF($I6>'[1]TABLE DATA'!$D$9,\"SIGN TOO LARGE\",IF(AND(OR($I6<'[1]TABLE DATA'!$D$7,$I6='[1]TABLE DATA'!$D$7),OR('[1]Input-Output Data'!$J6<'[1]Input-Output Data'!$K6,'[1]Input-Output Data'!$J6='[1]Input-Output Data'!$K6)),'[1]TABLE DATA'!G$7,IF(AND(OR($I6<'[1]TABLE DATA'!$D$7,$I6='[1]TABLE DATA'!$D$7),AND($J6>$L6),OR('[1]Input-Output Data'!$J6<'[1]Input-Output Data'!$M6,'[1]Input-Output Data'!$J6='[1]Input-Output Data'!$M6)),'[1]TABLE DATA'!G$8,IF(AND(OR($I6<'[1]TABLE DATA'!$D$7,$I6='[1]TABLE DATA'!$D$7),AND($J6>$M6),OR('[1]Input-Output Data'!$J6<'[1]Input-Output Data'!$N6,'[1]Input-Output Data'!$J6='[1]Input-Output Data'!$N6)),'[1]TABLE DATA'!G$9,IF(AND(OR($I6<'[1]TABLE DATA'!$D$7,$I6='[1]TABLE DATA'!$D$7),$J6>$N6),\"SIGN TOO WIDE\",IF(AND(AND($I6>'[1]TABLE DATA'!$D$7,OR($I6<'[1]TABLE DATA'!$D$8,$I6='[1]TABLE DATA'!$D$8)),'[1]Input-Output Data'!$J6<'[1]Input-Output Data'!$K6),'[1]TABLE DATA'!G$8,IF(AND(AND($I6>'[1]TABLE DATA'!$D$7,OR($I6<'[1]TABLE DATA'!$D$8,$I6='[1]TABLE DATA'!$D$8)),AND('[1]Input-Output Data'!$J6>'[1]Input-Output Data'!$M6,OR('[1]Input-Output Data'!$J6<'[1]Input-Output Data'!$N6,'[1]Input-Output Data'!$J6='[1]Input-Output Data'!$N6))),'[1]TABLE DATA'!G$9,IF(AND(AND($I6>'[1]TABLE DATA'!$D$7,OR($I6<'[1]TABLE DATA'!$D$8,$I6='[1]TABLE DATA'!$D$8)),$J6>'[1]Input-Output Data'!$N6),\"SIGN TOO WIDE\",IF(AND(AND($I6>'[1]TABLE DATA'!$D$8,OR($I6<'[1]TABLE DATA'!$D$9,$I6='[1]TABLE DATA'!$D$9)),'[1]Input-Output Data'!$J6<'[1]Input-Output Data'!$K6),'[1]TABLE DATA'!G$9,\"SIGN TOO WIDE\"))))))))))","v":2},{"$f":"IF(I6=\"Arm Too Long\", \"Reduce V or W\",IF($I6>'[1]TABLE DATA'!$D$9,\"SIGN TOO LARGE\",IF(AND(OR($I6<'[1]TABLE DATA'!$D$7,$I6='[1]TABLE DATA'!$D$7),OR('[1]Input-Output Data'!$J6<'[1]Input-Output Data'!$K6,'[1]Input-Output Data'!$J6='[1]Input-Output Data'!$K6)),'[1]TABLE DATA'!H$7,IF(AND(OR($I6<'[1]TABLE DATA'!$D$7,$I6='[1]TABLE DATA'!$D$7),AND($J6>$L6),OR('[1]Input-Output Data'!$J6<'[1]Input-Output Data'!$M6,'[1]Input-Output Data'!$J6='[1]Input-Output Data'!$M6)),'[1]TABLE DATA'!H$8,IF(AND(OR($I6<'[1]TABLE DATA'!$D$7,$I6='[1]TABLE DATA'!$D$7),AND($J6>$M6),OR('[1]Input-Output Data'!$J6<'[1]Input-Output Data'!$N6,'[1]Input-Output Data'!$J6='[1]Input-Output Data'!$N6)),'[1]TABLE DATA'!H$9,IF(AND(OR($I6<'[1]TABLE DATA'!$D$7,$I6='[1]TABLE DATA'!$D$7),$J6>$N6),\"SIGN TOO WIDE\",IF(AND(AND($I6>'[1]TABLE DATA'!$D$7,OR($I6<'[1]TABLE DATA'!$D$8,$I6='[1]TABLE DATA'!$D$8)),'[1]Input-Output Data'!$J6<'[1]Input-Output Data'!$K6),'[1]TABLE DATA'!H$8,IF(AND(AND($I6>'[1]TABLE DATA'!$D$7,OR($I6<'[1]TABLE DATA'!$D$8,$I6='[1]TABLE DATA'!$D$8)),AND('[1]Input-Output Data'!$J6>'[1]Input-Output Data'!$M6,OR('[1]Input-Output Data'!$J6<'[1]Input-Output Data'!$N6,'[1]Input-Output Data'!$J6='[1]Input-Output Data'!$N6))),'[1]TABLE DATA'!H$9,IF(AND(AND($I6>'[1]TABLE DATA'!$D$7,OR($I6<'[1]TABLE DATA'!$D$8,$I6='[1]TABLE DATA'!$D$8)),$J6>'[1]Input-Output Data'!$N6),\"SIGN TOO WIDE\",IF(AND(AND($I6>'[1]TABLE DATA'!$D$8,OR($I6<'[1]TABLE DATA'!$D$9,$I6='[1]TABLE DATA'!$D$9)),'[1]Input-Output Data'!$J6<'[1]Input-Output Data'!$K6),'[1]TABLE DATA'!H$9,\"SIGN TOO WIDE\"))))))))))","v":0.625},{"$f":"IF(I6=\"Arm Too Long\", \"Reduce V or W\",IF($I6>'[1]TABLE DATA'!$D$9,\"SIGN TOO LARGE\",IF(AND(OR($I6<'[1]TABLE DATA'!$D$7,$I6='[1]TABLE DATA'!$D$7),OR('[1]Input-Output Data'!$J6<'[1]Input-Output Data'!$K6,'[1]Input-Output Data'!$J6='[1]Input-Output Data'!$K6)),'[1]TABLE DATA'!I$7,IF(AND(OR($I6<'[1]TABLE DATA'!$D$7,$I6='[1]TABLE DATA'!$D$7),AND($J6>$L6),OR('[1]Input-Output Data'!$J6<'[1]Input-Output Data'!$M6,'[1]Input-Output Data'!$J6='[1]Input-Output Data'!$M6)),'[1]TABLE DATA'!I$8,IF(AND(OR($I6<'[1]TABLE DATA'!$D$7,$I6='[1]TABLE DATA'!$D$7),AND($J6>$M6),OR('[1]Input-Output Data'!$J6<'[1]Input-Output Data'!$N6,'[1]Input-Output Data'!$J6='[1]Input-Output Data'!$N6)),'[1]TABLE DATA'!I$9,IF(AND(OR($I6<'[1]TABLE DATA'!$D$7,$I6='[1]TABLE DATA'!$D$7),$J6>$N6),\"SIGN TOO WIDE\",IF(AND(AND($I6>'[1]TABLE DATA'!$D$7,OR($I6<'[1]TABLE DATA'!$D$8,$I6='[1]TABLE DATA'!$D$8)),'[1]Input-Output Data'!$J6<'[1]Input-Output Data'!$K6),'[1]TABLE DATA'!I$8,IF(AND(AND($I6>'[1]TABLE DATA'!$D$7,OR($I6<'[1]TABLE DATA'!$D$8,$I6='[1]TABLE DATA'!$D$8)),AND('[1]Input-Output Data'!$J6>'[1]Input-Output Data'!$M6,OR('[1]Input-Output Data'!$J6<'[1]Input-Output Data'!$N6,'[1]Input-Output Data'!$J6='[1]Input-Output Data'!$N6))),'[1]TABLE DATA'!I$9,IF(AND(AND($I6>'[1]TABLE DATA'!$D$7,OR($I6<'[1]TABLE DATA'!$D$8,$I6='[1]TABLE DATA'!$D$8)),$J6>'[1]Input-Output Data'!$N6),\"SIGN TOO WIDE\",IF(AND(AND($I6>'[1]TABLE DATA'!$D$8,OR($I6<'[1]TABLE DATA'!$D$9,$I6='[1]TABLE DATA'!$D$9)),'[1]Input-Output Data'!$J6<'[1]Input-Output Data'!$K6),'[1]TABLE DATA'!I$9,\"SIGN TOO WIDE\"))))))))))","v":5.625},{"$f":"IF(I6=\"Arm Too Long\", \"Reduce V or W\",IF($I6>'[1]TABLE DATA'!$D$9,\"SIGN TOO LARGE\",IF(AND(OR($I6<'[1]TABLE DATA'!$D$7,$I6='[1]TABLE DATA'!$D$7),OR('[1]Input-Output Data'!$J6<'[1]Input-Output Data'!$K6,'[1]Input-Output Data'!$J6='[1]Input-Output Data'!$K6)),'[1]TABLE DATA'!J$7,IF(AND(OR($I6<'[1]TABLE DATA'!$D$7,$I6='[1]TABLE DATA'!$D$7),AND($J6>$L6),OR('[1]Input-Output Data'!$J6<'[1]Input-Output Data'!$M6,'[1]Input-Output Data'!$J6='[1]Input-Output Data'!$M6)),'[1]TABLE DATA'!J$8,IF(AND(OR($I6<'[1]TABLE DATA'!$D$7,$I6='[1]TABLE DATA'!$D$7),AND($J6>$M6),OR('[1]Input-Output Data'!$J6<'[1]Input-Output Data'!$N6,'[1]Input-Output Data'!$J6='[1]Input-Output Data'!$N6)),'[1]TABLE DATA'!J$9,IF(AND(OR($I6<'[1]TABLE DATA'!$D$7,$I6='[1]TABLE DATA'!$D$7),$J6>$N6),\"SIGN TOO WIDE\",IF(AND(AND($I6>'[1]TABLE DATA'!$D$7,OR($I6<'[1]TABLE DATA'!$D$8,$I6='[1]TABLE DATA'!$D$8)),'[1]Input-Output Data'!$J6<'[1]Input-Output Data'!$K6),'[1]TABLE DATA'!J$8,IF(AND(AND($I6>'[1]TABLE DATA'!$D$7,OR($I6<'[1]TABLE DATA'!$D$8,$I6='[1]TABLE DATA'!$D$8)),AND('[1]Input-Output Data'!$J6>'[1]Input-Output Data'!$M6,OR('[1]Input-Output Data'!$J6<'[1]Input-Output Data'!$N6,'[1]Input-Output Data'!$J6='[1]Input-Output Data'!$N6))),'[1]TABLE DATA'!J$9,IF(AND(AND($I6>'[1]TABLE DATA'!$D$7,OR($I6<'[1]TABLE DATA'!$D$8,$I6='[1]TABLE DATA'!$D$8)),$J6>'[1]Input-Output Data'!$N6),\"SIGN TOO WIDE\",IF(AND(AND($I6>'[1]TABLE DATA'!$D$8,OR($I6<'[1]TABLE DATA'!$D$9,$I6='[1]TABLE DATA'!$D$9)),'[1]Input-Output Data'!$J6<'[1]Input-Output Data'!$K6),'[1]TABLE DATA'!J$9,\"SIGN TOO WIDE\"))))))))))","v":2},{"$f":"IF(I6=\"Arm Too Long\", \"Reduce V or W\",IF($I6>'[1]TABLE DATA'!$D$9,\"SIGN TOO LARGE\",IF(AND(OR($I6<'[1]TABLE DATA'!$D$7,$I6='[1]TABLE DATA'!$D$7),OR('[1]Input-Output Data'!$J6<'[1]Input-Output Data'!$K6,'[1]Input-Output Data'!$J6='[1]Input-Output Data'!$K6)),'[1]TABLE DATA'!K$7,IF(AND(OR($I6<'[1]TABLE DATA'!$D$7,$I6='[1]TABLE DATA'!$D$7),AND($J6>$L6),OR('[1]Input-Output Data'!$J6<'[1]Input-Output Data'!$M6,'[1]Input-Output Data'!$J6='[1]Input-Output Data'!$M6)),'[1]TABLE DATA'!K$8,IF(AND(OR($I6<'[1]TABLE DATA'!$D$7,$I6='[1]TABLE DATA'!$D$7),AND($J6>$M6),OR('[1]Input-Output Data'!$J6<'[1]Input-Output Data'!$N6,'[1]Input-Output Data'!$J6='[1]Input-Output Data'!$N6)),'[1]TABLE DATA'!K$9,IF(AND(OR($I6<'[1]TABLE DATA'!$D$7,$I6='[1]TABLE DATA'!$D$7),$J6>$N6),\"SIGN TOO WIDE\",IF(AND(AND($I6>'[1]TABLE DATA'!$D$7,OR($I6<'[1]TABLE DATA'!$D$8,$I6='[1]TABLE DATA'!$D$8)),'[1]Input-Output Data'!$J6<'[1]Input-Output Data'!$K6),'[1]TABLE DATA'!K$8,IF(AND(AND($I6>'[1]TABLE DATA'!$D$7,OR($I6<'[1]TABLE DATA'!$D$8,$I6='[1]TABLE DATA'!$D$8)),AND('[1]Input-Output Data'!$J6>'[1]Input-Output Data'!$M6,OR('[1]Input-Output Data'!$J6<'[1]Input-Output Data'!$N6,'[1]Input-Output Data'!$J6='[1]Input-Output Data'!$N6))),'[1]TABLE DATA'!K$9,IF(AND(AND($I6>'[1]TABLE DATA'!$D$7,OR($I6<'[1]TABLE DATA'!$D$8,$I6='[1]TABLE DATA'!$D$8)),$J6>'[1]Input-Output Data'!$N6),\"SIGN TOO WIDE\",IF(AND(AND($I6>'[1]TABLE DATA'!$D$8,OR($I6<'[1]TABLE DATA'!$D$9,$I6='[1]TABLE DATA'!$D$9)),'[1]Input-Output Data'!$J6<'[1]Input-Output Data'!$K6),'[1]TABLE DATA'!K$9,\"SIGN TOO WIDE\"))))))))))","v":60},{"$f":"IF(I6=\"Arm Too Long\", \"Reduce V or W\",IF($I6>'[1]TABLE DATA'!$D$9,\"SIGN TOO LARGE\",IF(AND(OR($I6<'[1]TABLE DATA'!$D$7,$I6='[1]TABLE DATA'!$D$7),OR('[1]Input-Output Data'!$J6<'[1]Input-Output Data'!$K6,'[1]Input-Output Data'!$J6='[1]Input-Output Data'!$K6)),'[1]TABLE DATA'!L$7,IF(AND(OR($I6<'[1]TABLE DATA'!$D$7,$I6='[1]TABLE DATA'!$D$7),AND($J6>$L6),OR('[1]Input-Output Data'!$J6<'[1]Input-Output Data'!$M6,'[1]Input-Output Data'!$J6='[1]Input-Output Data'!$M6)),'[1]TABLE DATA'!L$8,IF(AND(OR($I6<'[1]TABLE DATA'!$D$7,$I6='[1]TABLE DATA'!$D$7),AND($J6>$M6),OR('[1]Input-Output Data'!$J6<'[1]Input-Output Data'!$N6,'[1]Input-Output Data'!$J6='[1]Input-Output Data'!$N6)),'[1]TABLE DATA'!L$9,IF(AND(OR($I6<'[1]TABLE DATA'!$D$7,$I6='[1]TABLE DATA'!$D$7),$J6>$N6),\"SIGN TOO WIDE\",IF(AND(AND($I6>'[1]TABLE DATA'!$D$7,OR($I6<'[1]TABLE DATA'!$D$8,$I6='[1]TABLE DATA'!$D$8)),'[1]Input-Output Data'!$J6<'[1]Input-Output Data'!$K6),'[1]TABLE DATA'!L$8,IF(AND(AND($I6>'[1]TABLE DATA'!$D$7,OR($I6<'[1]TABLE DATA'!$D$8,$I6='[1]TABLE DATA'!$D$8)),AND('[1]Input-Output Data'!$J6>'[1]Input-Output Data'!$M6,OR('[1]Input-Output Data'!$J6<'[1]Input-Output Data'!$N6,'[1]Input-Output Data'!$J6='[1]Input-Output Data'!$N6))),'[1]TABLE DATA'!L$9,IF(AND(AND($I6>'[1]TABLE DATA'!$D$7,OR($I6<'[1]TABLE DATA'!$D$8,$I6='[1]TABLE DATA'!$D$8)),$J6>'[1]Input-Output Data'!$N6),\"SIGN TOO WIDE\",IF(AND(AND($I6>'[1]TABLE DATA'!$D$8,OR($I6<'[1]TABLE DATA'!$D$9,$I6='[1]TABLE DATA'!$D$9)),'[1]Input-Output Data'!$J6<'[1]Input-Output Data'!$K6),'[1]TABLE DATA'!L$9,\"SIGN TOO WIDE\"))))))))))","v":7.4},{"$f":"IF(I6=\"Arm Too Long\", \"Reduce V or W\",IF($I6>'[1]TABLE DATA'!$D$9,\"SIGN TOO LARGE\",IF(AND(OR($I6<'[1]TABLE DATA'!$D$7,$I6='[1]TABLE DATA'!$D$7),OR('[1]Input-Output Data'!$J6<'[1]Input-Output Data'!$K6,'[1]Input-Output Data'!$J6='[1]Input-Output Data'!$K6)),'[1]TABLE DATA'!M$7,IF(AND(OR($I6<'[1]TABLE DATA'!$D$7,$I6='[1]TABLE DATA'!$D$7),AND($J6>$L6),OR('[1]Input-Output Data'!$J6<'[1]Input-Output Data'!$M6,'[1]Input-Output Data'!$J6='[1]Input-Output Data'!$M6)),'[1]TABLE DATA'!M$8,IF(AND(OR($I6<'[1]TABLE DATA'!$D$7,$I6='[1]TABLE DATA'!$D$7),AND($J6>$M6),OR('[1]Input-Output Data'!$J6<'[1]Input-Output Data'!$N6,'[1]Input-Output Data'!$J6='[1]Input-Output Data'!$N6)),'[1]TABLE DATA'!M$9,IF(AND(OR($I6<'[1]TABLE DATA'!$D$7,$I6='[1]TABLE DATA'!$D$7),$J6>$N6),\"SIGN TOO WIDE\",IF(AND(AND($I6>'[1]TABLE DATA'!$D$7,OR($I6<'[1]TABLE DATA'!$D$8,$I6='[1]TABLE DATA'!$D$8)),'[1]Input-Output Data'!$J6<'[1]Input-Output Data'!$K6),'[1]TABLE DATA'!M$8,IF(AND(AND($I6>'[1]TABLE DATA'!$D$7,OR($I6<'[1]TABLE DATA'!$D$8,$I6='[1]TABLE DATA'!$D$8)),AND('[1]Input-Output Data'!$J6>'[1]Input-Output Data'!$M6,OR('[1]Input-Output Data'!$J6<'[1]Input-Output Data'!$N6,'[1]Input-Output Data'!$J6='[1]Input-Output Data'!$N6))),'[1]TABLE DATA'!M$9,IF(AND(AND($I6>'[1]TABLE DATA'!$D$7,OR($I6<'[1]TABLE DATA'!$D$8,$I6='[1]TABLE DATA'!$D$8)),$J6>'[1]Input-Output Data'!$N6),\"SIGN TOO WIDE\",IF(AND(AND($I6>'[1]TABLE DATA'!$D$8,OR($I6<'[1]TABLE DATA'!$D$9,$I6='[1]TABLE DATA'!$D$9)),'[1]Input-Output Data'!$J6<'[1]Input-Output Data'!$K6),'[1]TABLE DATA'!M$9,\"SIGN TOO WIDE\"))))))))))","v":0.5},{"$f":"IF(I6=\"Arm Too Long\", \"Reduce V or W\",IF($I6>'[1]TABLE DATA'!$D$9,\"SIGN TOO LARGE\",IF(AND(OR($I6<'[1]TABLE DATA'!$D$7,$I6='[1]TABLE DATA'!$D$7),OR('[1]Input-Output Data'!$J6<'[1]Input-Output Data'!$K6,'[1]Input-Output Data'!$J6='[1]Input-Output Data'!$K6)),'[1]TABLE DATA'!N$7,IF(AND(OR($I6<'[1]TABLE DATA'!$D$7,$I6='[1]TABLE DATA'!$D$7),AND($J6>$L6),OR('[1]Input-Output Data'!$J6<'[1]Input-Output Data'!$M6,'[1]Input-Output Data'!$J6='[1]Input-Output Data'!$M6)),'[1]TABLE DATA'!N$8,IF(AND(OR($I6<'[1]TABLE DATA'!$D$7,$I6='[1]TABLE DATA'!$D$7),AND($J6>$M6),OR('[1]Input-Output Data'!$J6<'[1]Input-Output Data'!$N6,'[1]Input-Output Data'!$J6='[1]Input-Output Data'!$N6)),'[1]TABLE DATA'!N$9,IF(AND(OR($I6<'[1]TABLE DATA'!$D$7,$I6='[1]TABLE DATA'!$D$7),$J6>$N6),\"SIGN TOO WIDE\",IF(AND(AND($I6>'[1]TABLE DATA'!$D$7,OR($I6<'[1]TABLE DATA'!$D$8,$I6='[1]TABLE DATA'!$D$8)),'[1]Input-Output Data'!$J6<'[1]Input-Output Data'!$K6),'[1]TABLE DATA'!N$8,IF(AND(AND($I6>'[1]TABLE DATA'!$D$7,OR($I6<'[1]TABLE DATA'!$D$8,$I6='[1]TABLE DATA'!$D$8)),AND('[1]Input-Output Data'!$J6>'[1]Input-Output Data'!$M6,OR('[1]Input-Output Data'!$J6<'[1]Input-Output Data'!$N6,'[1]Input-Output Data'!$J6='[1]Input-Output Data'!$N6))),'[1]TABLE DATA'!N$9,IF(AND(AND($I6>'[1]TABLE DATA'!$D$7,OR($I6<'[1]TABLE DATA'!$D$8,$I6='[1]TABLE DATA'!$D$8)),$J6>'[1]Input-Output Data'!$N6),\"SIGN TOO WIDE\",IF(AND(AND($I6>'[1]TABLE DATA'!$D$8,OR($I6<'[1]TABLE DATA'!$D$9,$I6='[1]TABLE DATA'!$D$9)),'[1]Input-Output Data'!$J6<'[1]Input-Output Data'!$K6),'[1]TABLE DATA'!N$9,\"SIGN TOO WIDE\"))))))))))","v":0.5},{"$f":"IF(I6=\"Arm Too Long\", \"Reduce V or W\",IF($I6>'[1]TABLE DATA'!$D$9,\"SIGN TOO LARGE\",IF(AND(OR($I6<'[1]TABLE DATA'!$D$7,$I6='[1]TABLE DATA'!$D$7),OR('[1]Input-Output Data'!$J6<'[1]Input-Output Data'!$K6,'[1]Input-Output Data'!$J6='[1]Input-Output Data'!$K6)),'[1]TABLE DATA'!O$7,IF(AND(OR($I6<'[1]TABLE DATA'!$D$7,$I6='[1]TABLE DATA'!$D$7),AND($J6>$L6),OR('[1]Input-Output Data'!$J6<'[1]Input-Output Data'!$M6,'[1]Input-Output Data'!$J6='[1]Input-Output Data'!$M6)),'[1]TABLE DATA'!O$8,IF(AND(OR($I6<'[1]TABLE DATA'!$D$7,$I6='[1]TABLE DATA'!$D$7),AND($J6>$M6),OR('[1]Input-Output Data'!$J6<'[1]Input-Output Data'!$N6,'[1]Input-Output Data'!$J6='[1]Input-Output Data'!$N6)),'[1]TABLE DATA'!O$9,IF(AND(OR($I6<'[1]TABLE DATA'!$D$7,$I6='[1]TABLE DATA'!$D$7),$J6>$N6),\"SIGN TOO WIDE\",IF(AND(AND($I6>'[1]TABLE DATA'!$D$7,OR($I6<'[1]TABLE DATA'!$D$8,$I6='[1]TABLE DATA'!$D$8)),'[1]Input-Output Data'!$J6<'[1]Input-Output Data'!$K6),'[1]TABLE DATA'!O$8,IF(AND(AND($I6>'[1]TABLE DATA'!$D$7,OR($I6<'[1]TABLE DATA'!$D$8,$I6='[1]TABLE DATA'!$D$8)),AND('[1]Input-Output Data'!$J6>'[1]Input-Output Data'!$M6,OR('[1]Input-Output Data'!$J6<'[1]Input-Output Data'!$N6,'[1]Input-Output Data'!$J6='[1]Input-Output Data'!$N6))),'[1]TABLE DATA'!O$9,IF(AND(AND($I6>'[1]TABLE DATA'!$D$7,OR($I6<'[1]TABLE DATA'!$D$8,$I6='[1]TABLE DATA'!$D$8)),$J6>'[1]Input-Output Data'!$N6),\"SIGN TOO WIDE\",IF(AND(AND($I6>'[1]TABLE DATA'!$D$8,OR($I6<'[1]TABLE DATA'!$D$9,$I6='[1]TABLE DATA'!$D$9)),'[1]Input-Output Data'!$J6<'[1]Input-Output Data'!$K6),'[1]TABLE DATA'!O$9,\"SIGN TOO WIDE\"))))))))))","v":0.5},{"$f":"IF(V6=0.5,\"I\",IF(V6=0.625,\"II\",IF(V6=0.75,\"III\",\"N/A\")))","v":"I"}]
[null,null,null,102,54,"Square","III",33,38.25,53,{"$f":"IF(OR(I7<'[1]TABLE DATA'!$D$7,I7='[1]TABLE DATA'!$D$7),717.75/I7,IF(AND('[1]TABLE DATA'!$D$7<I7,OR(I7<'[1]TABLE DATA'!$D$8,I7='[1]TABLE DATA'!$D$8)),1695/I7,IF(AND('[1]TABLE DATA'!$D$8<I7,OR(I7<'[1]TABLE DATA'!$D$9,I7='[1]TABLE DATA'!$D$9)),2268/I7,IF(I7=\"Arm Too Long\", \"Reduce V or W\",\"Sign Too Wide\"))))","v":44.31},{"$f":"717.75/'[1]Input-Output Data'!I7","v":18.760000000000002},44.31,59.29,{"$f":"IF(I7=\"Arm Too Long\", \"Reduce V or W\",IF($I7>'[1]TABLE DATA'!$D$9,\"SIGN TOO LARGE\",IF(AND(OR($I7<'[1]TABLE DATA'!$D$7,$I7='[1]TABLE DATA'!$D$7),OR('[1]Input-Output Data'!$J7<'[1]Input-Output Data'!$K7,'[1]Input-Output Data'!$J7='[1]Input-Output Data'!$K7)),'[1]TABLE DATA'!F$7,IF(AND(OR($I7<'[1]TABLE DATA'!$D$7,$I7='[1]TABLE DATA'!$D$7),AND($J7>$L7),OR('[1]Input-Output Data'!$J7<'[1]Input-Output Data'!$M7,'[1]Input-Output Data'!$J7='[1]Input-Output Data'!$M7)),'[1]TABLE DATA'!F$8,IF(AND(OR($I7<'[1]TABLE DATA'!$D$7,$I7='[1]TABLE DATA'!$D$7),AND($J7>$M7),OR('[1]Input-Output Data'!$J7<'[1]Input-Output Data'!$N7,'[1]Input-Output Data'!$J7='[1]Input-Output Data'!$N7)),'[1]TABLE DATA'!F$9,IF(AND(OR($I7<'[1]TABLE DATA'!$D$7,$I7='[1]TABLE DATA'!$D$7),$J7>$N7),\"SIGN TOO WIDE\",IF(AND(AND($I7>'[1]TABLE DATA'!$D$7,OR($I7<'[1]TABLE DATA'!$D$8,$I7='[1]TABLE DATA'!$D$8)),'[1]Input-Output Data'!$J7<'[1]Input-Output Data'!$K7),'[1]TABLE DATA'!F$8,IF(AND(AND($I7>'[1]TABLE DATA'!$D$7,OR($I7<'[1]TABLE DATA'!$D$8,$I7='[1]TABLE DATA'!$D$8)),AND('[1]Input-Output Data'!$J7>'[1]Input-Output Data'!$M7,OR('[1]Input-Output Data'!$J7<'[1]Input-Output Data'!$N7,'[1]Input-Output Data'!$J7='[1]Input-Output Data'!$N7))),'[1]TABLE DATA'!F$9,IF(AND(AND($I7>'[1]TABLE DATA'!$D$7,OR($I7<'[1]TABLE DATA'!$D$8,$I7='[1]TABLE DATA'!$D$8)),$J7>'[1]Input-Output Data'!$N7),\"SIGN TOO WIDE\",IF(AND(AND($I7>'[1]TABLE DATA'!$D$8,OR($I7<'[1]TABLE DATA'!$D$9,$I7='[1]TABLE DATA'!$D$9)),'[1]Input-Output Data'!$J7<'[1]Input-Output Data'!$K7),'[1]TABLE DATA'!F$9,\"SIGN TOO WIDE\"))))))))))","v":5},{"$f":"IF(I7=\"Arm Too Long\", \"Reduce V or W\",IF($I7>'[1]TABLE DATA'!$D$9,\"SIGN TOO LARGE\",IF(AND(OR($I7<'[1]TABLE DATA'!$D$7,$I7='[1]TABLE DATA'!$D$7),OR('[1]Input-Output Data'!$J7<'[1]Input-Output Data'!$K7,'[1]Input-Output Data'!$J7='[1]Input-Output Data'!$K7)),'[1]TABLE DATA'!G$7,IF(AND(OR($I7<'[1]TABLE DATA'!$D$7,$I7='[1]TABLE DATA'!$D$7),AND($J7>$L7),OR('[1]Input-Output Data'!$J7<'[1]Input-Output Data'!$M7,'[1]Input-Output Data'!$J7='[1]Input-Output Data'!$M7)),'[1]TABLE DATA'!G$8,IF(AND(OR($I7<'[1]TABLE DATA'!$D$7,$I7='[1]TABLE DATA'!$D$7),AND($J7>$M7),OR('[1]Input-Output Data'!$J7<'[1]Input-Output Data'!$N7,'[1]Input-Output Data'!$J7='[1]Input-Output Data'!$N7)),'[1]TABLE DATA'!G$9,IF(AND(OR($I7<'[1]TABLE DATA'!$D$7,$I7='[1]TABLE DATA'!$D$7),$J7>$N7),\"SIGN TOO WIDE\",IF(AND(AND($I7>'[1]TABLE DATA'!$D$7,OR($I7<'[1]TABLE DATA'!$D$8,$I7='[1]TABLE DATA'!$D$8)),'[1]Input-Output Data'!$J7<'[1]Input-Output Data'!$K7),'[1]TABLE DATA'!G$8,IF(AND(AND($I7>'[1]TABLE DATA'!$D$7,OR($I7<'[1]TABLE DATA'!$D$8,$I7='[1]TABLE DATA'!$D$8)),AND('[1]Input-Output Data'!$J7>'[1]Input-Output Data'!$M7,OR('[1]Input-Output Data'!$J7<'[1]Input-Output Data'!$N7,'[1]Input-Output Data'!$J7='[1]Input-Output Data'!$N7))),'[1]TABLE DATA'!G$9,IF(AND(AND($I7>'[1]TABLE DATA'!$D$7,OR($I7<'[1]TABLE DATA'!$D$8,$I7='[1]TABLE DATA'!$D$8)),$J7>'[1]Input-Output Data'!$N7),\"SIGN TOO WIDE\",IF(AND(AND($I7>'[1]TABLE DATA'!$D$8,OR($I7<'[1]TABLE DATA'!$D$9,$I7='[1]TABLE DATA'!$D$9)),'[1]Input-Output Data'!$J7<'[1]Input-Output Data'!$K7),'[1]TABLE DATA'!G$9,\"SIGN TOO WIDE\"))))))))))","v":3},{"$f":"IF(I7=\"Arm Too Long\", \"Reduce V or W\",IF($I7>'[1]TABLE DATA'!$D$9,\"SIGN TOO LARGE\",IF(AND(OR($I7<'[1]TABLE DATA'!$D$7,$I7='[1]TABLE DATA'!$D$7),OR('[1]Input-Output Data'!$J7<'[1]Input-Output Data'!$K7,'[1]Input-Output Data'!$J7='[1]Input-Output Data'!$K7)),'[1]TABLE DATA'!H$7,IF(AND(OR($I7<'[1]TABLE DATA'!$D$7,$I7='[1]TABLE DATA'!$D$7),AND($J7>$L7),OR('[1]Input-Output Data'!$J7<'[1]Input-Output Data'!$M7,'[1]Input-Output Data'!$J7='[1]Input-Output Data'!$M7)),'[1]TABLE DATA'!H$8,IF(AND(OR($I7<'[1]TABLE DATA'!$D$7,$I7='[1]TABLE DATA'!$D$7),AND($J7>$M7),OR('[1]Input-Output Data'!$J7<'[1]Input-Output Data'!$N7,'[1]Input-Output Data'!$J7='[1]Input-Output Data'!$N7)),'[1]TABLE DATA'!H$9,IF(AND(OR($I7<'[1]TABLE DATA'!$D$7,$I7='[1]TABLE DATA'!$D$7),$J7>$N7),\"SIGN TOO WIDE\",IF(AND(AND($I7>'[1]TABLE DATA'!$D$7,OR($I7<'[1]TABLE DATA'!$D$8,$I7='[1]TABLE DATA'!$D$8)),'[1]Input-Output Data'!$J7<'[1]Input-Output Data'!$K7),'[1]TABLE DATA'!H$8,IF(AND(AND($I7>'[1]TABLE DATA'!$D$7,OR($I7<'[1]TABLE DATA'!$D$8,$I7='[1]TABLE DATA'!$D$8)),AND('[1]Input-Output Data'!$J7>'[1]Input-Output Data'!$M7,OR('[1]Input-Output Data'!$J7<'[1]Input-Output Data'!$N7,'[1]Input-Output Data'!$J7='[1]Input-Output Data'!$N7))),'[1]TABLE DATA'!H$9,IF(AND(AND($I7>'[1]TABLE DATA'!$D$7,OR($I7<'[1]TABLE DATA'!$D$8,$I7='[1]TABLE DATA'!$D$8)),$J7>'[1]Input-Output Data'!$N7),\"SIGN TOO WIDE\",IF(AND(AND($I7>'[1]TABLE DATA'!$D$8,OR($I7<'[1]TABLE DATA'!$D$9,$I7='[1]TABLE DATA'!$D$9)),'[1]Input-Output Data'!$J7<'[1]Input-Output Data'!$K7),'[1]TABLE DATA'!H$9,\"SIGN TOO WIDE\"))))))))))","v":0.875},{"$f":"IF(I7=\"Arm Too Long\", \"Reduce V or W\",IF($I7>'[1]TABLE DATA'!$D$9,\"SIGN TOO LARGE\",IF(AND(OR($I7<'[1]TABLE DATA'!$D$7,$I7='[1]TABLE DATA'!$D$7),OR('[1]Input-Output Data'!$J7<'[1]Input-Output Data'!$K7,'[1]Input-Output Data'!$J7='[1]Input-Output Data'!$K7)),'[1]TABLE DATA'!I$7,IF(AND(OR($I7<'[1]TABLE DATA'!$D$7,$I7='[1]TABLE DATA'!$D$7),AND($J7>$L7),OR('[1]Input-Output Data'!$J7<'[1]Input-Output Data'!$M7,'[1]Input-Output Data'!$J7='[1]Input-Output Data'!$M7)),'[1]TABLE DATA'!I$8,IF(AND(OR($I7<'[1]TABLE DATA'!$D$7,$I7='[1]TABLE DATA'!$D$7),AND($J7>$M7),OR('[1]Input-Output Data'!$J7<'[1]Input-Output Data'!$N7,'[1]Input-Output Data'!$J7='[1]Input-Output Data'!$N7)),'[1]TABLE DATA'!I$9,IF(AND(OR($I7<'[1]TABLE DATA'!$D$7,$I7='[1]TABLE DATA'!$D$7),$J7>$N7),\"SIGN TOO WIDE\",IF(AND(AND($I7>'[1]TABLE DATA'!$D$7,OR($I7<'[1]TABLE DATA'!$D$8,$I7='[1]TABLE DATA'!$D$8)),'[1]Input-Output Data'!$J7<'[1]Input-Output Data'!$K7),'[1]TABLE DATA'!I$8,IF(AND(AND($I7>'[1]TABLE DATA'!$D$7,OR($I7<'[1]TABLE DATA'!$D$8,$I7='[1]TABLE DATA'!$D$8)),AND('[1]Input-Output Data'!$J7>'[1]Input-Output Data'!$M7,OR('[1]Input-Output Data'!$J7<'[1]Input-Output Data'!$N7,'[1]Input-Output Data'!$J7='[1]Input-Output Data'!$N7))),'[1]TABLE DATA'!I$9,IF(AND(AND($I7>'[1]TABLE DATA'!$D$7,OR($I7<'[1]TABLE DATA'!$D$8,$I7='[1]TABLE DATA'!$D$8)),$J7>'[1]Input-Output Data'!$N7),\"SIGN TOO WIDE\",IF(AND(AND($I7>'[1]TABLE DATA'!$D$8,OR($I7<'[1]TABLE DATA'!$D$9,$I7='[1]TABLE DATA'!$D$9)),'[1]Input-Output Data'!$J7<'[1]Input-Output Data'!$K7),'[1]TABLE DATA'!I$9,\"SIGN TOO WIDE\"))))))))))","v":8},{"$f":"IF(I7=\"Arm Too Long\", \"Reduce V or W\",IF($I7>'[1]TABLE DATA'!$D$9,\"SIGN TOO LARGE\",IF(AND(OR($I7<'[1]TABLE DATA'!$D$7,$I7='[1]TABLE DATA'!$D$7),OR('[1]Input-Output Data'!$J7<'[1]Input-Output Data'!$K7,'[1]Input-Output Data'!$J7='[1]Input-Output Data'!$K7)),'[1]TABLE DATA'!J$7,IF(AND(OR($I7<'[1]TABLE DATA'!$D$7,$I7='[1]TABLE DATA'!$D$7),AND($J7>$L7),OR('[1]Input-Output Data'!$J7<'[1]Input-Output Data'!$M7,'[1]Input-Output Data'!$J7='[1]Input-Output Data'!$M7)),'[1]TABLE DATA'!J$8,IF(AND(OR($I7<'[1]TABLE DATA'!$D$7,$I7='[1]TABLE DATA'!$D$7),AND($J7>$M7),OR('[1]Input-Output Data'!$J7<'[1]Input-Output Data'!$N7,'[1]Input-Output Data'!$J7='[1]Input-Output Data'!$N7)),'[1]TABLE DATA'!J$9,IF(AND(OR($I7<'[1]TABLE DATA'!$D$7,$I7='[1]TABLE DATA'!$D$7),$J7>$N7),\"SIGN TOO WIDE\",IF(AND(AND($I7>'[1]TABLE DATA'!$D$7,OR($I7<'[1]TABLE DATA'!$D$8,$I7='[1]TABLE DATA'!$D$8)),'[1]Input-Output Data'!$J7<'[1]Input-Output Data'!$K7),'[1]TABLE DATA'!J$8,IF(AND(AND($I7>'[1]TABLE DATA'!$D$7,OR($I7<'[1]TABLE DATA'!$D$8,$I7='[1]TABLE DATA'!$D$8)),AND('[1]Input-Output Data'!$J7>'[1]Input-Output Data'!$M7,OR('[1]Input-Output Data'!$J7<'[1]Input-Output Data'!$N7,'[1]Input-Output Data'!$J7='[1]Input-Output Data'!$N7))),'[1]TABLE DATA'!J$9,IF(AND(AND($I7>'[1]TABLE DATA'!$D$7,OR($I7<'[1]TABLE DATA'!$D$8,$I7='[1]TABLE DATA'!$D$8)),$J7>'[1]Input-Output Data'!$N7),\"SIGN TOO WIDE\",IF(AND(AND($I7>'[1]TABLE DATA'!$D$8,OR($I7<'[1]TABLE DATA'!$D$9,$I7='[1]TABLE DATA'!$D$9)),'[1]Input-Output Data'!$J7<'[1]Input-Output Data'!$K7),'[1]TABLE DATA'!J$9,\"SIGN TOO WIDE\"))))))))))","v":3},{"$f":"IF(I7=\"Arm Too Long\", \"Reduce V or W\",IF($I7>'[1]TABLE DATA'!$D$9,\"SIGN TOO LARGE\",IF(AND(OR($I7<'[1]TABLE DATA'!$D$7,$I7='[1]TABLE DATA'!$D$7),OR('[1]Input-Output Data'!$J7<'[1]Input-Output Data'!$K7,'[1]Input-Output Data'!$J7='[1]Input-Output Data'!$K7)),'[1]TABLE DATA'!K$7,IF(AND(OR($I7<'[1]TABLE DATA'!$D$7,$I7='[1]TABLE DATA'!$D$7),AND($J7>$L7),OR('[1]Input-Output Data'!$J7<'[1]Input-Output Data'!$M7,'[1]Input-Output Data'!$J7='[1]Input-Output Data'!$M7)),'[1]TABLE DATA'!K$8,IF(AND(OR($I7<'[1]TABLE DATA'!$D$7,$I7='[1]TABLE DATA'!$D$7),AND($J7>$M7),OR('[1]Input-Output Data'!$J7<'[1]Input-Output Data'!$N7,'[1]Input-Output Data'!$J7='[1]Input-Output Data'!$N7)),'[1]TABLE DATA'!K$9,IF(AND(OR($I7<'[1]TABLE DATA'!$D$7,$I7='[1]TABLE DATA'!$D$7),$J7>$N7),\"SIGN TOO WIDE\",IF(AND(AND($I7>'[1]TABLE DATA'!$D$7,OR($I7<'[1]TABLE DATA'!$D$8,$I7='[1]TABLE DATA'!$D$8)),'[1]Input-Output Data'!$J7<'[1]Input-Output Data'!$K7),'[1]TABLE DATA'!K$8,IF(AND(AND($I7>'[1]TABLE DATA'!$D$7,OR($I7<'[1]TABLE DATA'!$D$8,$I7='[1]TABLE DATA'!$D$8)),AND('[1]Input-Output Data'!$J7>'[1]Input-Output Data'!$M7,OR('[1]Input-Output Data'!$J7<'[1]Input-Output Data'!$N7,'[1]Input-Output Data'!$J7='[1]Input-Output Data'!$N7))),'[1]TABLE DATA'!K$9,IF(AND(AND($I7>'[1]TABLE DATA'!$D$7,OR($I7<'[1]TABLE DATA'!$D$8,$I7='[1]TABLE DATA'!$D$8)),$J7>'[1]Input-Output Data'!$N7),\"SIGN TOO WIDE\",IF(AND(AND($I7>'[1]TABLE DATA'!$D$8,OR($I7<'[1]TABLE DATA'!$D$9,$I7='[1]TABLE DATA'!$D$9)),'[1]Input-Output Data'!$J7<'[1]Input-Output Data'!$K7),'[1]TABLE DATA'!K$9,\"SIGN TOO WIDE\"))))))))))","v":80},{"$f":"IF(I7=\"Arm Too Long\", \"Reduce V or W\",IF($I7>'[1]TABLE DATA'!$D$9,\"SIGN TOO LARGE\",IF(AND(OR($I7<'[1]TABLE DATA'!$D$7,$I7='[1]TABLE DATA'!$D$7),OR('[1]Input-Output Data'!$J7<'[1]Input-Output Data'!$K7,'[1]Input-Output Data'!$J7='[1]Input-Output Data'!$K7)),'[1]TABLE DATA'!L$7,IF(AND(OR($I7<'[1]TABLE DATA'!$D$7,$I7='[1]TABLE DATA'!$D$7),AND($J7>$L7),OR('[1]Input-Output Data'!$J7<'[1]Input-Output Data'!$M7,'[1]Input-Output Data'!$J7='[1]Input-Output Data'!$M7)),'[1]TABLE DATA'!L$8,IF(AND(OR($I7<'[1]TABLE DATA'!$D$7,$I7='[1]TABLE DATA'!$D$7),AND($J7>$M7),OR('[1]Input-Output Data'!$J7<'[1]Input-Output Data'!$N7,'[1]Input-Output Data'!$J7='[1]Input-Output Data'!$N7)),'[1]TABLE DATA'!L$9,IF(AND(OR($I7<'[1]TABLE DATA'!$D$7,$I7='[1]TABLE DATA'!$D$7),$J7>$N7),\"SIGN TOO WIDE\",IF(AND(AND($I7>'[1]TABLE DATA'!$D$7,OR($I7<'[1]TABLE DATA'!$D$8,$I7='[1]TABLE DATA'!$D$8)),'[1]Input-Output Data'!$J7<'[1]Input-Output Data'!$K7),'[1]TABLE DATA'!L$8,IF(AND(AND($I7>'[1]TABLE DATA'!$D$7,OR($I7<'[1]TABLE DATA'!$D$8,$I7='[1]TABLE DATA'!$D$8)),AND('[1]Input-Output Data'!$J7>'[1]Input-Output Data'!$M7,OR('[1]Input-Output Data'!$J7<'[1]Input-Output Data'!$N7,'[1]Input-Output Data'!$J7='[1]Input-Output Data'!$N7))),'[1]TABLE DATA'!L$9,IF(AND(AND($I7>'[1]TABLE DATA'!$D$7,OR($I7<'[1]TABLE DATA'!$D$8,$I7='[1]TABLE DATA'!$D$8)),$J7>'[1]Input-Output Data'!$N7),\"SIGN TOO WIDE\",IF(AND(AND($I7>'[1]TABLE DATA'!$D$8,OR($I7<'[1]TABLE DATA'!$D$9,$I7='[1]TABLE DATA'!$D$9)),'[1]Input-Output Data'!$J7<'[1]Input-Output Data'!$K7),'[1]TABLE DATA'!L$9,\"SIGN TOO WIDE\"))))))))))","v":14.5},{"$f":"IF(I7=\"Arm Too Long\", \"Reduce V or W\",IF($I7>'[1]TABLE DATA'!$D$9,\"SIGN TOO LARGE\",IF(AND(OR($I7<'[1]TABLE DATA'!$D$7,$I7='[1]TABLE DATA'!$D$7),OR('[1]Input-Output Data'!$J7<'[1]Input-Output Data'!$K7,'[1]Input-Output Data'!$J7='[1]Input-Output Data'!$K7)),'[1]TABLE DATA'!M$7,IF(AND(OR($I7<'[1]TABLE DATA'!$D$7,$I7='[1]TABLE DATA'!$D$7),AND($J7>$L7),OR('[1]Input-Output Data'!$J7<'[1]Input-Output Data'!$M7,'[1]Input-Output Data'!$J7='[1]Input-Output Data'!$M7)),'[1]TABLE DATA'!M$8,IF(AND(OR($I7<'[1]TABLE DATA'!$D$7,$I7='[1]TABLE DATA'!$D$7),AND($J7>$M7),OR('[1]Input-Output Data'!$J7<'[1]Input-Output Data'!$N7,'[1]Input-Output Data'!$J7='[1]Input-Output Data'!$N7)),'[1]TABLE DATA'!M$9,IF(AND(OR($I7<'[1]TABLE DATA'!$D$7,$I7='[1]TABLE DATA'!$D$7),$J7>$N7),\"SIGN TOO WIDE\",IF(AND(AND($I7>'[1]TABLE DATA'!$D$7,OR($I7<'[1]TABLE DATA'!$D$8,$I7='[1]TABLE DATA'!$D$8)),'[1]Input-Output Data'!$J7<'[1]Input-Output Data'!$K7),'[1]TABLE DATA'!M$8,IF(AND(AND($I7>'[1]TABLE DATA'!$D$7,OR($I7<'[1]TABLE DATA'!$D$8,$I7='[1]TABLE DATA'!$D$8)),AND('[1]Input-Output Data'!$J7>'[1]Input-Output Data'!$M7,OR('[1]Input-Output Data'!$J7<'[1]Input-Output Data'!$N7,'[1]Input-Output Data'!$J7='[1]Input-Output Data'!$N7))),'[1]TABLE DATA'!M$9,IF(AND(AND($I7>'[1]TABLE DATA'!$D$7,OR($I7<'[1]TABLE DATA'!$D$8,$I7='[1]TABLE DATA'!$D$8)),$J7>'[1]Input-Output Data'!$N7),\"SIGN TOO WIDE\",IF(AND(AND($I7>'[1]TABLE DATA'!$D$8,OR($I7<'[1]TABLE DATA'!$D$9,$I7='[1]TABLE DATA'!$D$9)),'[1]Input-Output Data'!$J7<'[1]Input-Output Data'!$K7),'[1]TABLE DATA'!M$9,\"SIGN TOO WIDE\"))))))))))","v":0.75},{"$f":"IF(I7=\"Arm Too Long\", \"Reduce V or W\",IF($I7>'[1]TABLE DATA'!$D$9,\"SIGN TOO LARGE\",IF(AND(OR($I7<'[1]TABLE DATA'!$D$7,$I7='[1]TABLE DATA'!$D$7),OR('[1]Input-Output Data'!$J7<'[1]Input-Output Data'!$K7,'[1]Input-Output Data'!$J7='[1]Input-Output Data'!$K7)),'[1]TABLE DATA'!N$7,IF(AND(OR($I7<'[1]TABLE DATA'!$D$7,$I7='[1]TABLE DATA'!$D$7),AND($J7>$L7),OR('[1]Input-Output Data'!$J7<'[1]Input-Output Data'!$M7,'[1]Input-Output Data'!$J7='[1]Input-Output Data'!$M7)),'[1]TABLE DATA'!N$8,IF(AND(OR($I7<'[1]TABLE DATA'!$D$7,$I7='[1]TABLE DATA'!$D$7),AND($J7>$M7),OR('[1]Input-Output Data'!$J7<'[1]Input-Output Data'!$N7,'[1]Input-Output Data'!$J7='[1]Input-Output Data'!$N7)),'[1]TABLE DATA'!N$9,IF(AND(OR($I7<'[1]TABLE DATA'!$D$7,$I7='[1]TABLE DATA'!$D$7),$J7>$N7),\"SIGN TOO WIDE\",IF(AND(AND($I7>'[1]TABLE DATA'!$D$7,OR($I7<'[1]TABLE DATA'!$D$8,$I7='[1]TABLE DATA'!$D$8)),'[1]Input-Output Data'!$J7<'[1]Input-Output Data'!$K7),'[1]TABLE DATA'!N$8,IF(AND(AND($I7>'[1]TABLE DATA'!$D$7,OR($I7<'[1]TABLE DATA'!$D$8,$I7='[1]TABLE DATA'!$D$8)),AND('[1]Input-Output Data'!$J7>'[1]Input-Output Data'!$M7,OR('[1]Input-Output Data'!$J7<'[1]Input-Output Data'!$N7,'[1]Input-Output Data'!$J7='[1]Input-Output Data'!$N7))),'[1]TABLE DATA'!N$9,IF(AND(AND($I7>'[1]TABLE DATA'!$D$7,OR($I7<'[1]TABLE DATA'!$D$8,$I7='[1]TABLE DATA'!$D$8)),$J7>'[1]Input-Output Data'!$N7),\"SIGN TOO WIDE\",IF(AND(AND($I7>'[1]TABLE DATA'!$D$8,OR($I7<'[1]TABLE DATA'!$D$9,$I7='[1]TABLE DATA'!$D$9)),'[1]Input-Output Data'!$J7<'[1]Input-Output Data'!$K7),'[1]TABLE DATA'!N$9,\"SIGN TOO WIDE\"))))))))))","v":0.625},{"$f":"IF(I7=\"Arm Too Long\", \"Reduce V or W\",IF($I7>'[1]TABLE DATA'!$D$9,\"SIGN TOO LARGE\",IF(AND(OR($I7<'[1]TABLE DATA'!$D$7,$I7='[1]TABLE DATA'!$D$7),OR('[1]Input-Output Data'!$J7<'[1]Input-Output Data'!$K7,'[1]Input-Output Data'!$J7='[1]Input-Output Data'!$K7)),'[1]TABLE DATA'!O$7,IF(AND(OR($I7<'[1]TABLE DATA'!$D$7,$I7='[1]TABLE DATA'!$D$7),AND($J7>$L7),OR('[1]Input-Output Data'!$J7<'[1]Input-Output Data'!$M7,'[1]Input-Output Data'!$J7='[1]Input-Output Data'!$M7)),'[1]TABLE DATA'!O$8,IF(AND(OR($I7<'[1]TABLE DATA'!$D$7,$I7='[1]TABLE DATA'!$D$7),AND($J7>$M7),OR('[1]Input-Output Data'!$J7<'[1]Input-Output Data'!$N7,'[1]Input-Output Data'!$J7='[1]Input-Output Data'!$N7)),'[1]TABLE DATA'!O$9,IF(AND(OR($I7<'[1]TABLE DATA'!$D$7,$I7='[1]TABLE DATA'!$D$7),$J7>$N7),\"SIGN TOO WIDE\",IF(AND(AND($I7>'[1]TABLE DATA'!$D$7,OR($I7<'[1]TABLE DATA'!$D$8,$I7='[1]TABLE DATA'!$D$8)),'[1]Input-Output Data'!$J7<'[1]Input-Output Data'!$K7),'[1]TABLE DATA'!O$8,IF(AND(AND($I7>'[1]TABLE DATA'!$D$7,OR($I7<'[1]TABLE DATA'!$D$8,$I7='[1]TABLE DATA'!$D$8)),AND('[1]Input-Output Data'!$J7>'[1]Input-Output Data'!$M7,OR('[1]Input-Output Data'!$J7<'[1]Input-Output Data'!$N7,'[1]Input-Output Data'!$J7='[1]Input-Output Data'!$N7))),'[1]TABLE DATA'!O$9,IF(AND(AND($I7>'[1]TABLE DATA'!$D$7,OR($I7<'[1]TABLE DATA'!$D$8,$I7='[1]TABLE DATA'!$D$8)),$J7>'[1]Input-Output Data'!$N7),\"SIGN TOO WIDE\",IF(AND(AND($I7>'[1]TABLE DATA'!$D$8,OR($I7<'[1]TABLE DATA'!$D$9,$I7='[1]TABLE DATA'!$D$9)),'[1]Input-Output Data'!$J7<'[1]Input-Output Data'!$K7),'[1]TABLE DATA'!O$9,\"SIGN TOO WIDE\"))))))))))","v":0.625},{"$f":"IF(V7=0.5,\"I\",IF(V7=0.625,\"II\",IF(V7=0.75,\"III\",\"N/A\")))","v":"III"}]
[null,null,null,48,60,"Square","I",36,20,26,{"$f":"IF(OR(I8<'[1]TABLE DATA'!$D$7,I8='[1]TABLE DATA'!$D$7),717.75/I8,IF(AND('[1]TABLE DATA'!$D$7<I8,OR(I8<'[1]TABLE DATA'!$D$8,I8='[1]TABLE DATA'!$D$8)),1695/I8,IF(AND('[1]TABLE DATA'!$D$8<I8,OR(I8<'[1]TABLE DATA'!$D$9,I8='[1]TABLE DATA'!$D$9)),2268/I8,IF(I8=\"Arm Too Long\", \"Reduce V or W\",\"Sign Too Wide\"))))","v":35.89},{"$f":"717.75/'[1]Input-Output Data'!I8","v":35.89},84.75,113.4,{"$f":"IF(I8=\"Arm Too Long\", \"Reduce V or W\",IF($I8>'[1]TABLE DATA'!$D$9,\"SIGN TOO LARGE\",IF(AND(OR($I8<'[1]TABLE DATA'!$D$7,$I8='[1]TABLE DATA'!$D$7),OR('[1]Input-Output Data'!$J8<'[1]Input-Output Data'!$K8,'[1]Input-Output Data'!$J8='[1]Input-Output Data'!$K8)),'[1]TABLE DATA'!F$7,IF(AND(OR($I8<'[1]TABLE DATA'!$D$7,$I8='[1]TABLE DATA'!$D$7),AND($J8>$L8),OR('[1]Input-Output Data'!$J8<'[1]Input-Output Data'!$M8,'[1]Input-Output Data'!$J8='[1]Input-Output Data'!$M8)),'[1]TABLE DATA'!F$8,IF(AND(OR($I8<'[1]TABLE DATA'!$D$7,$I8='[1]TABLE DATA'!$D$7),AND($J8>$M8),OR('[1]Input-Output Data'!$J8<'[1]Input-Output Data'!$N8,'[1]Input-Output Data'!$J8='[1]Input-Output Data'!$N8)),'[1]TABLE DATA'!F$9,IF(AND(OR($I8<'[1]TABLE DATA'!$D$7,$I8='[1]TABLE DATA'!$D$7),$J8>$N8),\"SIGN TOO WIDE\",IF(AND(AND($I8>'[1]TABLE DATA'!$D$7,OR($I8<'[1]TABLE DATA'!$D$8,$I8='[1]TABLE DATA'!$D$8)),'[1]Input-Output Data'!$J8<'[1]Input-Output Data'!$K8),'[1]TABLE DATA'!F$8,IF(AND(AND($I8>'[1]TABLE DATA'!$D$7,OR($I8<'[1]TABLE DATA'!$D$8,$I8='[1]TABLE DATA'!$D$8)),AND('[1]Input-Output Data'!$J8>'[1]Input-Output Data'!$M8,OR('[1]Input-Output Data'!$J8<'[1]Input-Output Data'!$N8,'[1]Input-Output Data'!$J8='[1]Input-Output Data'!$N8))),'[1]TABLE DATA'!F$9,IF(AND(AND($I8>'[1]TABLE DATA'!$D$7,OR($I8<'[1]TABLE DATA'!$D$8,$I8='[1]TABLE DATA'!$D$8)),$J8>'[1]Input-Output Data'!$N8),\"SIGN TOO WIDE\",IF(AND(AND($I8>'[1]TABLE DATA'!$D$8,OR($I8<'[1]TABLE DATA'!$D$9,$I8='[1]TABLE DATA'!$D$9)),'[1]Input-Output Data'!$J8<'[1]Input-Output Data'!$K8),'[1]TABLE DATA'!F$9,\"SIGN TOO WIDE\"))))))))))","v":4},{"$f":"IF(I8=\"Arm Too Long\", \"Reduce V or W\",IF($I8>'[1]TABLE DATA'!$D$9,\"SIGN TOO LARGE\",IF(AND(OR($I8<'[1]TABLE DATA'!$D$7,$I8='[1]TABLE DATA'!$D$7),OR('[1]Input-Output Data'!$J8<'[1]Input-Output Data'!$K8,'[1]Input-Output Data'!$J8='[1]Input-Output Data'!$K8)),'[1]TABLE DATA'!G$7,IF(AND(OR($I8<'[1]TABLE DATA'!$D$7,$I8='[1]TABLE DATA'!$D$7),AND($J8>$L8),OR('[1]Input-Output Data'!$J8<'[1]Input-Output Data'!$M8,'[1]Input-Output Data'!$J8='[1]Input-Output Data'!$M8)),'[1]TABLE DATA'!G$8,IF(AND(OR($I8<'[1]TABLE DATA'!$D$7,$I8='[1]TABLE DATA'!$D$7),AND($J8>$M8),OR('[1]Input-Output Data'!$J8<'[1]Input-Output Data'!$N8,'[1]Input-Output Data'!$J8='[1]Input-Output Data'!$N8)),'[1]TABLE DATA'!G$9,IF(AND(OR($I8<'[1]TABLE DATA'!$D$7,$I8='[1]TABLE DATA'!$D$7),$J8>$N8),\"SIGN TOO WIDE\",IF(AND(AND($I8>'[1]TABLE DATA'!$D$7,OR($I8<'[1]TABLE DATA'!$D$8,$I8='[1]TABLE DATA'!$D$8)),'[1]Input-Output Data'!$J8<'[1]Input-Output Data'!$K8),'[1]TABLE DATA'!G$8,IF(AND(AND($I8>'[1]TABLE DATA'!$D$7,OR($I8<'[1]TABLE DATA'!$D$8,$I8='[1]TABLE DATA'!$D$8)),AND('[1]Input-Output Data'!$J8>'[1]Input-Output Data'!$M8,OR('[1]Input-Output Data'!$J8<'[1]Input-Output Data'!$N8,'[1]Input-Output Data'!$J8='[1]Input-Output Data'!$N8))),'[1]TABLE DATA'!G$9,IF(AND(AND($I8>'[1]TABLE DATA'!$D$7,OR($I8<'[1]TABLE DATA'!$D$8,$I8='[1]TABLE DATA'!$D$8)),$J8>'[1]Input-Output Data'!$N8),\"SIGN TOO WIDE\",IF(AND(AND($I8>'[1]TABLE DATA'!$D$8,OR($I8<'[1]TABLE DATA'!$D$9,$I8='[1]TABLE DATA'!$D$9)),'[1]Input-Output Data'!$J8<'[1]Input-Output Data'!$K8),'[1]TABLE DATA'!G$9,\"SIGN TOO WIDE\"))))))))))","v":2},{"$f":"IF(I8=\"Arm Too Long\", \"Reduce V or W\",IF($I8>'[1]TABLE DATA'!$D$9,\"SIGN TOO LARGE\",IF(AND(OR($I8<'[1]TABLE DATA'!$D$7,$I8='[1]TABLE DATA'!$D$7),OR('[1]Input-Output Data'!$J8<'[1]Input-Output Data'!$K8,'[1]Input-Output Data'!$J8='[1]Input-Output Data'!$K8)),'[1]TABLE DATA'!H$7,IF(AND(OR($I8<'[1]TABLE DATA'!$D$7,$I8='[1]TABLE DATA'!$D$7),AND($J8>$L8),OR('[1]Input-Output Data'!$J8<'[1]Input-Output Data'!$M8,'[1]Input-Output Data'!$J8='[1]Input-Output Data'!$M8)),'[1]TABLE DATA'!H$8,IF(AND(OR($I8<'[1]TABLE DATA'!$D$7,$I8='[1]TABLE DATA'!$D$7),AND($J8>$M8),OR('[1]Input-Output Data'!$J8<'[1]Input-Output Data'!$N8,'[1]Input-Output Data'!$J8='[1]Input-Output Data'!$N8)),'[1]TABLE DATA'!H$9,IF(AND(OR($I8<'[1]TABLE DATA'!$D$7,$I8='[1]TABLE DATA'!$D$7),$J8>$N8),\"SIGN TOO WIDE\",IF(AND(AND($I8>'[1]TABLE DATA'!$D$7,OR($I8<'[1]TABLE DATA'!$D$8,$I8='[1]TABLE DATA'!$D$8)),'[1]Input-Output Data'!$J8<'[1]Input-Output Data'!$K8),'[1]TABLE DATA'!H$8,IF(AND(AND($I8>'[1]TABLE DATA'!$D$7,OR($I8<'[1]TABLE DATA'!$D$8,$I8='[1]TABLE DATA'!$D$8)),AND('[1]Input-Output Data'!$J8>'[1]Input-Output Data'!$M8,OR('[1]Input-Output Data'!$J8<'[1]Input-Output Data'!$N8,'[1]Input-Output Data'!$J8='[1]Input-Output Data'!$N8))),'[1]TABLE DATA'!H$9,IF(AND(AND($I8>'[1]TABLE DATA'!$D$7,OR($I8<'[1]TABLE DATA'!$D$8,$I8='[1]TABLE DATA'!$D$8)),$J8>'[1]Input-Output Data'!$N8),\"SIGN TOO WIDE\",IF(AND(AND($I8>'[1]TABLE DATA'!$D$8,OR($I8<'[1]TABLE DATA'!$D$9,$I8='[1]TABLE DATA'!$D$9)),'[1]Input-Output Data'!$J8<'[1]Input-Output Data'!$K8),'[1]TABLE DATA'!H$9,\"SIGN TOO WIDE\"))))))))))","v":0.625},{"$f":"IF(I8=\"Arm Too Long\", \"Reduce V or W\",IF($I8>'[1]TABLE DATA'!$D$9,\"SIGN TOO LARGE\",IF(AND(OR($I8<'[1]TABLE DATA'!$D$7,$I8='[1]TABLE DATA'!$D$7),OR('[1]Input-Output Data'!$J8<'[1]Input-Output Data'!$K8,'[1]Input-Output Data'!$J8='[1]Input-Output Data'!$K8)),'[1]TABLE DATA'!I$7,IF(AND(OR($I8<'[1]TABLE DATA'!$D$7,$I8='[1]TABLE DATA'!$D$7),AND($J8>$L8),OR('[1]Input-Output Data'!$J8<'[1]Input-Output Data'!$M8,'[1]Input-Output Data'!$J8='[1]Input-Output Data'!$M8)),'[1]TABLE DATA'!I$8,IF(AND(OR($I8<'[1]TABLE DATA'!$D$7,$I8='[1]TABLE DATA'!$D$7),AND($J8>$M8),OR('[1]Input-Output Data'!$J8<'[1]Input-Output Data'!$N8,'[1]Input-Output Data'!$J8='[1]Input-Output Data'!$N8)),'[1]TABLE DATA'!I$9,IF(AND(OR($I8<'[1]TABLE DATA'!$D$7,$I8='[1]TABLE DATA'!$D$7),$J8>$N8),\"SIGN TOO WIDE\",IF(AND(AND($I8>'[1]TABLE DATA'!$D$7,OR($I8<'[1]TABLE DATA'!$D$8,$I8='[1]TABLE DATA'!$D$8)),'[1]Input-Output Data'!$J8<'[1]Input-Output Data'!$K8),'[1]TABLE DATA'!I$8,IF(AND(AND($I8>'[1]TABLE DATA'!$D$7,OR($I8<'[1]TABLE DATA'!$D$8,$I8='[1]TABLE DATA'!$D$8)),AND('[1]Input-Output Data'!$J8>'[1]Input-Output Data'!$M8,OR('[1]Input-Output Data'!$J8<'[1]Input-Output Data'!$N8,'[1]Input-Output Data'!$J8='[1]Input-Output Data'!$N8))),'[1]TABLE DATA'!I$9,IF(AND(AND($I8>'[1]TABLE DATA'!$D$7,OR($I8<'[1]TABLE DATA'!$D$8,$I8='[1]TABLE DATA'!$D$8)),$J8>'[1]Input-Output Data'!$N8),\"SIGN TOO WIDE\",IF(AND(AND($I8>'[1]TABLE DATA'!$D$8,OR($I8<'[1]TABLE DATA'!$D$9,$I8='[1]TABLE DATA'!$D$9)),'[1]Input-Output Data'!$J8<'[1]Input-Output Data'!$K8),'[1]TABLE DATA'!I$9,\"SIGN TOO WIDE\"))))))))))","v":5.625},{"$f":"IF(I8=\"Arm Too Long\", \"Reduce V or W\",IF($I8>'[1]TABLE DATA'!$D$9,\"SIGN TOO LARGE\",IF(AND(OR($I8<'[1]TABLE DATA'!$D$7,$I8='[1]TABLE DATA'!$D$7),OR('[1]Input-Output Data'!$J8<'[1]Input-Output Data'!$K8,'[1]Input-Output Data'!$J8='[1]Input-Output Data'!$K8)),'[1]TABLE DATA'!J$7,IF(AND(OR($I8<'[1]TABLE DATA'!$D$7,$I8='[1]TABLE DATA'!$D$7),AND($J8>$L8),OR('[1]Input-Output Data'!$J8<'[1]Input-Output Data'!$M8,'[1]Input-Output Data'!$J8='[1]Input-Output Data'!$M8)),'[1]TABLE DATA'!J$8,IF(AND(OR($I8<'[1]TABLE DATA'!$D$7,$I8='[1]TABLE DATA'!$D$7),AND($J8>$M8),OR('[1]Input-Output Data'!$J8<'[1]Input-Output Data'!$N8,'[1]Input-Output Data'!$J8='[1]Input-Output Data'!$N8)),'[1]TABLE DATA'!J$9,IF(AND(OR($I8<'[1]TABLE DATA'!$D$7,$I8='[1]TABLE DATA'!$D$7),$J8>$N8),\"SIGN TOO WIDE\",IF(AND(AND($I8>'[1]TABLE DATA'!$D$7,OR($I8<'[1]TABLE DATA'!$D$8,$I8='[1]TABLE DATA'!$D$8)),'[1]Input-Output Data'!$J8<'[1]Input-Output Data'!$K8),'[1]TABLE DATA'!J$8,IF(AND(AND($I8>'[1]TABLE DATA'!$D$7,OR($I8<'[1]TABLE DATA'!$D$8,$I8='[1]TABLE DATA'!$D$8)),AND('[1]Input-Output Data'!$J8>'[1]Input-Output Data'!$M8,OR('[1]Input-Output Data'!$J8<'[1]Input-Output Data'!$N8,'[1]Input-Output Data'!$J8='[1]Input-Output Data'!$N8))),'[1]TABLE DATA'!J$9,IF(AND(AND($I8>'[1]TABLE DATA'!$D$7,OR($I8<'[1]TABLE DATA'!$D$8,$I8='[1]TABLE DATA'!$D$8)),$J8>'[1]Input-Output Data'!$N8),\"SIGN TOO WIDE\",IF(AND(AND($I8>'[1]TABLE DATA'!$D$8,OR($I8<'[1]TABLE DATA'!$D$9,$I8='[1]TABLE DATA'!$D$9)),'[1]Input-Output Data'!$J8<'[1]Input-Output Data'!$K8),'[1]TABLE DATA'!J$9,\"SIGN TOO WIDE\"))))))))))","v":2},{"$f":"IF(I8=\"Arm Too Long\", \"Reduce V or W\",IF($I8>'[1]TABLE DATA'!$D$9,\"SIGN TOO LARGE\",IF(AND(OR($I8<'[1]TABLE DATA'!$D$7,$I8='[1]TABLE DATA'!$D$7),OR('[1]Input-Output Data'!$J8<'[1]Input-Output Data'!$K8,'[1]Input-Output Data'!$J8='[1]Input-Output Data'!$K8)),'[1]TABLE DATA'!K$7,IF(AND(OR($I8<'[1]TABLE DATA'!$D$7,$I8='[1]TABLE DATA'!$D$7),AND($J8>$L8),OR('[1]Input-Output Data'!$J8<'[1]Input-Output Data'!$M8,'[1]Input-Output Data'!$J8='[1]Input-Output Data'!$M8)),'[1]TABLE DATA'!K$8,IF(AND(OR($I8<'[1]TABLE DATA'!$D$7,$I8='[1]TABLE DATA'!$D$7),AND($J8>$M8),OR('[1]Input-Output Data'!$J8<'[1]Input-Output Data'!$N8,'[1]Input-Output Data'!$J8='[1]Input-Output Data'!$N8)),'[1]TABLE DATA'!K$9,IF(AND(OR($I8<'[1]TABLE DATA'!$D$7,$I8='[1]TABLE DATA'!$D$7),$J8>$N8),\"SIGN TOO WIDE\",IF(AND(AND($I8>'[1]TABLE DATA'!$D$7,OR($I8<'[1]TABLE DATA'!$D$8,$I8='[1]TABLE DATA'!$D$8)),'[1]Input-Output Data'!$J8<'[1]Input-Output Data'!$K8),'[1]TABLE DATA'!K$8,IF(AND(AND($I8>'[1]TABLE DATA'!$D$7,OR($I8<'[1]TABLE DATA'!$D$8,$I8='[1]TABLE DATA'!$D$8)),AND('[1]Input-Output Data'!$J8>'[1]Input-Output Data'!$M8,OR('[1]Input-Output Data'!$J8<'[1]Input-Output Data'!$N8,'[1]Input-Output Data'!$J8='[1]Input-Output Data'!$N8))),'[1]TABLE DATA'!K$9,IF(AND(AND($I8>'[1]TABLE DATA'!$D$7,OR($I8<'[1]TABLE DATA'!$D$8,$I8='[1]TABLE DATA'!$D$8)),$J8>'[1]Input-Output Data'!$N8),\"SIGN TOO WIDE\",IF(AND(AND($I8>'[1]TABLE DATA'!$D$8,OR($I8<'[1]TABLE DATA'!$D$9,$I8='[1]TABLE DATA'!$D$9)),'[1]Input-Output Data'!$J8<'[1]Input-Output Data'!$K8),'[1]TABLE DATA'!K$9,\"SIGN TOO WIDE\"))))))))))","v":60},{"$f":"IF(I8=\"Arm Too Long\", \"Reduce V or W\",IF($I8>'[1]TABLE DATA'!$D$9,\"SIGN TOO LARGE\",IF(AND(OR($I8<'[1]TABLE DATA'!$D$7,$I8='[1]TABLE DATA'!$D$7),OR('[1]Input-Output Data'!$J8<'[1]Input-Output Data'!$K8,'[1]Input-Output Data'!$J8='[1]Input-Output Data'!$K8)),'[1]TABLE DATA'!L$7,IF(AND(OR($I8<'[1]TABLE DATA'!$D$7,$I8='[1]TABLE DATA'!$D$7),AND($J8>$L8),OR('[1]Input-Output Data'!$J8<'[1]Input-Output Data'!$M8,'[1]Input-Output Data'!$J8='[1]Input-Output Data'!$M8)),'[1]TABLE DATA'!L$8,IF(AND(OR($I8<'[1]TABLE DATA'!$D$7,$I8='[1]TABLE DATA'!$D$7),AND($J8>$M8),OR('[1]Input-Output Data'!$J8<'[1]Input-Output Data'!$N8,'[1]Input-Output Data'!$J8='[1]Input-Output Data'!$N8)),'[1]TABLE DATA'!L$9,IF(AND(OR($I8<'[1]TABLE DATA'!$D$7,$I8='[1]TABLE DATA'!$D$7),$J8>$N8),\"SIGN TOO WIDE\",IF(AND(AND($I8>'[1]TABLE DATA'!$D$7,OR($I8<'[1]TABLE DATA'!$D$8,$I8='[1]TABLE DATA'!$D$8)),'[1]Input-Output Data'!$J8<'[1]Input-Output Data'!$K8),'[1]TABLE DATA'!L$8,IF(AND(AND($I8>'[1]TABLE DATA'!$D$7,OR($I8<'[1]TABLE DATA'!$D$8,$I8='[1]TABLE DATA'!$D$8)),AND('[1]Input-Output Data'!$J8>'[1]Input-Output Data'!$M8,OR('[1]Input-Output Data'!$J8<'[1]Input-Output Data'!$N8,'[1]Input-Output Data'!$J8='[1]Input-Output Data'!$N8))),'[1]TABLE DATA'!L$9,IF(AND(AND($I8>'[1]TABLE DATA'!$D$7,OR($I8<'[1]TABLE DATA'!$D$8,$I8='[1]TABLE DATA'!$D$8)),$J8>'[1]Input-Output Data'!$N8),\"SIGN TOO WIDE\",IF(AND(AND($I8>'[1]TABLE DATA'!$D$8,OR($I8<'[1]TABLE DATA'!$D$9,$I8='[1]TABLE DATA'!$D$9)),'[1]Input-Output Data'!$J8<'[1]Input-Output Data'!$K8),'[1]TABLE DATA'!L$9,\"SIGN TOO WIDE\"))))))))))","v":7.4},{"$f":"IF(I8=\"Arm Too Long\", \"Reduce V or W\",IF($I8>'[1]TABLE DATA'!$D$9,\"SIGN TOO LARGE\",IF(AND(OR($I8<'[1]TABLE DATA'!$D$7,$I8='[1]TABLE DATA'!$D$7),OR('[1]Input-Output Data'!$J8<'[1]Input-Output Data'!$K8,'[1]Input-Output Data'!$J8='[1]Input-Output Data'!$K8)),'[1]TABLE DATA'!M$7,IF(AND(OR($I8<'[1]TABLE DATA'!$D$7,$I8='[1]TABLE DATA'!$D$7),AND($J8>$L8),OR('[1]Input-Output Data'!$J8<'[1]Input-Output Data'!$M8,'[1]Input-Output Data'!$J8='[1]Input-Output Data'!$M8)),'[1]TABLE DATA'!M$8,IF(AND(OR($I8<'[1]TABLE DATA'!$D$7,$I8='[1]TABLE DATA'!$D$7),AND($J8>$M8),OR('[1]Input-Output Data'!$J8<'[1]Input-Output Data'!$N8,'[1]Input-Output Data'!$J8='[1]Input-Output Data'!$N8)),'[1]TABLE DATA'!M$9,IF(AND(OR($I8<'[1]TABLE DATA'!$D$7,$I8='[1]TABLE DATA'!$D$7),$J8>$N8),\"SIGN TOO WIDE\",IF(AND(AND($I8>'[1]TABLE DATA'!$D$7,OR($I8<'[1]TABLE DATA'!$D$8,$I8='[1]TABLE DATA'!$D$8)),'[1]Input-Output Data'!$J8<'[1]Input-Output Data'!$K8),'[1]TABLE DATA'!M$8,IF(AND(AND($I8>'[1]TABLE DATA'!$D$7,OR($I8<'[1]TABLE DATA'!$D$8,$I8='[1]TABLE DATA'!$D$8)),AND('[1]Input-Output Data'!$J8>'[1]Input-Output Data'!$M8,OR('[1]Input-Output Data'!$J8<'[1]Input-Output Data'!$N8,'[1]Input-Output Data'!$J8='[1]Input-Output Data'!$N8))),'[1]TABLE DATA'!M$9,IF(AND(AND($I8>'[1]TABLE DATA'!$D$7,OR($I8<'[1]TABLE DATA'!$D$8,$I8='[1]TABLE DATA'!$D$8)),$J8>'[1]Input-Output Data'!$N8),\"SIGN TOO WIDE\",IF(AND(AND($I8>'[1]TABLE DATA'!$D$8,OR($I8<'[1]TABLE DATA'!$D$9,$I8='[1]TABLE DATA'!$D$9)),'[1]Input-Output Data'!$J8<'[1]Input-Output Data'!$K8),'[1]TABLE DATA'!M$9,\"SIGN TOO WIDE\"))))))))))","v":0.5},{"$f":"IF(I8=\"Arm Too Long\", \"Reduce V or W\",IF($I8>'[1]TABLE DATA'!$D$9,\"SIGN TOO LARGE\",IF(AND(OR($I8<'[1]TABLE DATA'!$D$7,$I8='[1]TABLE DATA'!$D$7),OR('[1]Input-Output Data'!$J8<'[1]Input-Output Data'!$K8,'[1]Input-Output Data'!$J8='[1]Input-Output Data'!$K8)),'[1]TABLE DATA'!N$7,IF(AND(OR($I8<'[1]TABLE DATA'!$D$7,$I8='[1]TABLE DATA'!$D$7),AND($J8>$L8),OR('[1]Input-Output Data'!$J8<'[1]Input-Output Data'!$M8,'[1]Input-Output Data'!$J8='[1]Input-Output Data'!$M8)),'[1]TABLE DATA'!N$8,IF(AND(OR($I8<'[1]TABLE DATA'!$D$7,$I8='[1]TABLE DATA'!$D$7),AND($J8>$M8),OR('[1]Input-Output Data'!$J8<'[1]Input-Output Data'!$N8,'[1]Input-Output Data'!$J8='[1]Input-Output Data'!$N8)),'[1]TABLE DATA'!N$9,IF(AND(OR($I8<'[1]TABLE DATA'!$D$7,$I8='[1]TABLE DATA'!$D$7),$J8>$N8),\"SIGN TOO WIDE\",IF(AND(AND($I8>'[1]TABLE DATA'!$D$7,OR($I8<'[1]TABLE DATA'!$D$8,$I8='[1]TABLE DATA'!$D$8)),'[1]Input-Output Data'!$J8<'[1]Input-Output Data'!$K8),'[1]TABLE DATA'!N$8,IF(AND(AND($I8>'[1]TABLE DATA'!$D$7,OR($I8<'[1]TABLE DATA'!$D$8,$I8='[1]TABLE DATA'!$D$8)),AND('[1]Input-Output Data'!$J8>'[1]Input-Output Data'!$M8,OR('[1]Input-Output Data'!$J8<'[1]Input-Output Data'!$N8,'[1]Input-Output Data'!$J8='[1]Input-Output Data'!$N8))),'[1]TABLE DATA'!N$9,IF(AND(AND($I8>'[1]TABLE DATA'!$D$7,OR($I8<'[1]TABLE DATA'!$D$8,$I8='[1]TABLE DATA'!$D$8)),$J8>'[1]Input-Output Data'!$N8),\"SIGN TOO WIDE\",IF(AND(AND($I8>'[1]TABLE DATA'!$D$8,OR($I8<'[1]TABLE DATA'!$D$9,$I8='[1]TABLE DATA'!$D$9)),'[1]Input-Output Data'!$J8<'[1]Input-Output Data'!$K8),'[1]TABLE DATA'!N$9,\"SIGN TOO WIDE\"))))))))))","v":0.5},{"$f":"IF(I8=\"Arm Too Long\", \"Reduce V or W\",IF($I8>'[1]TABLE DATA'!$D$9,\"SIGN TOO LARGE\",IF(AND(OR($I8<'[1]TABLE DATA'!$D$7,$I8='[1]TABLE DATA'!$D$7),OR('[1]Input-Output Data'!$J8<'[1]Input-Output Data'!$K8,'[1]Input-Output Data'!$J8='[1]Input-Output Data'!$K8)),'[1]TABLE DATA'!O$7,IF(AND(OR($I8<'[1]TABLE DATA'!$D$7,$I8='[1]TABLE DATA'!$D$7),AND($J8>$L8),OR('[1]Input-Output Data'!$J8<'[1]Input-Output Data'!$M8,'[1]Input-Output Data'!$J8='[1]Input-Output Data'!$M8)),'[1]TABLE DATA'!O$8,IF(AND(OR($I8<'[1]TABLE DATA'!$D$7,$I8='[1]TABLE DATA'!$D$7),AND($J8>$M8),OR('[1]Input-Output Data'!$J8<'[1]Input-Output Data'!$N8,'[1]Input-Output Data'!$J8='[1]Input-Output Data'!$N8)),'[1]TABLE DATA'!O$9,IF(AND(OR($I8<'[1]TABLE DATA'!$D$7,$I8='[1]TABLE DATA'!$D$7),$J8>$N8),\"SIGN TOO WIDE\",IF(AND(AND($I8>'[1]TABLE DATA'!$D$7,OR($I8<'[1]TABLE DATA'!$D$8,$I8='[1]TABLE DATA'!$D$8)),'[1]Input-Output Data'!$J8<'[1]Input-Output Data'!$K8),'[1]TABLE DATA'!O$8,IF(AND(AND($I8>'[1]TABLE DATA'!$D$7,OR($I8<'[1]TABLE DATA'!$D$8,$I8='[1]TABLE DATA'!$D$8)),AND('[1]Input-Output Data'!$J8>'[1]Input-Output Data'!$M8,OR('[1]Input-Output Data'!$J8<'[1]Input-Output Data'!$N8,'[1]Input-Output Data'!$J8='[1]Input-Output Data'!$N8))),'[1]TABLE DATA'!O$9,IF(AND(AND($I8>'[1]TABLE DATA'!$D$7,OR($I8<'[1]TABLE DATA'!$D$8,$I8='[1]TABLE DATA'!$D$8)),$J8>'[1]Input-Output Data'!$N8),\"SIGN TOO WIDE\",IF(AND(AND($I8>'[1]TABLE DATA'!$D$8,OR($I8<'[1]TABLE DATA'!$D$9,$I8='[1]TABLE DATA'!$D$9)),'[1]Input-Output Data'!$J8<'[1]Input-Output Data'!$K8),'[1]TABLE DATA'!O$9,\"SIGN TOO WIDE\"))))))))))","v":0.5},"I"]
[null,null,null,36,48,"Square","I",30,12,20,{"$f":"IF(OR(I9<'[1]TABLE DATA'!$D$7,I9='[1]TABLE DATA'!$D$7),717.75/I9,IF(AND('[1]TABLE DATA'!$D$7<I9,OR(I9<'[1]TABLE DATA'!$D$8,I9='[1]TABLE DATA'!$D$8)),1695/I9,IF(AND('[1]TABLE DATA'!$D$8<I9,OR(I9<'[1]TABLE DATA'!$D$9,I9='[1]TABLE DATA'!$D$9)),2268/I9,IF(I9=\"Arm Too Long\", \"Reduce V or W\",\"Sign Too Wide\"))))","v":59.81},{"$f":"717.75/'[1]Input-Output Data'!I9","v":59.81},141.25,189,{"$f":"IF(I9=\"Arm Too Long\", \"Reduce V or W\",IF($I9>'[1]TABLE DATA'!$D$9,\"SIGN TOO LARGE\",IF(AND(OR($I9<'[1]TABLE DATA'!$D$7,$I9='[1]TABLE DATA'!$D$7),OR('[1]Input-Output Data'!$J9<'[1]Input-Output Data'!$K9,'[1]Input-Output Data'!$J9='[1]Input-Output Data'!$K9)),'[1]TABLE DATA'!F$7,IF(AND(OR($I9<'[1]TABLE DATA'!$D$7,$I9='[1]TABLE DATA'!$D$7),AND($J9>$L9),OR('[1]Input-Output Data'!$J9<'[1]Input-Output Data'!$M9,'[1]Input-Output Data'!$J9='[1]Input-Output Data'!$M9)),'[1]TABLE DATA'!F$8,IF(AND(OR($I9<'[1]TABLE DATA'!$D$7,$I9='[1]TABLE DATA'!$D$7),AND($J9>$M9),OR('[1]Input-Output Data'!$J9<'[1]Input-Output Data'!$N9,'[1]Input-Output Data'!$J9='[1]Input-Output Data'!$N9)),'[1]TABLE DATA'!F$9,IF(AND(OR($I9<'[1]TABLE DATA'!$D$7,$I9='[1]TABLE DATA'!$D$7),$J9>$N9),\"SIGN TOO WIDE\",IF(AND(AND($I9>'[1]TABLE DATA'!$D$7,OR($I9<'[1]TABLE DATA'!$D$8,$I9='[1]TABLE DATA'!$D$8)),'[1]Input-Output Data'!$J9<'[1]Input-Output Data'!$K9),'[1]TABLE DATA'!F$8,IF(AND(AND($I9>'[1]TABLE DATA'!$D$7,OR($I9<'[1]TABLE DATA'!$D$8,$I9='[1]TABLE DATA'!$D$8)),AND('[1]Input-Output Data'!$J9>'[1]Input-Output Data'!$M9,OR('[1]Input-Output Data'!$J9<'[1]Input-Output Data'!$N9,'[1]Input-Output Data'!$J9='[1]Input-Output Data'!$N9))),'[1]TABLE DATA'!F$9,IF(AND(AND($I9>'[1]TABLE DATA'!$D$7,OR($I9<'[1]TABLE DATA'!$D$8,$I9='[1]TABLE DATA'!$D$8)),$J9>'[1]Input-Output Data'!$N9),\"SIGN TOO WIDE\",IF(AND(AND($I9>'[1]TABLE DATA'!$D$8,OR($I9<'[1]TABLE DATA'!$D$9,$I9='[1]TABLE DATA'!$D$9)),'[1]Input-Output Data'!$J9<'[1]Input-Output Data'!$K9),'[1]TABLE DATA'!F$9,\"SIGN TOO WIDE\"))))))))))","v":4},{"$f":"IF(I9=\"Arm Too Long\", \"Reduce V or W\",IF($I9>'[1]TABLE DATA'!$D$9,\"SIGN TOO LARGE\",IF(AND(OR($I9<'[1]TABLE DATA'!$D$7,$I9='[1]TABLE DATA'!$D$7),OR('[1]Input-Output Data'!$J9<'[1]Input-Output Data'!$K9,'[1]Input-Output Data'!$J9='[1]Input-Output Data'!$K9)),'[1]TABLE DATA'!G$7,IF(AND(OR($I9<'[1]TABLE DATA'!$D$7,$I9='[1]TABLE DATA'!$D$7),AND($J9>$L9),OR('[1]Input-Output Data'!$J9<'[1]Input-Output Data'!$M9,'[1]Input-Output Data'!$J9='[1]Input-Output Data'!$M9)),'[1]TABLE DATA'!G$8,IF(AND(OR($I9<'[1]TABLE DATA'!$D$7,$I9='[1]TABLE DATA'!$D$7),AND($J9>$M9),OR('[1]Input-Output Data'!$J9<'[1]Input-Output Data'!$N9,'[1]Input-Output Data'!$J9='[1]Input-Output Data'!$N9)),'[1]TABLE DATA'!G$9,IF(AND(OR($I9<'[1]TABLE DATA'!$D$7,$I9='[1]TABLE DATA'!$D$7),$J9>$N9),\"SIGN TOO WIDE\",IF(AND(AND($I9>'[1]TABLE DATA'!$D$7,OR($I9<'[1]TABLE DATA'!$D$8,$I9='[1]TABLE DATA'!$D$8)),'[1]Input-Output Data'!$J9<'[1]Input-Output Data'!$K9),'[1]TABLE DATA'!G$8,IF(AND(AND($I9>'[1]TABLE DATA'!$D$7,OR($I9<'[1]TABLE DATA'!$D$8,$I9='[1]TABLE DATA'!$D$8)),AND('[1]Input-Output Data'!$J9>'[1]Input-Output Data'!$M9,OR('[1]Input-Output Data'!$J9<'[1]Input-Output Data'!$N9,'[1]Input-Output Data'!$J9='[1]Input-Output Data'!$N9))),'[1]TABLE DATA'!G$9,IF(AND(AND($I9>'[1]TABLE DATA'!$D$7,OR($I9<'[1]TABLE DATA'!$D$8,$I9='[1]TABLE DATA'!$D$8)),$J9>'[1]Input-Output Data'!$N9),\"SIGN TOO WIDE\",IF(AND(AND($I9>'[1]TABLE DATA'!$D$8,OR($I9<'[1]TABLE DATA'!$D$9,$I9='[1]TABLE DATA'!$D$9)),'[1]Input-Output Data'!$J9<'[1]Input-Output Data'!$K9),'[1]TABLE DATA'!G$9,\"SIGN TOO WIDE\"))))))))))","v":2},{"$f":"IF(I9=\"Arm Too Long\", \"Reduce V or W\",IF($I9>'[1]TABLE DATA'!$D$9,\"SIGN TOO LARGE\",IF(AND(OR($I9<'[1]TABLE DATA'!$D$7,$I9='[1]TABLE DATA'!$D$7),OR('[1]Input-Output Data'!$J9<'[1]Input-Output Data'!$K9,'[1]Input-Output Data'!$J9='[1]Input-Output Data'!$K9)),'[1]TABLE DATA'!H$7,IF(AND(OR($I9<'[1]TABLE DATA'!$D$7,$I9='[1]TABLE DATA'!$D$7),AND($J9>$L9),OR('[1]Input-Output Data'!$J9<'[1]Input-Output Data'!$M9,'[1]Input-Output Data'!$J9='[1]Input-Output Data'!$M9)),'[1]TABLE DATA'!H$8,IF(AND(OR($I9<'[1]TABLE DATA'!$D$7,$I9='[1]TABLE DATA'!$D$7),AND($J9>$M9),OR('[1]Input-Output Data'!$J9<'[1]Input-Output Data'!$N9,'[1]Input-Output Data'!$J9='[1]Input-Output Data'!$N9)),'[1]TABLE DATA'!H$9,IF(AND(OR($I9<'[1]TABLE DATA'!$D$7,$I9='[1]TABLE DATA'!$D$7),$J9>$N9),\"SIGN TOO WIDE\",IF(AND(AND($I9>'[1]TABLE DATA'!$D$7,OR($I9<'[1]TABLE DATA'!$D$8,$I9='[1]TABLE DATA'!$D$8)),'[1]Input-Output Data'!$J9<'[1]Input-Output Data'!$K9),'[1]TABLE DATA'!H$8,IF(AND(AND($I9>'[1]TABLE DATA'!$D$7,OR($I9<'[1]TABLE DATA'!$D$8,$I9='[1]TABLE DATA'!$D$8)),AND('[1]Input-Output Data'!$J9>'[1]Input-Output Data'!$M9,OR('[1]Input-Output Data'!$J9<'[1]Input-Output Data'!$N9,'[1]Input-Output Data'!$J9='[1]Input-Output Data'!$N9))),'[1]TABLE DATA'!H$9,IF(AND(AND($I9>'[1]TABLE DATA'!$D$7,OR($I9<'[1]TABLE DATA'!$D$8,$I9='[1]TABLE DATA'!$D$8)),$J9>'[1]Input-Output Data'!$N9),\"SIGN TOO WIDE\",IF(AND(AND($I9>'[1]TABLE DATA'!$D$8,OR($I9<'[1]TABLE DATA'!$D$9,$I9='[1]TABLE DATA'!$D$9)),'[1]Input-Output Data'!$J9<'[1]Input-Output Data'!$K9),'[1]TABLE DATA'!H$9,\"SIGN TOO WIDE\"))))))))))","v":0.625},{"$f":"IF(I9=\"Arm Too Long\", \"Reduce V or W\",IF($I9>'[1]TABLE DATA'!$D$9,\"SIGN TOO LARGE\",IF(AND(OR($I9<'[1]TABLE DATA'!$D$7,$I9='[1]TABLE DATA'!$D$7),OR('[1]Input-Output Data'!$J9<'[1]Input-Output Data'!$K9,'[1]Input-Output Data'!$J9='[1]Input-Output Data'!$K9)),'[1]TABLE DATA'!I$7,IF(AND(OR($I9<'[1]TABLE DATA'!$D$7,$I9='[1]TABLE DATA'!$D$7),AND($J9>$L9),OR('[1]Input-Output Data'!$J9<'[1]Input-Output Data'!$M9,'[1]Input-Output Data'!$J9='[1]Input-Output Data'!$M9)),'[1]TABLE DATA'!I$8,IF(AND(OR($I9<'[1]TABLE DATA'!$D$7,$I9='[1]TABLE DATA'!$D$7),AND($J9>$M9),OR('[1]Input-Output Data'!$J9<'[1]Input-Output Data'!$N9,'[1]Input-Output Data'!$J9='[1]Input-Output Data'!$N9)),'[1]TABLE DATA'!I$9,IF(AND(OR($I9<'[1]TABLE DATA'!$D$7,$I9='[1]TABLE DATA'!$D$7),$J9>$N9),\"SIGN TOO WIDE\",IF(AND(AND($I9>'[1]TABLE DATA'!$D$7,OR($I9<'[1]TABLE DATA'!$D$8,$I9='[1]TABLE DATA'!$D$8)),'[1]Input-Output Data'!$J9<'[1]Input-Output Data'!$K9),'[1]TABLE DATA'!I$8,IF(AND(AND($I9>'[1]TABLE DATA'!$D$7,OR($I9<'[1]TABLE DATA'!$D$8,$I9='[1]TABLE DATA'!$D$8)),AND('[1]Input-Output Data'!$J9>'[1]Input-Output Data'!$M9,OR('[1]Input-Output Data'!$J9<'[1]Input-Output Data'!$N9,'[1]Input-Output Data'!$J9='[1]Input-Output Data'!$N9))),'[1]TABLE DATA'!I$9,IF(AND(AND($I9>'[1]TABLE DATA'!$D$7,OR($I9<'[1]TABLE DATA'!$D$8,$I9='[1]TABLE DATA'!$D$8)),$J9>'[1]Input-Output Data'!$N9),\"SIGN TOO WIDE\",IF(AND(AND($I9>'[1]TABLE DATA'!$D$8,OR($I9<'[1]TABLE DATA'!$D$9,$I9='[1]TABLE DATA'!$D$9)),'[1]Input-Output Data'!$J9<'[1]Input-Output Data'!$K9),'[1]TABLE DATA'!I$9,\"SIGN TOO WIDE\"))))))))))","v":5.625},{"$f":"IF(I9=\"Arm Too Long\", \"Reduce V or W\",IF($I9>'[1]TABLE DATA'!$D$9,\"SIGN TOO LARGE\",IF(AND(OR($I9<'[1]TABLE DATA'!$D$7,$I9='[1]TABLE DATA'!$D$7),OR('[1]Input-Output Data'!$J9<'[1]Input-Output Data'!$K9,'[1]Input-Output Data'!$J9='[1]Input-Output Data'!$K9)),'[1]TABLE DATA'!J$7,IF(AND(OR($I9<'[1]TABLE DATA'!$D$7,$I9='[1]TABLE DATA'!$D$7),AND($J9>$L9),OR('[1]Input-Output Data'!$J9<'[1]Input-Output Data'!$M9,'[1]Input-Output Data'!$J9='[1]Input-Output Data'!$M9)),'[1]TABLE DATA'!J$8,IF(AND(OR($I9<'[1]TABLE DATA'!$D$7,$I9='[1]TABLE DATA'!$D$7),AND($J9>$M9),OR('[1]Input-Output Data'!$J9<'[1]Input-Output Data'!$N9,'[1]Input-Output Data'!$J9='[1]Input-Output Data'!$N9)),'[1]TABLE DATA'!J$9,IF(AND(OR($I9<'[1]TABLE DATA'!$D$7,$I9='[1]TABLE DATA'!$D$7),$J9>$N9),\"SIGN TOO WIDE\",IF(AND(AND($I9>'[1]TABLE DATA'!$D$7,OR($I9<'[1]TABLE DATA'!$D$8,$I9='[1]TABLE DATA'!$D$8)),'[1]Input-Output Data'!$J9<'[1]Input-Output Data'!$K9),'[1]TABLE DATA'!J$8,IF(AND(AND($I9>'[1]TABLE DATA'!$D$7,OR($I9<'[1]TABLE DATA'!$D$8,$I9='[1]TABLE DATA'!$D$8)),AND('[1]Input-Output Data'!$J9>'[1]Input-Output Data'!$M9,OR('[1]Input-Output Data'!$J9<'[1]Input-Output Data'!$N9,'[1]Input-Output Data'!$J9='[1]Input-Output Data'!$N9))),'[1]TABLE DATA'!J$9,IF(AND(AND($I9>'[1]TABLE DATA'!$D$7,OR($I9<'[1]TABLE DATA'!$D$8,$I9='[1]TABLE DATA'!$D$8)),$J9>'[1]Input-Output Data'!$N9),\"SIGN TOO WIDE\",IF(AND(AND($I9>'[1]TABLE DATA'!$D$8,OR($I9<'[1]TABLE DATA'!$D$9,$I9='[1]TABLE DATA'!$D$9)),'[1]Input-Output Data'!$J9<'[1]Input-Output Data'!$K9),'[1]TABLE DATA'!J$9,\"SIGN TOO WIDE\"))))))))))","v":2},{"$f":"IF(I9=\"Arm Too Long\", \"Reduce V or W\",IF($I9>'[1]TABLE DATA'!$D$9,\"SIGN TOO LARGE\",IF(AND(OR($I9<'[1]TABLE DATA'!$D$7,$I9='[1]TABLE DATA'!$D$7),OR('[1]Input-Output Data'!$J9<'[1]Input-Output Data'!$K9,'[1]Input-Output Data'!$J9='[1]Input-Output Data'!$K9)),'[1]TABLE DATA'!K$7,IF(AND(OR($I9<'[1]TABLE DATA'!$D$7,$I9='[1]TABLE DATA'!$D$7),AND($J9>$L9),OR('[1]Input-Output Data'!$J9<'[1]Input-Output Data'!$M9,'[1]Input-Output Data'!$J9='[1]Input-Output Data'!$M9)),'[1]TABLE DATA'!K$8,IF(AND(OR($I9<'[1]TABLE DATA'!$D$7,$I9='[1]TABLE DATA'!$D$7),AND($J9>$M9),OR('[1]Input-Output Data'!$J9<'[1]Input-Output Data'!$N9,'[1]Input-Output Data'!$J9='[1]Input-Output Data'!$N9)),'[1]TABLE DATA'!K$9,IF(AND(OR($I9<'[1]TABLE DATA'!$D$7,$I9='[1]TABLE DATA'!$D$7),$J9>$N9),\"SIGN TOO WIDE\",IF(AND(AND($I9>'[1]TABLE DATA'!$D$7,OR($I9<'[1]TABLE DATA'!$D$8,$I9='[1]TABLE DATA'!$D$8)),'[1]Input-Output Data'!$J9<'[1]Input-Output Data'!$K9),'[1]TABLE DATA'!K$8,IF(AND(AND($I9>'[1]TABLE DATA'!$D$7,OR($I9<'[1]TABLE DATA'!$D$8,$I9='[1]TABLE DATA'!$D$8)),AND('[1]Input-Output Data'!$J9>'[1]Input-Output Data'!$M9,OR('[1]Input-Output Data'!$J9<'[1]Input-Output Data'!$N9,'[1]Input-Output Data'!$J9='[1]Input-Output Data'!$N9))),'[1]TABLE DATA'!K$9,IF(AND(AND($I9>'[1]TABLE DATA'!$D$7,OR($I9<'[1]TABLE DATA'!$D$8,$I9='[1]TABLE DATA'!$D$8)),$J9>'[1]Input-Output Data'!$N9),\"SIGN TOO WIDE\",IF(AND(AND($I9>'[1]TABLE DATA'!$D$8,OR($I9<'[1]TABLE DATA'!$D$9,$I9='[1]TABLE DATA'!$D$9)),'[1]Input-Output Data'!$J9<'[1]Input-Output Data'!$K9),'[1]TABLE DATA'!K$9,\"SIGN TOO WIDE\"))))))))))","v":60},{"$f":"IF(I9=\"Arm Too Long\", \"Reduce V or W\",IF($I9>'[1]TABLE DATA'!$D$9,\"SIGN TOO LARGE\",IF(AND(OR($I9<'[1]TABLE DATA'!$D$7,$I9='[1]TABLE DATA'!$D$7),OR('[1]Input-Output Data'!$J9<'[1]Input-Output Data'!$K9,'[1]Input-Output Data'!$J9='[1]Input-Output Data'!$K9)),'[1]TABLE DATA'!L$7,IF(AND(OR($I9<'[1]TABLE DATA'!$D$7,$I9='[1]TABLE DATA'!$D$7),AND($J9>$L9),OR('[1]Input-Output Data'!$J9<'[1]Input-Output Data'!$M9,'[1]Input-Output Data'!$J9='[1]Input-Output Data'!$M9)),'[1]TABLE DATA'!L$8,IF(AND(OR($I9<'[1]TABLE DATA'!$D$7,$I9='[1]TABLE DATA'!$D$7),AND($J9>$M9),OR('[1]Input-Output Data'!$J9<'[1]Input-Output Data'!$N9,'[1]Input-Output Data'!$J9='[1]Input-Output Data'!$N9)),'[1]TABLE DATA'!L$9,IF(AND(OR($I9<'[1]TABLE DATA'!$D$7,$I9='[1]TABLE DATA'!$D$7),$J9>$N9),\"SIGN TOO WIDE\",IF(AND(AND($I9>'[1]TABLE DATA'!$D$7,OR($I9<'[1]TABLE DATA'!$D$8,$I9='[1]TABLE DATA'!$D$8)),'[1]Input-Output Data'!$J9<'[1]Input-Output Data'!$K9),'[1]TABLE DATA'!L$8,IF(AND(AND($I9>'[1]TABLE DATA'!$D$7,OR($I9<'[1]TABLE DATA'!$D$8,$I9='[1]TABLE DATA'!$D$8)),AND('[1]Input-Output Data'!$J9>'[1]Input-Output Data'!$M9,OR('[1]Input-Output Data'!$J9<'[1]Input-Output Data'!$N9,'[1]Input-Output Data'!$J9='[1]Input-Output Data'!$N9))),'[1]TABLE DATA'!L$9,IF(AND(AND($I9>'[1]TABLE DATA'!$D$7,OR($I9<'[1]TABLE DATA'!$D$8,$I9='[1]TABLE DATA'!$D$8)),$J9>'[1]Input-Output Data'!$N9),\"SIGN TOO WIDE\",IF(AND(AND($I9>'[1]TABLE DATA'!$D$8,OR($I9<'[1]TABLE DATA'!$D$9,$I9='[1]TABLE DATA'!$D$9)),'[1]Input-Output Data'!$J9<'[1]Input-Output Data'!$K9),'[1]TABLE DATA'!L$9,\"SIGN TOO WIDE\"))))))))))","v":7.4},{"$f":"IF(I9=\"Arm Too Long\", \"Reduce V or W\",IF($I9>'[1]TABLE DATA'!$D$9,\"SIGN TOO LARGE\",IF(AND(OR($I9<'[1]TABLE DATA'!$D$7,$I9='[1]TABLE DATA'!$D$7),OR('[1]Input-Output Data'!$J9<'[1]Input-Output Data'!$K9,'[1]Input-Output Data'!$J9='[1]Input-Output Data'!$K9)),'[1]TABLE DATA'!M$7,IF(AND(OR($I9<'[1]TABLE DATA'!$D$7,$I9='[1]TABLE DATA'!$D$7),AND($J9>$L9),OR('[1]Input-Output Data'!$J9<'[1]Input-Output Data'!$M9,'[1]Input-Output Data'!$J9='[1]Input-Output Data'!$M9)),'[1]TABLE DATA'!M$8,IF(AND(OR($I9<'[1]TABLE DATA'!$D$7,$I9='[1]TABLE DATA'!$D$7),AND($J9>$M9),OR('[1]Input-Output Data'!$J9<'[1]Input-Output Data'!$N9,'[1]Input-Output Data'!$J9='[1]Input-Output Data'!$N9)),'[1]TABLE DATA'!M$9,IF(AND(OR($I9<'[1]TABLE DATA'!$D$7,$I9='[1]TABLE DATA'!$D$7),$J9>$N9),\"SIGN TOO WIDE\",IF(AND(AND($I9>'[1]TABLE DATA'!$D$7,OR($I9<'[1]TABLE DATA'!$D$8,$I9='[1]TABLE DATA'!$D$8)),'[1]Input-Output Data'!$J9<'[1]Input-Output Data'!$K9),'[1]TABLE DATA'!M$8,IF(AND(AND($I9>'[1]TABLE DATA'!$D$7,OR($I9<'[1]TABLE DATA'!$D$8,$I9='[1]TABLE DATA'!$D$8)),AND('[1]Input-Output Data'!$J9>'[1]Input-Output Data'!$M9,OR('[1]Input-Output Data'!$J9<'[1]Input-Output Data'!$N9,'[1]Input-Output Data'!$J9='[1]Input-Output Data'!$N9))),'[1]TABLE DATA'!M$9,IF(AND(AND($I9>'[1]TABLE DATA'!$D$7,OR($I9<'[1]TABLE DATA'!$D$8,$I9='[1]TABLE DATA'!$D$8)),$J9>'[1]Input-Output Data'!$N9),\"SIGN TOO WIDE\",IF(AND(AND($I9>'[1]TABLE DATA'!$D$8,OR($I9<'[1]TABLE DATA'!$D$9,$I9='[1]TABLE DATA'!$D$9)),'[1]Input-Output Data'!$J9<'[1]Input-Output Data'!$K9),'[1]TABLE DATA'!M$9,\"SIGN TOO WIDE\"))))))))))","v":0.5},{"$f":"IF(I9=\"Arm Too Long\", \"Reduce V or W\",IF($I9>'[1]TABLE DATA'!$D$9,\"SIGN TOO LARGE\",IF(AND(OR($I9<'[1]TABLE DATA'!$D$7,$I9='[1]TABLE DATA'!$D$7),OR('[1]Input-Output Data'!$J9<'[1]Input-Output Data'!$K9,'[1]Input-Output Data'!$J9='[1]Input-Output Data'!$K9)),'[1]TABLE DATA'!N$7,IF(AND(OR($I9<'[1]TABLE DATA'!$D$7,$I9='[1]TABLE DATA'!$D$7),AND($J9>$L9),OR('[1]Input-Output Data'!$J9<'[1]Input-Output Data'!$M9,'[1]Input-Output Data'!$J9='[1]Input-Output Data'!$M9)),'[1]TABLE DATA'!N$8,IF(AND(OR($I9<'[1]TABLE DATA'!$D$7,$I9='[1]TABLE DATA'!$D$7),AND($J9>$M9),OR('[1]Input-Output Data'!$J9<'[1]Input-Output Data'!$N9,'[1]Input-Output Data'!$J9='[1]Input-Output Data'!$N9)),'[1]TABLE DATA'!N$9,IF(AND(OR($I9<'[1]TABLE DATA'!$D$7,$I9='[1]TABLE DATA'!$D$7),$J9>$N9),\"SIGN TOO WIDE\",IF(AND(AND($I9>'[1]TABLE DATA'!$D$7,OR($I9<'[1]TABLE DATA'!$D$8,$I9='[1]TABLE DATA'!$D$8)),'[1]Input-Output Data'!$J9<'[1]Input-Output Data'!$K9),'[1]TABLE DATA'!N$8,IF(AND(AND($I9>'[1]TABLE DATA'!$D$7,OR($I9<'[1]TABLE DATA'!$D$8,$I9='[1]TABLE DATA'!$D$8)),AND('[1]Input-Output Data'!$J9>'[1]Input-Output Data'!$M9,OR('[1]Input-Output Data'!$J9<'[1]Input-Output Data'!$N9,'[1]Input-Output Data'!$J9='[1]Input-Output Data'!$N9))),'[1]TABLE DATA'!N$9,IF(AND(AND($I9>'[1]TABLE DATA'!$D$7,OR($I9<'[1]TABLE DATA'!$D$8,$I9='[1]TABLE DATA'!$D$8)),$J9>'[1]Input-Output Data'!$N9),\"SIGN TOO WIDE\",IF(AND(AND($I9>'[1]TABLE DATA'!$D$8,OR($I9<'[1]TABLE DATA'!$D$9,$I9='[1]TABLE DATA'!$D$9)),'[1]Input-Output Data'!$J9<'[1]Input-Output Data'!$K9),'[1]TABLE DATA'!N$9,\"SIGN TOO WIDE\"))))))))))","v":0.5},{"$f":"IF(I9=\"Arm Too Long\", \"Reduce V or W\",IF($I9>'[1]TABLE DATA'!$D$9,\"SIGN TOO LARGE\",IF(AND(OR($I9<'[1]TABLE DATA'!$D$7,$I9='[1]TABLE DATA'!$D$7),OR('[1]Input-Output Data'!$J9<'[1]Input-Output Data'!$K9,'[1]Input-Output Data'!$J9='[1]Input-Output Data'!$K9)),'[1]TABLE DATA'!O$7,IF(AND(OR($I9<'[1]TABLE DATA'!$D$7,$I9='[1]TABLE DATA'!$D$7),AND($J9>$L9),OR('[1]Input-Output Data'!$J9<'[1]Input-Output Data'!$M9,'[1]Input-Output Data'!$J9='[1]Input-Output Data'!$M9)),'[1]TABLE DATA'!O$8,IF(AND(OR($I9<'[1]TABLE DATA'!$D$7,$I9='[1]TABLE DATA'!$D$7),AND($J9>$M9),OR('[1]Input-Output Data'!$J9<'[1]Input-Output Data'!$N9,'[1]Input-Output Data'!$J9='[1]Input-Output Data'!$N9)),'[1]TABLE DATA'!O$9,IF(AND(OR($I9<'[1]TABLE DATA'!$D$7,$I9='[1]TABLE DATA'!$D$7),$J9>$N9),\"SIGN TOO WIDE\",IF(AND(AND($I9>'[1]TABLE DATA'!$D$7,OR($I9<'[1]TABLE DATA'!$D$8,$I9='[1]TABLE DATA'!$D$8)),'[1]Input-Output Data'!$J9<'[1]Input-Output Data'!$K9),'[1]TABLE DATA'!O$8,IF(AND(AND($I9>'[1]TABLE DATA'!$D$7,OR($I9<'[1]TABLE DATA'!$D$8,$I9='[1]TABLE DATA'!$D$8)),AND('[1]Input-Output Data'!$J9>'[1]Input-Output Data'!$M9,OR('[1]Input-Output Data'!$J9<'[1]Input-Output Data'!$N9,'[1]Input-Output Data'!$J9='[1]Input-Output Data'!$N9))),'[1]TABLE DATA'!O$9,IF(AND(AND($I9>'[1]TABLE DATA'!$D$7,OR($I9<'[1]TABLE DATA'!$D$8,$I9='[1]TABLE DATA'!$D$8)),$J9>'[1]Input-Output Data'!$N9),\"SIGN TOO WIDE\",IF(AND(AND($I9>'[1]TABLE DATA'!$D$8,OR($I9<'[1]TABLE DATA'!$D$9,$I9='[1]TABLE DATA'!$D$9)),'[1]Input-Output Data'!$J9<'[1]Input-Output Data'!$K9),'[1]TABLE DATA'!O$9,\"SIGN TOO WIDE\"))))))))))","v":0.5},"I"]
[null,null,null,72,60,"Square","II",36,30,38,{"$f":"IF(OR(I10<'[1]TABLE DATA'!$D$7,I10='[1]TABLE DATA'!$D$7),717.75/I10,IF(AND('[1]TABLE DATA'!$D$7<I10,OR(I10<'[1]TABLE DATA'!$D$8,I10='[1]TABLE DATA'!$D$8)),1695/I10,IF(AND('[1]TABLE DATA'!$D$8<I10,OR(I10<'[1]TABLE DATA'!$D$9,I10='[1]TABLE DATA'!$D$9)),2268/I10,IF(I10=\"Arm Too Long\", \"Reduce V or W\",\"Sign Too Wide\"))))","v":56.5},{"$f":"717.75/'[1]Input-Output Data'!I10","v":23.93},56.5,75.599999999999994,{"$f":"IF(I10=\"Arm Too Long\", \"Reduce V or W\",IF($I10>'[1]TABLE DATA'!$D$9,\"SIGN TOO LARGE\",IF(AND(OR($I10<'[1]TABLE DATA'!$D$7,$I10='[1]TABLE DATA'!$D$7),OR('[1]Input-Output Data'!$J10<'[1]Input-Output Data'!$K10,'[1]Input-Output Data'!$J10='[1]Input-Output Data'!$K10)),'[1]TABLE DATA'!F$7,IF(AND(OR($I10<'[1]TABLE DATA'!$D$7,$I10='[1]TABLE DATA'!$D$7),AND($J10>$L10),OR('[1]Input-Output Data'!$J10<'[1]Input-Output Data'!$M10,'[1]Input-Output Data'!$J10='[1]Input-Output Data'!$M10)),'[1]TABLE DATA'!F$8,IF(AND(OR($I10<'[1]TABLE DATA'!$D$7,$I10='[1]TABLE DATA'!$D$7),AND($J10>$M10),OR('[1]Input-Output Data'!$J10<'[1]Input-Output Data'!$N10,'[1]Input-Output Data'!$J10='[1]Input-Output Data'!$N10)),'[1]TABLE DATA'!F$9,IF(AND(OR($I10<'[1]TABLE DATA'!$D$7,$I10='[1]TABLE DATA'!$D$7),$J10>$N10),\"SIGN TOO WIDE\",IF(AND(AND($I10>'[1]TABLE DATA'!$D$7,OR($I10<'[1]TABLE DATA'!$D$8,$I10='[1]TABLE DATA'!$D$8)),'[1]Input-Output Data'!$J10<'[1]Input-Output Data'!$K10),'[1]TABLE DATA'!F$8,IF(AND(AND($I10>'[1]TABLE DATA'!$D$7,OR($I10<'[1]TABLE DATA'!$D$8,$I10='[1]TABLE DATA'!$D$8)),AND('[1]Input-Output Data'!$J10>'[1]Input-Output Data'!$M10,OR('[1]Input-Output Data'!$J10<'[1]Input-Output Data'!$N10,'[1]Input-Output Data'!$J10='[1]Input-Output Data'!$N10))),'[1]TABLE DATA'!F$9,IF(AND(AND($I10>'[1]TABLE DATA'!$D$7,OR($I10<'[1]TABLE DATA'!$D$8,$I10='[1]TABLE DATA'!$D$8)),$J10>'[1]Input-Output Data'!$N10),\"SIGN TOO WIDE\",IF(AND(AND($I10>'[1]TABLE DATA'!$D$8,OR($I10<'[1]TABLE DATA'!$D$9,$I10='[1]TABLE DATA'!$D$9)),'[1]Input-Output Data'!$J10<'[1]Input-Output Data'!$K10),'[1]TABLE DATA'!F$9,\"SIGN TOO WIDE\"))))))))))","v":5},{"$f":"IF(I10=\"Arm Too Long\", \"Reduce V or W\",IF($I10>'[1]TABLE DATA'!$D$9,\"SIGN TOO LARGE\",IF(AND(OR($I10<'[1]TABLE DATA'!$D$7,$I10='[1]TABLE DATA'!$D$7),OR('[1]Input-Output Data'!$J10<'[1]Input-Output Data'!$K10,'[1]Input-Output Data'!$J10='[1]Input-Output Data'!$K10)),'[1]TABLE DATA'!G$7,IF(AND(OR($I10<'[1]TABLE DATA'!$D$7,$I10='[1]TABLE DATA'!$D$7),AND($J10>$L10),OR('[1]Input-Output Data'!$J10<'[1]Input-Output Data'!$M10,'[1]Input-Output Data'!$J10='[1]Input-Output Data'!$M10)),'[1]TABLE DATA'!G$8,IF(AND(OR($I10<'[1]TABLE DATA'!$D$7,$I10='[1]TABLE DATA'!$D$7),AND($J10>$M10),OR('[1]Input-Output Data'!$J10<'[1]Input-Output Data'!$N10,'[1]Input-Output Data'!$J10='[1]Input-Output Data'!$N10)),'[1]TABLE DATA'!G$9,IF(AND(OR($I10<'[1]TABLE DATA'!$D$7,$I10='[1]TABLE DATA'!$D$7),$J10>$N10),\"SIGN TOO WIDE\",IF(AND(AND($I10>'[1]TABLE DATA'!$D$7,OR($I10<'[1]TABLE DATA'!$D$8,$I10='[1]TABLE DATA'!$D$8)),'[1]Input-Output Data'!$J10<'[1]Input-Output Data'!$K10),'[1]TABLE DATA'!G$8,IF(AND(AND($I10>'[1]TABLE DATA'!$D$7,OR($I10<'[1]TABLE DATA'!$D$8,$I10='[1]TABLE DATA'!$D$8)),AND('[1]Input-Output Data'!$J10>'[1]Input-Output Data'!$M10,OR('[1]Input-Output Data'!$J10<'[1]Input-Output Data'!$N10,'[1]Input-Output Data'!$J10='[1]Input-Output Data'!$N10))),'[1]TABLE DATA'!G$9,IF(AND(AND($I10>'[1]TABLE DATA'!$D$7,OR($I10<'[1]TABLE DATA'!$D$8,$I10='[1]TABLE DATA'!$D$8)),$J10>'[1]Input-Output Data'!$N10),\"SIGN TOO WIDE\",IF(AND(AND($I10>'[1]TABLE DATA'!$D$8,OR($I10<'[1]TABLE DATA'!$D$9,$I10='[1]TABLE DATA'!$D$9)),'[1]Input-Output Data'!$J10<'[1]Input-Output Data'!$K10),'[1]TABLE DATA'!G$9,\"SIGN TOO WIDE\"))))))))))","v":3},{"$f":"IF(I10=\"Arm Too Long\", \"Reduce V or W\",IF($I10>'[1]TABLE DATA'!$D$9,\"SIGN TOO LARGE\",IF(AND(OR($I10<'[1]TABLE DATA'!$D$7,$I10='[1]TABLE DATA'!$D$7),OR('[1]Input-Output Data'!$J10<'[1]Input-Output Data'!$K10,'[1]Input-Output Data'!$J10='[1]Input-Output Data'!$K10)),'[1]TABLE DATA'!H$7,IF(AND(OR($I10<'[1]TABLE DATA'!$D$7,$I10='[1]TABLE DATA'!$D$7),AND($J10>$L10),OR('[1]Input-Output Data'!$J10<'[1]Input-Output Data'!$M10,'[1]Input-Output Data'!$J10='[1]Input-Output Data'!$M10)),'[1]TABLE DATA'!H$8,IF(AND(OR($I10<'[1]TABLE DATA'!$D$7,$I10='[1]TABLE DATA'!$D$7),AND($J10>$M10),OR('[1]Input-Output Data'!$J10<'[1]Input-Output Data'!$N10,'[1]Input-Output Data'!$J10='[1]Input-Output Data'!$N10)),'[1]TABLE DATA'!H$9,IF(AND(OR($I10<'[1]TABLE DATA'!$D$7,$I10='[1]TABLE DATA'!$D$7),$J10>$N10),\"SIGN TOO WIDE\",IF(AND(AND($I10>'[1]TABLE DATA'!$D$7,OR($I10<'[1]TABLE DATA'!$D$8,$I10='[1]TABLE DATA'!$D$8)),'[1]Input-Output Data'!$J10<'[1]Input-Output Data'!$K10),'[1]TABLE DATA'!H$8,IF(AND(AND($I10>'[1]TABLE DATA'!$D$7,OR($I10<'[1]TABLE DATA'!$D$8,$I10='[1]TABLE DATA'!$D$8)),AND('[1]Input-Output Data'!$J10>'[1]Input-Output Data'!$M10,OR('[1]Input-Output Data'!$J10<'[1]Input-Output Data'!$N10,'[1]Input-Output Data'!$J10='[1]Input-Output Data'!$N10))),'[1]TABLE DATA'!H$9,IF(AND(AND($I10>'[1]TABLE DATA'!$D$7,OR($I10<'[1]TABLE DATA'!$D$8,$I10='[1]TABLE DATA'!$D$8)),$J10>'[1]Input-Output Data'!$N10),\"SIGN TOO WIDE\",IF(AND(AND($I10>'[1]TABLE DATA'!$D$8,OR($I10<'[1]TABLE DATA'!$D$9,$I10='[1]TABLE DATA'!$D$9)),'[1]Input-Output Data'!$J10<'[1]Input-Output Data'!$K10),'[1]TABLE DATA'!H$9,\"SIGN TOO WIDE\"))))))))))","v":0.875},{"$f":"IF(I10=\"Arm Too Long\", \"Reduce V or W\",IF($I10>'[1]TABLE DATA'!$D$9,\"SIGN TOO LARGE\",IF(AND(OR($I10<'[1]TABLE DATA'!$D$7,$I10='[1]TABLE DATA'!$D$7),OR('[1]Input-Output Data'!$J10<'[1]Input-Output Data'!$K10,'[1]Input-Output Data'!$J10='[1]Input-Output Data'!$K10)),'[1]TABLE DATA'!I$7,IF(AND(OR($I10<'[1]TABLE DATA'!$D$7,$I10='[1]TABLE DATA'!$D$7),AND($J10>$L10),OR('[1]Input-Output Data'!$J10<'[1]Input-Output Data'!$M10,'[1]Input-Output Data'!$J10='[1]Input-Output Data'!$M10)),'[1]TABLE DATA'!I$8,IF(AND(OR($I10<'[1]TABLE DATA'!$D$7,$I10='[1]TABLE DATA'!$D$7),AND($J10>$M10),OR('[1]Input-Output Data'!$J10<'[1]Input-Output Data'!$N10,'[1]Input-Output Data'!$J10='[1]Input-Output Data'!$N10)),'[1]TABLE DATA'!I$9,IF(AND(OR($I10<'[1]TABLE DATA'!$D$7,$I10='[1]TABLE DATA'!$D$7),$J10>$N10),\"SIGN TOO WIDE\",IF(AND(AND($I10>'[1]TABLE DATA'!$D$7,OR($I10<'[1]TABLE DATA'!$D$8,$I10='[1]TABLE DATA'!$D$8)),'[1]Input-Output Data'!$J10<'[1]Input-Output Data'!$K10),'[1]TABLE DATA'!I$8,IF(AND(AND($I10>'[1]TABLE DATA'!$D$7,OR($I10<'[1]TABLE DATA'!$D$8,$I10='[1]TABLE DATA'!$D$8)),AND('[1]Input-Output Data'!$J10>'[1]Input-Output Data'!$M10,OR('[1]Input-Output Data'!$J10<'[1]Input-Output Data'!$N10,'[1]Input-Output Data'!$J10='[1]Input-Output Data'!$N10))),'[1]TABLE DATA'!I$9,IF(AND(AND($I10>'[1]TABLE DATA'!$D$7,OR($I10<'[1]TABLE DATA'!$D$8,$I10='[1]TABLE DATA'!$D$8)),$J10>'[1]Input-Output Data'!$N10),\"SIGN TOO WIDE\",IF(AND(AND($I10>'[1]TABLE DATA'!$D$8,OR($I10<'[1]TABLE DATA'!$D$9,$I10='[1]TABLE DATA'!$D$9)),'[1]Input-Output Data'!$J10<'[1]Input-Output Data'!$K10),'[1]TABLE DATA'!I$9,\"SIGN TOO WIDE\"))))))))))","v":8},{"$f":"IF(I10=\"Arm Too Long\", \"Reduce V or W\",IF($I10>'[1]TABLE DATA'!$D$9,\"SIGN TOO LARGE\",IF(AND(OR($I10<'[1]TABLE DATA'!$D$7,$I10='[1]TABLE DATA'!$D$7),OR('[1]Input-Output Data'!$J10<'[1]Input-Output Data'!$K10,'[1]Input-Output Data'!$J10='[1]Input-Output Data'!$K10)),'[1]TABLE DATA'!J$7,IF(AND(OR($I10<'[1]TABLE DATA'!$D$7,$I10='[1]TABLE DATA'!$D$7),AND($J10>$L10),OR('[1]Input-Output Data'!$J10<'[1]Input-Output Data'!$M10,'[1]Input-Output Data'!$J10='[1]Input-Output Data'!$M10)),'[1]TABLE DATA'!J$8,IF(AND(OR($I10<'[1]TABLE DATA'!$D$7,$I10='[1]TABLE DATA'!$D$7),AND($J10>$M10),OR('[1]Input-Output Data'!$J10<'[1]Input-Output Data'!$N10,'[1]Input-Output Data'!$J10='[1]Input-Output Data'!$N10)),'[1]TABLE DATA'!J$9,IF(AND(OR($I10<'[1]TABLE DATA'!$D$7,$I10='[1]TABLE DATA'!$D$7),$J10>$N10),\"SIGN TOO WIDE\",IF(AND(AND($I10>'[1]TABLE DATA'!$D$7,OR($I10<'[1]TABLE DATA'!$D$8,$I10='[1]TABLE DATA'!$D$8)),'[1]Input-Output Data'!$J10<'[1]Input-Output Data'!$K10),'[1]TABLE DATA'!J$8,IF(AND(AND($I10>'[1]TABLE DATA'!$D$7,OR($I10<'[1]TABLE DATA'!$D$8,$I10='[1]TABLE DATA'!$D$8)),AND('[1]Input-Output Data'!$J10>'[1]Input-Output Data'!$M10,OR('[1]Input-Output Data'!$J10<'[1]Input-Output Data'!$N10,'[1]Input-Output Data'!$J10='[1]Input-Output Data'!$N10))),'[1]TABLE DATA'!J$9,IF(AND(AND($I10>'[1]TABLE DATA'!$D$7,OR($I10<'[1]TABLE DATA'!$D$8,$I10='[1]TABLE DATA'!$D$8)),$J10>'[1]Input-Output Data'!$N10),\"SIGN TOO WIDE\",IF(AND(AND($I10>'[1]TABLE DATA'!$D$8,OR($I10<'[1]TABLE DATA'!$D$9,$I10='[1]TABLE DATA'!$D$9)),'[1]Input-Output Data'!$J10<'[1]Input-Output Data'!$K10),'[1]TABLE DATA'!J$9,\"SIGN TOO WIDE\"))))))))))","v":2},{"$f":"IF(I10=\"Arm Too Long\", \"Reduce V or W\",IF($I10>'[1]TABLE DATA'!$D$9,\"SIGN TOO LARGE\",IF(AND(OR($I10<'[1]TABLE DATA'!$D$7,$I10='[1]TABLE DATA'!$D$7),OR('[1]Input-Output Data'!$J10<'[1]Input-Output Data'!$K10,'[1]Input-Output Data'!$J10='[1]Input-Output Data'!$K10)),'[1]TABLE DATA'!K$7,IF(AND(OR($I10<'[1]TABLE DATA'!$D$7,$I10='[1]TABLE DATA'!$D$7),AND($J10>$L10),OR('[1]Input-Output Data'!$J10<'[1]Input-Output Data'!$M10,'[1]Input-Output Data'!$J10='[1]Input-Output Data'!$M10)),'[1]TABLE DATA'!K$8,IF(AND(OR($I10<'[1]TABLE DATA'!$D$7,$I10='[1]TABLE DATA'!$D$7),AND($J10>$M10),OR('[1]Input-Output Data'!$J10<'[1]Input-Output Data'!$N10,'[1]Input-Output Data'!$J10='[1]Input-Output Data'!$N10)),'[1]TABLE DATA'!K$9,IF(AND(OR($I10<'[1]TABLE DATA'!$D$7,$I10='[1]TABLE DATA'!$D$7),$J10>$N10),\"SIGN TOO WIDE\",IF(AND(AND($I10>'[1]TABLE DATA'!$D$7,OR($I10<'[1]TABLE DATA'!$D$8,$I10='[1]TABLE DATA'!$D$8)),'[1]Input-Output Data'!$J10<'[1]Input-Output Data'!$K10),'[1]TABLE DATA'!K$8,IF(AND(AND($I10>'[1]TABLE DATA'!$D$7,OR($I10<'[1]TABLE DATA'!$D$8,$I10='[1]TABLE DATA'!$D$8)),AND('[1]Input-Output Data'!$J10>'[1]Input-Output Data'!$M10,OR('[1]Input-Output Data'!$J10<'[1]Input-Output Data'!$N10,'[1]Input-Output Data'!$J10='[1]Input-Output Data'!$N10))),'[1]TABLE DATA'!K$9,IF(AND(AND($I10>'[1]TABLE DATA'!$D$7,OR($I10<'[1]TABLE DATA'!$D$8,$I10='[1]TABLE DATA'!$D$8)),$J10>'[1]Input-Output Data'!$N10),\"SIGN TOO WIDE\",IF(AND(AND($I10>'[1]TABLE DATA'!$D$8,OR($I10<'[1]TABLE DATA'!$D$9,$I10='[1]TABLE DATA'!$D$9)),'[1]Input-Output Data'!$J10<'[1]Input-Output Data'!$K10),'[1]TABLE DATA'!K$9,\"SIGN TOO WIDE\"))))))))))","v":80},{"$f":"IF(I10=\"Arm Too Long\", \"Reduce V or W\",IF($I10>'[1]TABLE DATA'!$D$9,\"SIGN TOO LARGE\",IF(AND(OR($I10<'[1]TABLE DATA'!$D$7,$I10='[1]TABLE DATA'!$D$7),OR('[1]Input-Output Data'!$J10<'[1]Input-Output Data'!$K10,'[1]Input-Output Data'!$J10='[1]Input-Output Data'!$K10)),'[1]TABLE DATA'!L$7,IF(AND(OR($I10<'[1]TABLE DATA'!$D$7,$I10='[1]TABLE DATA'!$D$7),AND($J10>$L10),OR('[1]Input-Output Data'!$J10<'[1]Input-Output Data'!$M10,'[1]Input-Output Data'!$J10='[1]Input-Output Data'!$M10)),'[1]TABLE DATA'!L$8,IF(AND(OR($I10<'[1]TABLE DATA'!$D$7,$I10='[1]TABLE DATA'!$D$7),AND($J10>$M10),OR('[1]Input-Output Data'!$J10<'[1]Input-Output Data'!$N10,'[1]Input-Output Data'!$J10='[1]Input-Output Data'!$N10)),'[1]TABLE DATA'!L$9,IF(AND(OR($I10<'[1]TABLE DATA'!$D$7,$I10='[1]TABLE DATA'!$D$7),$J10>$N10),\"SIGN TOO WIDE\",IF(AND(AND($I10>'[1]TABLE DATA'!$D$7,OR($I10<'[1]TABLE DATA'!$D$8,$I10='[1]TABLE DATA'!$D$8)),'[1]Input-Output Data'!$J10<'[1]Input-Output Data'!$K10),'[1]TABLE DATA'!L$8,IF(AND(AND($I10>'[1]TABLE DATA'!$D$7,OR($I10<'[1]TABLE DATA'!$D$8,$I10='[1]TABLE DATA'!$D$8)),AND('[1]Input-Output Data'!$J10>'[1]Input-Output Data'!$M10,OR('[1]Input-Output Data'!$J10<'[1]Input-Output Data'!$N10,'[1]Input-Output Data'!$J10='[1]Input-Output Data'!$N10))),'[1]TABLE DATA'!L$9,IF(AND(AND($I10>'[1]TABLE DATA'!$D$7,OR($I10<'[1]TABLE DATA'!$D$8,$I10='[1]TABLE DATA'!$D$8)),$J10>'[1]Input-Output Data'!$N10),\"SIGN TOO WIDE\",IF(AND(AND($I10>'[1]TABLE DATA'!$D$8,OR($I10<'[1]TABLE DATA'!$D$9,$I10='[1]TABLE DATA'!$D$9)),'[1]Input-Output Data'!$J10<'[1]Input-Output Data'!$K10),'[1]TABLE DATA'!L$9,\"SIGN TOO WIDE\"))))))))))","v":14.5},{"$f":"IF(I10=\"Arm Too Long\", \"Reduce V or W\",IF($I10>'[1]TABLE DATA'!$D$9,\"SIGN TOO LARGE\",IF(AND(OR($I10<'[1]TABLE DATA'!$D$7,$I10='[1]TABLE DATA'!$D$7),OR('[1]Input-Output Data'!$J10<'[1]Input-Output Data'!$K10,'[1]Input-Output Data'!$J10='[1]Input-Output Data'!$K10)),'[1]TABLE DATA'!M$7,IF(AND(OR($I10<'[1]TABLE DATA'!$D$7,$I10='[1]TABLE DATA'!$D$7),AND($J10>$L10),OR('[1]Input-Output Data'!$J10<'[1]Input-Output Data'!$M10,'[1]Input-Output Data'!$J10='[1]Input-Output Data'!$M10)),'[1]TABLE DATA'!M$8,IF(AND(OR($I10<'[1]TABLE DATA'!$D$7,$I10='[1]TABLE DATA'!$D$7),AND($J10>$M10),OR('[1]Input-Output Data'!$J10<'[1]Input-Output Data'!$N10,'[1]Input-Output Data'!$J10='[1]Input-Output Data'!$N10)),'[1]TABLE DATA'!M$9,IF(AND(OR($I10<'[1]TABLE DATA'!$D$7,$I10='[1]TABLE DATA'!$D$7),$J10>$N10),\"SIGN TOO WIDE\",IF(AND(AND($I10>'[1]TABLE DATA'!$D$7,OR($I10<'[1]TABLE DATA'!$D$8,$I10='[1]TABLE DATA'!$D$8)),'[1]Input-Output Data'!$J10<'[1]Input-Output Data'!$K10),'[1]TABLE DATA'!M$8,IF(AND(AND($I10>'[1]TABLE DATA'!$D$7,OR($I10<'[1]TABLE DATA'!$D$8,$I10='[1]TABLE DATA'!$D$8)),AND('[1]Input-Output Data'!$J10>'[1]Input-Output Data'!$M10,OR('[1]Input-Output Data'!$J10<'[1]Input-Output Data'!$N10,'[1]Input-Output Data'!$J10='[1]Input-Output Data'!$N10))),'[1]TABLE DATA'!M$9,IF(AND(AND($I10>'[1]TABLE DATA'!$D$7,OR($I10<'[1]TABLE DATA'!$D$8,$I10='[1]TABLE DATA'!$D$8)),$J10>'[1]Input-Output Data'!$N10),\"SIGN TOO WIDE\",IF(AND(AND($I10>'[1]TABLE DATA'!$D$8,OR($I10<'[1]TABLE DATA'!$D$9,$I10='[1]TABLE DATA'!$D$9)),'[1]Input-Output Data'!$J10<'[1]Input-Output Data'!$K10),'[1]TABLE DATA'!M$9,\"SIGN TOO WIDE\"))))))))))","v":0.625},{"$f":"IF(I10=\"Arm Too Long\", \"Reduce V or W\",IF($I10>'[1]TABLE DATA'!$D$9,\"SIGN TOO LARGE\",IF(AND(OR($I10<'[1]TABLE DATA'!$D$7,$I10='[1]TABLE DATA'!$D$7),OR('[1]Input-Output Data'!$J10<'[1]Input-Output Data'!$K10,'[1]Input-Output Data'!$J10='[1]Input-Output Data'!$K10)),'[1]TABLE DATA'!N$7,IF(AND(OR($I10<'[1]TABLE DATA'!$D$7,$I10='[1]TABLE DATA'!$D$7),AND($J10>$L10),OR('[1]Input-Output Data'!$J10<'[1]Input-Output Data'!$M10,'[1]Input-Output Data'!$J10='[1]Input-Output Data'!$M10)),'[1]TABLE DATA'!N$8,IF(AND(OR($I10<'[1]TABLE DATA'!$D$7,$I10='[1]TABLE DATA'!$D$7),AND($J10>$M10),OR('[1]Input-Output Data'!$J10<'[1]Input-Output Data'!$N10,'[1]Input-Output Data'!$J10='[1]Input-Output Data'!$N10)),'[1]TABLE DATA'!N$9,IF(AND(OR($I10<'[1]TABLE DATA'!$D$7,$I10='[1]TABLE DATA'!$D$7),$J10>$N10),\"SIGN TOO WIDE\",IF(AND(AND($I10>'[1]TABLE DATA'!$D$7,OR($I10<'[1]TABLE DATA'!$D$8,$I10='[1]TABLE DATA'!$D$8)),'[1]Input-Output Data'!$J10<'[1]Input-Output Data'!$K10),'[1]TABLE DATA'!N$8,IF(AND(AND($I10>'[1]TABLE DATA'!$D$7,OR($I10<'[1]TABLE DATA'!$D$8,$I10='[1]TABLE DATA'!$D$8)),AND('[1]Input-Output Data'!$J10>'[1]Input-Output Data'!$M10,OR('[1]Input-Output Data'!$J10<'[1]Input-Output Data'!$N10,'[1]Input-Output Data'!$J10='[1]Input-Output Data'!$N10))),'[1]TABLE DATA'!N$9,IF(AND(AND($I10>'[1]TABLE DATA'!$D$7,OR($I10<'[1]TABLE DATA'!$D$8,$I10='[1]TABLE DATA'!$D$8)),$J10>'[1]Input-Output Data'!$N10),\"SIGN TOO WIDE\",IF(AND(AND($I10>'[1]TABLE DATA'!$D$8,OR($I10<'[1]TABLE DATA'!$D$9,$I10='[1]TABLE DATA'!$D$9)),'[1]Input-Output Data'!$J10<'[1]Input-Output Data'!$K10),'[1]TABLE DATA'!N$9,\"SIGN TOO WIDE\"))))))))))","v":0.625},{"$f":"IF(I10=\"Arm Too Long\", \"Reduce V or W\",IF($I10>'[1]TABLE DATA'!$D$9,\"SIGN TOO LARGE\",IF(AND(OR($I10<'[1]TABLE DATA'!$D$7,$I10='[1]TABLE DATA'!$D$7),OR('[1]Input-Output Data'!$J10<'[1]Input-Output Data'!$K10,'[1]Input-Output Data'!$J10='[1]Input-Output Data'!$K10)),'[1]TABLE DATA'!O$7,IF(AND(OR($I10<'[1]TABLE DATA'!$D$7,$I10='[1]TABLE DATA'!$D$7),AND($J10>$L10),OR('[1]Input-Output Data'!$J10<'[1]Input-Output Data'!$M10,'[1]Input-Output Data'!$J10='[1]Input-Output Data'!$M10)),'[1]TABLE DATA'!O$8,IF(AND(OR($I10<'[1]TABLE DATA'!$D$7,$I10='[1]TABLE DATA'!$D$7),AND($J10>$M10),OR('[1]Input-Output Data'!$J10<'[1]Input-Output Data'!$N10,'[1]Input-Output Data'!$J10='[1]Input-Output Data'!$N10)),'[1]TABLE DATA'!O$9,IF(AND(OR($I10<'[1]TABLE DATA'!$D$7,$I10='[1]TABLE DATA'!$D$7),$J10>$N10),\"SIGN TOO WIDE\",IF(AND(AND($I10>'[1]TABLE DATA'!$D$7,OR($I10<'[1]TABLE DATA'!$D$8,$I10='[1]TABLE DATA'!$D$8)),'[1]Input-Output Data'!$J10<'[1]Input-Output Data'!$K10),'[1]TABLE DATA'!O$8,IF(AND(AND($I10>'[1]TABLE DATA'!$D$7,OR($I10<'[1]TABLE DATA'!$D$8,$I10='[1]TABLE DATA'!$D$8)),AND('[1]Input-Output Data'!$J10>'[1]Input-Output Data'!$M10,OR('[1]Input-Output Data'!$J10<'[1]Input-Output Data'!$N10,'[1]Input-Output Data'!$J10='[1]Input-Output Data'!$N10))),'[1]TABLE DATA'!O$9,IF(AND(AND($I10>'[1]TABLE DATA'!$D$7,OR($I10<'[1]TABLE DATA'!$D$8,$I10='[1]TABLE DATA'!$D$8)),$J10>'[1]Input-Output Data'!$N10),\"SIGN TOO WIDE\",IF(AND(AND($I10>'[1]TABLE DATA'!$D$8,OR($I10<'[1]TABLE DATA'!$D$9,$I10='[1]TABLE DATA'!$D$9)),'[1]Input-Output Data'!$J10<'[1]Input-Output Data'!$K10),'[1]TABLE DATA'!O$9,\"SIGN TOO WIDE\"))))))))))","v":0.625},"II"]
[null,null,null,84,66,"Square","II",39,38.5,44,{"$f":"IF(OR(I11<'[1]TABLE DATA'!$D$7,I11='[1]TABLE DATA'!$D$7),717.75/I11,IF(AND('[1]TABLE DATA'!$D$7<I11,OR(I11<'[1]TABLE DATA'!$D$8,I11='[1]TABLE DATA'!$D$8)),1695/I11,IF(AND('[1]TABLE DATA'!$D$8<I11,OR(I11<'[1]TABLE DATA'!$D$9,I11='[1]TABLE DATA'!$D$9)),2268/I11,IF(I11=\"Arm Too Long\", \"Reduce V or W\",\"Sign Too Wide\"))))","v":44.03},{"$f":"717.75/'[1]Input-Output Data'!I11","v":18.64},44.03,58.91,{"$f":"IF(I11=\"Arm Too Long\", \"Reduce V or W\",IF($I11>'[1]TABLE DATA'!$D$9,\"SIGN TOO LARGE\",IF(AND(OR($I11<'[1]TABLE DATA'!$D$7,$I11='[1]TABLE DATA'!$D$7),OR('[1]Input-Output Data'!$J11<'[1]Input-Output Data'!$K11,'[1]Input-Output Data'!$J11='[1]Input-Output Data'!$K11)),'[1]TABLE DATA'!F$7,IF(AND(OR($I11<'[1]TABLE DATA'!$D$7,$I11='[1]TABLE DATA'!$D$7),AND($J11>$L11),OR('[1]Input-Output Data'!$J11<'[1]Input-Output Data'!$M11,'[1]Input-Output Data'!$J11='[1]Input-Output Data'!$M11)),'[1]TABLE DATA'!F$8,IF(AND(OR($I11<'[1]TABLE DATA'!$D$7,$I11='[1]TABLE DATA'!$D$7),AND($J11>$M11),OR('[1]Input-Output Data'!$J11<'[1]Input-Output Data'!$N11,'[1]Input-Output Data'!$J11='[1]Input-Output Data'!$N11)),'[1]TABLE DATA'!F$9,IF(AND(OR($I11<'[1]TABLE DATA'!$D$7,$I11='[1]TABLE DATA'!$D$7),$J11>$N11),\"SIGN TOO WIDE\",IF(AND(AND($I11>'[1]TABLE DATA'!$D$7,OR($I11<'[1]TABLE DATA'!$D$8,$I11='[1]TABLE DATA'!$D$8)),'[1]Input-Output Data'!$J11<'[1]Input-Output Data'!$K11),'[1]TABLE DATA'!F$8,IF(AND(AND($I11>'[1]TABLE DATA'!$D$7,OR($I11<'[1]TABLE DATA'!$D$8,$I11='[1]TABLE DATA'!$D$8)),AND('[1]Input-Output Data'!$J11>'[1]Input-Output Data'!$M11,OR('[1]Input-Output Data'!$J11<'[1]Input-Output Data'!$N11,'[1]Input-Output Data'!$J11='[1]Input-Output Data'!$N11))),'[1]TABLE DATA'!F$9,IF(AND(AND($I11>'[1]TABLE DATA'!$D$7,OR($I11<'[1]TABLE DATA'!$D$8,$I11='[1]TABLE DATA'!$D$8)),$J11>'[1]Input-Output Data'!$N11),\"SIGN TOO WIDE\",IF(AND(AND($I11>'[1]TABLE DATA'!$D$8,OR($I11<'[1]TABLE DATA'!$D$9,$I11='[1]TABLE DATA'!$D$9)),'[1]Input-Output Data'!$J11<'[1]Input-Output Data'!$K11),'[1]TABLE DATA'!F$9,\"SIGN TOO WIDE\"))))))))))","v":5},{"$f":"IF(I11=\"Arm Too Long\", \"Reduce V or W\",IF($I11>'[1]TABLE DATA'!$D$9,\"SIGN TOO LARGE\",IF(AND(OR($I11<'[1]TABLE DATA'!$D$7,$I11='[1]TABLE DATA'!$D$7),OR('[1]Input-Output Data'!$J11<'[1]Input-Output Data'!$K11,'[1]Input-Output Data'!$J11='[1]Input-Output Data'!$K11)),'[1]TABLE DATA'!G$7,IF(AND(OR($I11<'[1]TABLE DATA'!$D$7,$I11='[1]TABLE DATA'!$D$7),AND($J11>$L11),OR('[1]Input-Output Data'!$J11<'[1]Input-Output Data'!$M11,'[1]Input-Output Data'!$J11='[1]Input-Output Data'!$M11)),'[1]TABLE DATA'!G$8,IF(AND(OR($I11<'[1]TABLE DATA'!$D$7,$I11='[1]TABLE DATA'!$D$7),AND($J11>$M11),OR('[1]Input-Output Data'!$J11<'[1]Input-Output Data'!$N11,'[1]Input-Output Data'!$J11='[1]Input-Output Data'!$N11)),'[1]TABLE DATA'!G$9,IF(AND(OR($I11<'[1]TABLE DATA'!$D$7,$I11='[1]TABLE DATA'!$D$7),$J11>$N11),\"SIGN TOO WIDE\",IF(AND(AND($I11>'[1]TABLE DATA'!$D$7,OR($I11<'[1]TABLE DATA'!$D$8,$I11='[1]TABLE DATA'!$D$8)),'[1]Input-Output Data'!$J11<'[1]Input-Output Data'!$K11),'[1]TABLE DATA'!G$8,IF(AND(AND($I11>'[1]TABLE DATA'!$D$7,OR($I11<'[1]TABLE DATA'!$D$8,$I11='[1]TABLE DATA'!$D$8)),AND('[1]Input-Output Data'!$J11>'[1]Input-Output Data'!$M11,OR('[1]Input-Output Data'!$J11<'[1]Input-Output Data'!$N11,'[1]Input-Output Data'!$J11='[1]Input-Output Data'!$N11))),'[1]TABLE DATA'!G$9,IF(AND(AND($I11>'[1]TABLE DATA'!$D$7,OR($I11<'[1]TABLE DATA'!$D$8,$I11='[1]TABLE DATA'!$D$8)),$J11>'[1]Input-Output Data'!$N11),\"SIGN TOO WIDE\",IF(AND(AND($I11>'[1]TABLE DATA'!$D$8,OR($I11<'[1]TABLE DATA'!$D$9,$I11='[1]TABLE DATA'!$D$9)),'[1]Input-Output Data'!$J11<'[1]Input-Output Data'!$K11),'[1]TABLE DATA'!G$9,\"SIGN TOO WIDE\"))))))))))","v":3},{"$f":"IF(I11=\"Arm Too Long\", \"Reduce V or W\",IF($I11>'[1]TABLE DATA'!$D$9,\"SIGN TOO LARGE\",IF(AND(OR($I11<'[1]TABLE DATA'!$D$7,$I11='[1]TABLE DATA'!$D$7),OR('[1]Input-Output Data'!$J11<'[1]Input-Output Data'!$K11,'[1]Input-Output Data'!$J11='[1]Input-Output Data'!$K11)),'[1]TABLE DATA'!H$7,IF(AND(OR($I11<'[1]TABLE DATA'!$D$7,$I11='[1]TABLE DATA'!$D$7),AND($J11>$L11),OR('[1]Input-Output Data'!$J11<'[1]Input-Output Data'!$M11,'[1]Input-Output Data'!$J11='[1]Input-Output Data'!$M11)),'[1]TABLE DATA'!H$8,IF(AND(OR($I11<'[1]TABLE DATA'!$D$7,$I11='[1]TABLE DATA'!$D$7),AND($J11>$M11),OR('[1]Input-Output Data'!$J11<'[1]Input-Output Data'!$N11,'[1]Input-Output Data'!$J11='[1]Input-Output Data'!$N11)),'[1]TABLE DATA'!H$9,IF(AND(OR($I11<'[1]TABLE DATA'!$D$7,$I11='[1]TABLE DATA'!$D$7),$J11>$N11),\"SIGN TOO WIDE\",IF(AND(AND($I11>'[1]TABLE DATA'!$D$7,OR($I11<'[1]TABLE DATA'!$D$8,$I11='[1]TABLE DATA'!$D$8)),'[1]Input-Output Data'!$J11<'[1]Input-Output Data'!$K11),'[1]TABLE DATA'!H$8,IF(AND(AND($I11>'[1]TABLE DATA'!$D$7,OR($I11<'[1]TABLE DATA'!$D$8,$I11='[1]TABLE DATA'!$D$8)),AND('[1]Input-Output Data'!$J11>'[1]Input-Output Data'!$M11,OR('[1]Input-Output Data'!$J11<'[1]Input-Output Data'!$N11,'[1]Input-Output Data'!$J11='[1]Input-Output Data'!$N11))),'[1]TABLE DATA'!H$9,IF(AND(AND($I11>'[1]TABLE DATA'!$D$7,OR($I11<'[1]TABLE DATA'!$D$8,$I11='[1]TABLE DATA'!$D$8)),$J11>'[1]Input-Output Data'!$N11),\"SIGN TOO WIDE\",IF(AND(AND($I11>'[1]TABLE DATA'!$D$8,OR($I11<'[1]TABLE DATA'!$D$9,$I11='[1]TABLE DATA'!$D$9)),'[1]Input-Output Data'!$J11<'[1]Input-Output Data'!$K11),'[1]TABLE DATA'!H$9,\"SIGN TOO WIDE\"))))))))))","v":0.875},{"$f":"IF(I11=\"Arm Too Long\", \"Reduce V or W\",IF($I11>'[1]TABLE DATA'!$D$9,\"SIGN TOO LARGE\",IF(AND(OR($I11<'[1]TABLE DATA'!$D$7,$I11='[1]TABLE DATA'!$D$7),OR('[1]Input-Output Data'!$J11<'[1]Input-Output Data'!$K11,'[1]Input-Output Data'!$J11='[1]Input-Output Data'!$K11)),'[1]TABLE DATA'!I$7,IF(AND(OR($I11<'[1]TABLE DATA'!$D$7,$I11='[1]TABLE DATA'!$D$7),AND($J11>$L11),OR('[1]Input-Output Data'!$J11<'[1]Input-Output Data'!$M11,'[1]Input-Output Data'!$J11='[1]Input-Output Data'!$M11)),'[1]TABLE DATA'!I$8,IF(AND(OR($I11<'[1]TABLE DATA'!$D$7,$I11='[1]TABLE DATA'!$D$7),AND($J11>$M11),OR('[1]Input-Output Data'!$J11<'[1]Input-Output Data'!$N11,'[1]Input-Output Data'!$J11='[1]Input-Output Data'!$N11)),'[1]TABLE DATA'!I$9,IF(AND(OR($I11<'[1]TABLE DATA'!$D$7,$I11='[1]TABLE DATA'!$D$7),$J11>$N11),\"SIGN TOO WIDE\",IF(AND(AND($I11>'[1]TABLE DATA'!$D$7,OR($I11<'[1]TABLE DATA'!$D$8,$I11='[1]TABLE DATA'!$D$8)),'[1]Input-Output Data'!$J11<'[1]Input-Output Data'!$K11),'[1]TABLE DATA'!I$8,IF(AND(AND($I11>'[1]TABLE DATA'!$D$7,OR($I11<'[1]TABLE DATA'!$D$8,$I11='[1]TABLE DATA'!$D$8)),AND('[1]Input-Output Data'!$J11>'[1]Input-Output Data'!$M11,OR('[1]Input-Output Data'!$J11<'[1]Input-Output Data'!$N11,'[1]Input-Output Data'!$J11='[1]Input-Output Data'!$N11))),'[1]TABLE DATA'!I$9,IF(AND(AND($I11>'[1]TABLE DATA'!$D$7,OR($I11<'[1]TABLE DATA'!$D$8,$I11='[1]TABLE DATA'!$D$8)),$J11>'[1]Input-Output Data'!$N11),\"SIGN TOO WIDE\",IF(AND(AND($I11>'[1]TABLE DATA'!$D$8,OR($I11<'[1]TABLE DATA'!$D$9,$I11='[1]TABLE DATA'!$D$9)),'[1]Input-Output Data'!$J11<'[1]Input-Output Data'!$K11),'[1]TABLE DATA'!I$9,\"SIGN TOO WIDE\"))))))))))","v":8},{"$f":"IF(I11=\"Arm Too Long\", \"Reduce V or W\",IF($I11>'[1]TABLE DATA'!$D$9,\"SIGN TOO LARGE\",IF(AND(OR($I11<'[1]TABLE DATA'!$D$7,$I11='[1]TABLE DATA'!$D$7),OR('[1]Input-Output Data'!$J11<'[1]Input-Output Data'!$K11,'[1]Input-Output Data'!$J11='[1]Input-Output Data'!$K11)),'[1]TABLE DATA'!J$7,IF(AND(OR($I11<'[1]TABLE DATA'!$D$7,$I11='[1]TABLE DATA'!$D$7),AND($J11>$L11),OR('[1]Input-Output Data'!$J11<'[1]Input-Output Data'!$M11,'[1]Input-Output Data'!$J11='[1]Input-Output Data'!$M11)),'[1]TABLE DATA'!J$8,IF(AND(OR($I11<'[1]TABLE DATA'!$D$7,$I11='[1]TABLE DATA'!$D$7),AND($J11>$M11),OR('[1]Input-Output Data'!$J11<'[1]Input-Output Data'!$N11,'[1]Input-Output Data'!$J11='[1]Input-Output Data'!$N11)),'[1]TABLE DATA'!J$9,IF(AND(OR($I11<'[1]TABLE DATA'!$D$7,$I11='[1]TABLE DATA'!$D$7),$J11>$N11),\"SIGN TOO WIDE\",IF(AND(AND($I11>'[1]TABLE DATA'!$D$7,OR($I11<'[1]TABLE DATA'!$D$8,$I11='[1]TABLE DATA'!$D$8)),'[1]Input-Output Data'!$J11<'[1]Input-Output Data'!$K11),'[1]TABLE DATA'!J$8,IF(AND(AND($I11>'[1]TABLE DATA'!$D$7,OR($I11<'[1]TABLE DATA'!$D$8,$I11='[1]TABLE DATA'!$D$8)),AND('[1]Input-Output Data'!$J11>'[1]Input-Output Data'!$M11,OR('[1]Input-Output Data'!$J11<'[1]Input-Output Data'!$N11,'[1]Input-Output Data'!$J11='[1]Input-Output Data'!$N11))),'[1]TABLE DATA'!J$9,IF(AND(AND($I11>'[1]TABLE DATA'!$D$7,OR($I11<'[1]TABLE DATA'!$D$8,$I11='[1]TABLE DATA'!$D$8)),$J11>'[1]Input-Output Data'!$N11),\"SIGN TOO WIDE\",IF(AND(AND($I11>'[1]TABLE DATA'!$D$8,OR($I11<'[1]TABLE DATA'!$D$9,$I11='[1]TABLE DATA'!$D$9)),'[1]Input-Output Data'!$J11<'[1]Input-Output Data'!$K11),'[1]TABLE DATA'!J$9,\"SIGN TOO WIDE\"))))))))))","v":2},{"$f":"IF(I11=\"Arm Too Long\", \"Reduce V or W\",IF($I11>'[1]TABLE DATA'!$D$9,\"SIGN TOO LARGE\",IF(AND(OR($I11<'[1]TABLE DATA'!$D$7,$I11='[1]TABLE DATA'!$D$7),OR('[1]Input-Output Data'!$J11<'[1]Input-Output Data'!$K11,'[1]Input-Output Data'!$J11='[1]Input-Output Data'!$K11)),'[1]TABLE DATA'!K$7,IF(AND(OR($I11<'[1]TABLE DATA'!$D$7,$I11='[1]TABLE DATA'!$D$7),AND($J11>$L11),OR('[1]Input-Output Data'!$J11<'[1]Input-Output Data'!$M11,'[1]Input-Output Data'!$J11='[1]Input-Output Data'!$M11)),'[1]TABLE DATA'!K$8,IF(AND(OR($I11<'[1]TABLE DATA'!$D$7,$I11='[1]TABLE DATA'!$D$7),AND($J11>$M11),OR('[1]Input-Output Data'!$J11<'[1]Input-Output Data'!$N11,'[1]Input-Output Data'!$J11='[1]Input-Output Data'!$N11)),'[1]TABLE DATA'!K$9,IF(AND(OR($I11<'[1]TABLE DATA'!$D$7,$I11='[1]TABLE DATA'!$D$7),$J11>$N11),\"SIGN TOO WIDE\",IF(AND(AND($I11>'[1]TABLE DATA'!$D$7,OR($I11<'[1]TABLE DATA'!$D$8,$I11='[1]TABLE DATA'!$D$8)),'[1]Input-Output Data'!$J11<'[1]Input-Output Data'!$K11),'[1]TABLE DATA'!K$8,IF(AND(AND($I11>'[1]TABLE DATA'!$D$7,OR($I11<'[1]TABLE DATA'!$D$8,$I11='[1]TABLE DATA'!$D$8)),AND('[1]Input-Output Data'!$J11>'[1]Input-Output Data'!$M11,OR('[1]Input-Output Data'!$J11<'[1]Input-Output Data'!$N11,'[1]Input-Output Data'!$J11='[1]Input-Output Data'!$N11))),'[1]TABLE DATA'!K$9,IF(AND(AND($I11>'[1]TABLE DATA'!$D$7,OR($I11<'[1]TABLE DATA'!$D$8,$I11='[1]TABLE DATA'!$D$8)),$J11>'[1]Input-Output Data'!$N11),\"SIGN TOO WIDE\",IF(AND(AND($I11>'[1]TABLE DATA'!$D$8,OR($I11<'[1]TABLE DATA'!$D$9,$I11='[1]TABLE DATA'!$D$9)),'[1]Input-Output Data'!$J11<'[1]Input-Output Data'!$K11),'[1]TABLE DATA'!K$9,\"SIGN TOO WIDE\"))))))))))","v":80},{"$f":"IF(I11=\"Arm Too Long\", \"Reduce V or W\",IF($I11>'[1]TABLE DATA'!$D$9,\"SIGN TOO LARGE\",IF(AND(OR($I11<'[1]TABLE DATA'!$D$7,$I11='[1]TABLE DATA'!$D$7),OR('[1]Input-Output Data'!$J11<'[1]Input-Output Data'!$K11,'[1]Input-Output Data'!$J11='[1]Input-Output Data'!$K11)),'[1]TABLE DATA'!L$7,IF(AND(OR($I11<'[1]TABLE DATA'!$D$7,$I11='[1]TABLE DATA'!$D$7),AND($J11>$L11),OR('[1]Input-Output Data'!$J11<'[1]Input-Output Data'!$M11,'[1]Input-Output Data'!$J11='[1]Input-Output Data'!$M11)),'[1]TABLE DATA'!L$8,IF(AND(OR($I11<'[1]TABLE DATA'!$D$7,$I11='[1]TABLE DATA'!$D$7),AND($J11>$M11),OR('[1]Input-Output Data'!$J11<'[1]Input-Output Data'!$N11,'[1]Input-Output Data'!$J11='[1]Input-Output Data'!$N11)),'[1]TABLE DATA'!L$9,IF(AND(OR($I11<'[1]TABLE DATA'!$D$7,$I11='[1]TABLE DATA'!$D$7),$J11>$N11),\"SIGN TOO WIDE\",IF(AND(AND($I11>'[1]TABLE DATA'!$D$7,OR($I11<'[1]TABLE DATA'!$D$8,$I11='[1]TABLE DATA'!$D$8)),'[1]Input-Output Data'!$J11<'[1]Input-Output Data'!$K11),'[1]TABLE DATA'!L$8,IF(AND(AND($I11>'[1]TABLE DATA'!$D$7,OR($I11<'[1]TABLE DATA'!$D$8,$I11='[1]TABLE DATA'!$D$8)),AND('[1]Input-Output Data'!$J11>'[1]Input-Output Data'!$M11,OR('[1]Input-Output Data'!$J11<'[1]Input-Output Data'!$N11,'[1]Input-Output Data'!$J11='[1]Input-Output Data'!$N11))),'[1]TABLE DATA'!L$9,IF(AND(AND($I11>'[1]TABLE DATA'!$D$7,OR($I11<'[1]TABLE DATA'!$D$8,$I11='[1]TABLE DATA'!$D$8)),$J11>'[1]Input-Output Data'!$N11),\"SIGN TOO WIDE\",IF(AND(AND($I11>'[1]TABLE DATA'!$D$8,OR($I11<'[1]TABLE DATA'!$D$9,$I11='[1]TABLE DATA'!$D$9)),'[1]Input-Output Data'!$J11<'[1]Input-Output Data'!$K11),'[1]TABLE DATA'!L$9,\"SIGN TOO WIDE\"))))))))))","v":14.5},{"$f":"IF(I11=\"Arm Too Long\", \"Reduce V or W\",IF($I11>'[1]TABLE DATA'!$D$9,\"SIGN TOO LARGE\",IF(AND(OR($I11<'[1]TABLE DATA'!$D$7,$I11='[1]TABLE DATA'!$D$7),OR('[1]Input-Output Data'!$J11<'[1]Input-Output Data'!$K11,'[1]Input-Output Data'!$J11='[1]Input-Output Data'!$K11)),'[1]TABLE DATA'!M$7,IF(AND(OR($I11<'[1]TABLE DATA'!$D$7,$I11='[1]TABLE DATA'!$D$7),AND($J11>$L11),OR('[1]Input-Output Data'!$J11<'[1]Input-Output Data'!$M11,'[1]Input-Output Data'!$J11='[1]Input-Output Data'!$M11)),'[1]TABLE DATA'!M$8,IF(AND(OR($I11<'[1]TABLE DATA'!$D$7,$I11='[1]TABLE DATA'!$D$7),AND($J11>$M11),OR('[1]Input-Output Data'!$J11<'[1]Input-Output Data'!$N11,'[1]Input-Output Data'!$J11='[1]Input-Output Data'!$N11)),'[1]TABLE DATA'!M$9,IF(AND(OR($I11<'[1]TABLE DATA'!$D$7,$I11='[1]TABLE DATA'!$D$7),$J11>$N11),\"SIGN TOO WIDE\",IF(AND(AND($I11>'[1]TABLE DATA'!$D$7,OR($I11<'[1]TABLE DATA'!$D$8,$I11='[1]TABLE DATA'!$D$8)),'[1]Input-Output Data'!$J11<'[1]Input-Output Data'!$K11),'[1]TABLE DATA'!M$8,IF(AND(AND($I11>'[1]TABLE DATA'!$D$7,OR($I11<'[1]TABLE DATA'!$D$8,$I11='[1]TABLE DATA'!$D$8)),AND('[1]Input-Output Data'!$J11>'[1]Input-Output Data'!$M11,OR('[1]Input-Output Data'!$J11<'[1]Input-Output Data'!$N11,'[1]Input-Output Data'!$J11='[1]Input-Output Data'!$N11))),'[1]TABLE DATA'!M$9,IF(AND(AND($I11>'[1]TABLE DATA'!$D$7,OR($I11<'[1]TABLE DATA'!$D$8,$I11='[1]TABLE DATA'!$D$8)),$J11>'[1]Input-Output Data'!$N11),\"SIGN TOO WIDE\",IF(AND(AND($I11>'[1]TABLE DATA'!$D$8,OR($I11<'[1]TABLE DATA'!$D$9,$I11='[1]TABLE DATA'!$D$9)),'[1]Input-Output Data'!$J11<'[1]Input-Output Data'!$K11),'[1]TABLE DATA'!M$9,\"SIGN TOO WIDE\"))))))))))","v":0.625},{"$f":"IF(I11=\"Arm Too Long\", \"Reduce V or W\",IF($I11>'[1]TABLE DATA'!$D$9,\"SIGN TOO LARGE\",IF(AND(OR($I11<'[1]TABLE DATA'!$D$7,$I11='[1]TABLE DATA'!$D$7),OR('[1]Input-Output Data'!$J11<'[1]Input-Output Data'!$K11,'[1]Input-Output Data'!$J11='[1]Input-Output Data'!$K11)),'[1]TABLE DATA'!N$7,IF(AND(OR($I11<'[1]TABLE DATA'!$D$7,$I11='[1]TABLE DATA'!$D$7),AND($J11>$L11),OR('[1]Input-Output Data'!$J11<'[1]Input-Output Data'!$M11,'[1]Input-Output Data'!$J11='[1]Input-Output Data'!$M11)),'[1]TABLE DATA'!N$8,IF(AND(OR($I11<'[1]TABLE DATA'!$D$7,$I11='[1]TABLE DATA'!$D$7),AND($J11>$M11),OR('[1]Input-Output Data'!$J11<'[1]Input-Output Data'!$N11,'[1]Input-Output Data'!$J11='[1]Input-Output Data'!$N11)),'[1]TABLE DATA'!N$9,IF(AND(OR($I11<'[1]TABLE DATA'!$D$7,$I11='[1]TABLE DATA'!$D$7),$J11>$N11),\"SIGN TOO WIDE\",IF(AND(AND($I11>'[1]TABLE DATA'!$D$7,OR($I11<'[1]TABLE DATA'!$D$8,$I11='[1]TABLE DATA'!$D$8)),'[1]Input-Output Data'!$J11<'[1]Input-Output Data'!$K11),'[1]TABLE DATA'!N$8,IF(AND(AND($I11>'[1]TABLE DATA'!$D$7,OR($I11<'[1]TABLE DATA'!$D$8,$I11='[1]TABLE DATA'!$D$8)),AND('[1]Input-Output Data'!$J11>'[1]Input-Output Data'!$M11,OR('[1]Input-Output Data'!$J11<'[1]Input-Output Data'!$N11,'[1]Input-Output Data'!$J11='[1]Input-Output Data'!$N11))),'[1]TABLE DATA'!N$9,IF(AND(AND($I11>'[1]TABLE DATA'!$D$7,OR($I11<'[1]TABLE DATA'!$D$8,$I11='[1]TABLE DATA'!$D$8)),$J11>'[1]Input-Output Data'!$N11),\"SIGN TOO WIDE\",IF(AND(AND($I11>'[1]TABLE DATA'!$D$8,OR($I11<'[1]TABLE DATA'!$D$9,$I11='[1]TABLE DATA'!$D$9)),'[1]Input-Output Data'!$J11<'[1]Input-Output Data'!$K11),'[1]TABLE DATA'!N$9,\"SIGN TOO WIDE\"))))))))))","v":0.625},{"$f":"IF(I11=\"Arm Too Long\", \"Reduce V or W\",IF($I11>'[1]TABLE DATA'!$D$9,\"SIGN TOO LARGE\",IF(AND(OR($I11<'[1]TABLE DATA'!$D$7,$I11='[1]TABLE DATA'!$D$7),OR('[1]Input-Output Data'!$J11<'[1]Input-Output Data'!$K11,'[1]Input-Output Data'!$J11='[1]Input-Output Data'!$K11)),'[1]TABLE DATA'!O$7,IF(AND(OR($I11<'[1]TABLE DATA'!$D$7,$I11='[1]TABLE DATA'!$D$7),AND($J11>$L11),OR('[1]Input-Output Data'!$J11<'[1]Input-Output Data'!$M11,'[1]Input-Output Data'!$J11='[1]Input-Output Data'!$M11)),'[1]TABLE DATA'!O$8,IF(AND(OR($I11<'[1]TABLE DATA'!$D$7,$I11='[1]TABLE DATA'!$D$7),AND($J11>$M11),OR('[1]Input-Output Data'!$J11<'[1]Input-Output Data'!$N11,'[1]Input-Output Data'!$J11='[1]Input-Output Data'!$N11)),'[1]TABLE DATA'!O$9,IF(AND(OR($I11<'[1]TABLE DATA'!$D$7,$I11='[1]TABLE DATA'!$D$7),$J11>$N11),\"SIGN TOO WIDE\",IF(AND(AND($I11>'[1]TABLE DATA'!$D$7,OR($I11<'[1]TABLE DATA'!$D$8,$I11='[1]TABLE DATA'!$D$8)),'[1]Input-Output Data'!$J11<'[1]Input-Output Data'!$K11),'[1]TABLE DATA'!O$8,IF(AND(AND($I11>'[1]TABLE DATA'!$D$7,OR($I11<'[1]TABLE DATA'!$D$8,$I11='[1]TABLE DATA'!$D$8)),AND('[1]Input-Output Data'!$J11>'[1]Input-Output Data'!$M11,OR('[1]Input-Output Data'!$J11<'[1]Input-Output Data'!$N11,'[1]Input-Output Data'!$J11='[1]Input-Output Data'!$N11))),'[1]TABLE DATA'!O$9,IF(AND(AND($I11>'[1]TABLE DATA'!$D$7,OR($I11<'[1]TABLE DATA'!$D$8,$I11='[1]TABLE DATA'!$D$8)),$J11>'[1]Input-Output Data'!$N11),\"SIGN TOO WIDE\",IF(AND(AND($I11>'[1]TABLE DATA'!$D$8,OR($I11<'[1]TABLE DATA'!$D$9,$I11='[1]TABLE DATA'!$D$9)),'[1]Input-Output Data'!$J11<'[1]Input-Output Data'!$K11),'[1]TABLE DATA'!O$9,\"SIGN TOO WIDE\"))))))))))","v":0.625},"II"]
[null,null,null,36,36,"Square","I",21,9,20,{"$f":"IF(OR(I12<'[1]TABLE DATA'!$D$7,I12='[1]TABLE DATA'!$D$7),717.75/I12,IF(AND('[1]TABLE DATA'!$D$7<I12,OR(I12<'[1]TABLE DATA'!$D$8,I12='[1]TABLE DATA'!$D$8)),1695/I12,IF(AND('[1]TABLE DATA'!$D$8<I12,OR(I12<'[1]TABLE DATA'!$D$9,I12='[1]TABLE DATA'!$D$9)),2268/I12,IF(I12=\"Arm Too Long\", \"Reduce V or W\",\"Sign Too Wide\"))))","v":79.75},{"$f":"717.75/'[1]Input-Output Data'!I12","v":79.75},188.33,252,{"$f":"IF(I12=\"Arm Too Long\", \"Reduce V or W\",IF($I12>'[1]TABLE DATA'!$D$9,\"SIGN TOO LARGE\",IF(AND(OR($I12<'[1]TABLE DATA'!$D$7,$I12='[1]TABLE DATA'!$D$7),OR('[1]Input-Output Data'!$J12<'[1]Input-Output Data'!$K12,'[1]Input-Output Data'!$J12='[1]Input-Output Data'!$K12)),'[1]TABLE DATA'!F$7,IF(AND(OR($I12<'[1]TABLE DATA'!$D$7,$I12='[1]TABLE DATA'!$D$7),AND($J12>$L12),OR('[1]Input-Output Data'!$J12<'[1]Input-Output Data'!$M12,'[1]Input-Output Data'!$J12='[1]Input-Output Data'!$M12)),'[1]TABLE DATA'!F$8,IF(AND(OR($I12<'[1]TABLE DATA'!$D$7,$I12='[1]TABLE DATA'!$D$7),AND($J12>$M12),OR('[1]Input-Output Data'!$J12<'[1]Input-Output Data'!$N12,'[1]Input-Output Data'!$J12='[1]Input-Output Data'!$N12)),'[1]TABLE DATA'!F$9,IF(AND(OR($I12<'[1]TABLE DATA'!$D$7,$I12='[1]TABLE DATA'!$D$7),$J12>$N12),\"SIGN TOO WIDE\",IF(AND(AND($I12>'[1]TABLE DATA'!$D$7,OR($I12<'[1]TABLE DATA'!$D$8,$I12='[1]TABLE DATA'!$D$8)),'[1]Input-Output Data'!$J12<'[1]Input-Output Data'!$K12),'[1]TABLE DATA'!F$8,IF(AND(AND($I12>'[1]TABLE DATA'!$D$7,OR($I12<'[1]TABLE DATA'!$D$8,$I12='[1]TABLE DATA'!$D$8)),AND('[1]Input-Output Data'!$J12>'[1]Input-Output Data'!$M12,OR('[1]Input-Output Data'!$J12<'[1]Input-Output Data'!$N12,'[1]Input-Output Data'!$J12='[1]Input-Output Data'!$N12))),'[1]TABLE DATA'!F$9,IF(AND(AND($I12>'[1]TABLE DATA'!$D$7,OR($I12<'[1]TABLE DATA'!$D$8,$I12='[1]TABLE DATA'!$D$8)),$J12>'[1]Input-Output Data'!$N12),\"SIGN TOO WIDE\",IF(AND(AND($I12>'[1]TABLE DATA'!$D$8,OR($I12<'[1]TABLE DATA'!$D$9,$I12='[1]TABLE DATA'!$D$9)),'[1]Input-Output Data'!$J12<'[1]Input-Output Data'!$K12),'[1]TABLE DATA'!F$9,\"SIGN TOO WIDE\"))))))))))","v":4},{"$f":"IF(I12=\"Arm Too Long\", \"Reduce V or W\",IF($I12>'[1]TABLE DATA'!$D$9,\"SIGN TOO LARGE\",IF(AND(OR($I12<'[1]TABLE DATA'!$D$7,$I12='[1]TABLE DATA'!$D$7),OR('[1]Input-Output Data'!$J12<'[1]Input-Output Data'!$K12,'[1]Input-Output Data'!$J12='[1]Input-Output Data'!$K12)),'[1]TABLE DATA'!G$7,IF(AND(OR($I12<'[1]TABLE DATA'!$D$7,$I12='[1]TABLE DATA'!$D$7),AND($J12>$L12),OR('[1]Input-Output Data'!$J12<'[1]Input-Output Data'!$M12,'[1]Input-Output Data'!$J12='[1]Input-Output Data'!$M12)),'[1]TABLE DATA'!G$8,IF(AND(OR($I12<'[1]TABLE DATA'!$D$7,$I12='[1]TABLE DATA'!$D$7),AND($J12>$M12),OR('[1]Input-Output Data'!$J12<'[1]Input-Output Data'!$N12,'[1]Input-Output Data'!$J12='[1]Input-Output Data'!$N12)),'[1]TABLE DATA'!G$9,IF(AND(OR($I12<'[1]TABLE DATA'!$D$7,$I12='[1]TABLE DATA'!$D$7),$J12>$N12),\"SIGN TOO WIDE\",IF(AND(AND($I12>'[1]TABLE DATA'!$D$7,OR($I12<'[1]TABLE DATA'!$D$8,$I12='[1]TABLE DATA'!$D$8)),'[1]Input-Output Data'!$J12<'[1]Input-Output Data'!$K12),'[1]TABLE DATA'!G$8,IF(AND(AND($I12>'[1]TABLE DATA'!$D$7,OR($I12<'[1]TABLE DATA'!$D$8,$I12='[1]TABLE DATA'!$D$8)),AND('[1]Input-Output Data'!$J12>'[1]Input-Output Data'!$M12,OR('[1]Input-Output Data'!$J12<'[1]Input-Output Data'!$N12,'[1]Input-Output Data'!$J12='[1]Input-Output Data'!$N12))),'[1]TABLE DATA'!G$9,IF(AND(AND($I12>'[1]TABLE DATA'!$D$7,OR($I12<'[1]TABLE DATA'!$D$8,$I12='[1]TABLE DATA'!$D$8)),$J12>'[1]Input-Output Data'!$N12),\"SIGN TOO WIDE\",IF(AND(AND($I12>'[1]TABLE DATA'!$D$8,OR($I12<'[1]TABLE DATA'!$D$9,$I12='[1]TABLE DATA'!$D$9)),'[1]Input-Output Data'!$J12<'[1]Input-Output Data'!$K12),'[1]TABLE DATA'!G$9,\"SIGN TOO WIDE\"))))))))))","v":2},{"$f":"IF(I12=\"Arm Too Long\", \"Reduce V or W\",IF($I12>'[1]TABLE DATA'!$D$9,\"SIGN TOO LARGE\",IF(AND(OR($I12<'[1]TABLE DATA'!$D$7,$I12='[1]TABLE DATA'!$D$7),OR('[1]Input-Output Data'!$J12<'[1]Input-Output Data'!$K12,'[1]Input-Output Data'!$J12='[1]Input-Output Data'!$K12)),'[1]TABLE DATA'!H$7,IF(AND(OR($I12<'[1]TABLE DATA'!$D$7,$I12='[1]TABLE DATA'!$D$7),AND($J12>$L12),OR('[1]Input-Output Data'!$J12<'[1]Input-Output Data'!$M12,'[1]Input-Output Data'!$J12='[1]Input-Output Data'!$M12)),'[1]TABLE DATA'!H$8,IF(AND(OR($I12<'[1]TABLE DATA'!$D$7,$I12='[1]TABLE DATA'!$D$7),AND($J12>$M12),OR('[1]Input-Output Data'!$J12<'[1]Input-Output Data'!$N12,'[1]Input-Output Data'!$J12='[1]Input-Output Data'!$N12)),'[1]TABLE DATA'!H$9,IF(AND(OR($I12<'[1]TABLE DATA'!$D$7,$I12='[1]TABLE DATA'!$D$7),$J12>$N12),\"SIGN TOO WIDE\",IF(AND(AND($I12>'[1]TABLE DATA'!$D$7,OR($I12<'[1]TABLE DATA'!$D$8,$I12='[1]TABLE DATA'!$D$8)),'[1]Input-Output Data'!$J12<'[1]Input-Output Data'!$K12),'[1]TABLE DATA'!H$8,IF(AND(AND($I12>'[1]TABLE DATA'!$D$7,OR($I12<'[1]TABLE DATA'!$D$8,$I12='[1]TABLE DATA'!$D$8)),AND('[1]Input-Output Data'!$J12>'[1]Input-Output Data'!$M12,OR('[1]Input-Output Data'!$J12<'[1]Input-Output Data'!$N12,'[1]Input-Output Data'!$J12='[1]Input-Output Data'!$N12))),'[1]TABLE DATA'!H$9,IF(AND(AND($I12>'[1]TABLE DATA'!$D$7,OR($I12<'[1]TABLE DATA'!$D$8,$I12='[1]TABLE DATA'!$D$8)),$J12>'[1]Input-Output Data'!$N12),\"SIGN TOO WIDE\",IF(AND(AND($I12>'[1]TABLE DATA'!$D$8,OR($I12<'[1]TABLE DATA'!$D$9,$I12='[1]TABLE DATA'!$D$9)),'[1]Input-Output Data'!$J12<'[1]Input-Output Data'!$K12),'[1]TABLE DATA'!H$9,\"SIGN TOO WIDE\"))))))))))","v":0.625},{"$f":"IF(I12=\"Arm Too Long\", \"Reduce V or W\",IF($I12>'[1]TABLE DATA'!$D$9,\"SIGN TOO LARGE\",IF(AND(OR($I12<'[1]TABLE DATA'!$D$7,$I12='[1]TABLE DATA'!$D$7),OR('[1]Input-Output Data'!$J12<'[1]Input-Output Data'!$K12,'[1]Input-Output Data'!$J12='[1]Input-Output Data'!$K12)),'[1]TABLE DATA'!I$7,IF(AND(OR($I12<'[1]TABLE DATA'!$D$7,$I12='[1]TABLE DATA'!$D$7),AND($J12>$L12),OR('[1]Input-Output Data'!$J12<'[1]Input-Output Data'!$M12,'[1]Input-Output Data'!$J12='[1]Input-Output Data'!$M12)),'[1]TABLE DATA'!I$8,IF(AND(OR($I12<'[1]TABLE DATA'!$D$7,$I12='[1]TABLE DATA'!$D$7),AND($J12>$M12),OR('[1]Input-Output Data'!$J12<'[1]Input-Output Data'!$N12,'[1]Input-Output Data'!$J12='[1]Input-Output Data'!$N12)),'[1]TABLE DATA'!I$9,IF(AND(OR($I12<'[1]TABLE DATA'!$D$7,$I12='[1]TABLE DATA'!$D$7),$J12>$N12),\"SIGN TOO WIDE\",IF(AND(AND($I12>'[1]TABLE DATA'!$D$7,OR($I12<'[1]TABLE DATA'!$D$8,$I12='[1]TABLE DATA'!$D$8)),'[1]Input-Output Data'!$J12<'[1]Input-Output Data'!$K12),'[1]TABLE DATA'!I$8,IF(AND(AND($I12>'[1]TABLE DATA'!$D$7,OR($I12<'[1]TABLE DATA'!$D$8,$I12='[1]TABLE DATA'!$D$8)),AND('[1]Input-Output Data'!$J12>'[1]Input-Output Data'!$M12,OR('[1]Input-Output Data'!$J12<'[1]Input-Output Data'!$N12,'[1]Input-Output Data'!$J12='[1]Input-Output Data'!$N12))),'[1]TABLE DATA'!I$9,IF(AND(AND($I12>'[1]TABLE DATA'!$D$7,OR($I12<'[1]TABLE DATA'!$D$8,$I12='[1]TABLE DATA'!$D$8)),$J12>'[1]Input-Output Data'!$N12),\"SIGN TOO WIDE\",IF(AND(AND($I12>'[1]TABLE DATA'!$D$8,OR($I12<'[1]TABLE DATA'!$D$9,$I12='[1]TABLE DATA'!$D$9)),'[1]Input-Output Data'!$J12<'[1]Input-Output Data'!$K12),'[1]TABLE DATA'!I$9,\"SIGN TOO WIDE\"))))))))))","v":5.625},{"$f":"IF(I12=\"Arm Too Long\", \"Reduce V or W\",IF($I12>'[1]TABLE DATA'!$D$9,\"SIGN TOO LARGE\",IF(AND(OR($I12<'[1]TABLE DATA'!$D$7,$I12='[1]TABLE DATA'!$D$7),OR('[1]Input-Output Data'!$J12<'[1]Input-Output Data'!$K12,'[1]Input-Output Data'!$J12='[1]Input-Output Data'!$K12)),'[1]TABLE DATA'!J$7,IF(AND(OR($I12<'[1]TABLE DATA'!$D$7,$I12='[1]TABLE DATA'!$D$7),AND($J12>$L12),OR('[1]Input-Output Data'!$J12<'[1]Input-Output Data'!$M12,'[1]Input-Output Data'!$J12='[1]Input-Output Data'!$M12)),'[1]TABLE DATA'!J$8,IF(AND(OR($I12<'[1]TABLE DATA'!$D$7,$I12='[1]TABLE DATA'!$D$7),AND($J12>$M12),OR('[1]Input-Output Data'!$J12<'[1]Input-Output Data'!$N12,'[1]Input-Output Data'!$J12='[1]Input-Output Data'!$N12)),'[1]TABLE DATA'!J$9,IF(AND(OR($I12<'[1]TABLE DATA'!$D$7,$I12='[1]TABLE DATA'!$D$7),$J12>$N12),\"SIGN TOO WIDE\",IF(AND(AND($I12>'[1]TABLE DATA'!$D$7,OR($I12<'[1]TABLE DATA'!$D$8,$I12='[1]TABLE DATA'!$D$8)),'[1]Input-Output Data'!$J12<'[1]Input-Output Data'!$K12),'[1]TABLE DATA'!J$8,IF(AND(AND($I12>'[1]TABLE DATA'!$D$7,OR($I12<'[1]TABLE DATA'!$D$8,$I12='[1]TABLE DATA'!$D$8)),AND('[1]Input-Output Data'!$J12>'[1]Input-Output Data'!$M12,OR('[1]Input-Output Data'!$J12<'[1]Input-Output Data'!$N12,'[1]Input-Output Data'!$J12='[1]Input-Output Data'!$N12))),'[1]TABLE DATA'!J$9,IF(AND(AND($I12>'[1]TABLE DATA'!$D$7,OR($I12<'[1]TABLE DATA'!$D$8,$I12='[1]TABLE DATA'!$D$8)),$J12>'[1]Input-Output Data'!$N12),\"SIGN TOO WIDE\",IF(AND(AND($I12>'[1]TABLE DATA'!$D$8,OR($I12<'[1]TABLE DATA'!$D$9,$I12='[1]TABLE DATA'!$D$9)),'[1]Input-Output Data'!$J12<'[1]Input-Output Data'!$K12),'[1]TABLE DATA'!J$9,\"SIGN TOO WIDE\"))))))))))","v":2},{"$f":"IF(I12=\"Arm Too Long\", \"Reduce V or W\",IF($I12>'[1]TABLE DATA'!$D$9,\"SIGN TOO LARGE\",IF(AND(OR($I12<'[1]TABLE DATA'!$D$7,$I12='[1]TABLE DATA'!$D$7),OR('[1]Input-Output Data'!$J12<'[1]Input-Output Data'!$K12,'[1]Input-Output Data'!$J12='[1]Input-Output Data'!$K12)),'[1]TABLE DATA'!K$7,IF(AND(OR($I12<'[1]TABLE DATA'!$D$7,$I12='[1]TABLE DATA'!$D$7),AND($J12>$L12),OR('[1]Input-Output Data'!$J12<'[1]Input-Output Data'!$M12,'[1]Input-Output Data'!$J12='[1]Input-Output Data'!$M12)),'[1]TABLE DATA'!K$8,IF(AND(OR($I12<'[1]TABLE DATA'!$D$7,$I12='[1]TABLE DATA'!$D$7),AND($J12>$M12),OR('[1]Input-Output Data'!$J12<'[1]Input-Output Data'!$N12,'[1]Input-Output Data'!$J12='[1]Input-Output Data'!$N12)),'[1]TABLE DATA'!K$9,IF(AND(OR($I12<'[1]TABLE DATA'!$D$7,$I12='[1]TABLE DATA'!$D$7),$J12>$N12),\"SIGN TOO WIDE\",IF(AND(AND($I12>'[1]TABLE DATA'!$D$7,OR($I12<'[1]TABLE DATA'!$D$8,$I12='[1]TABLE DATA'!$D$8)),'[1]Input-Output Data'!$J12<'[1]Input-Output Data'!$K12),'[1]TABLE DATA'!K$8,IF(AND(AND($I12>'[1]TABLE DATA'!$D$7,OR($I12<'[1]TABLE DATA'!$D$8,$I12='[1]TABLE DATA'!$D$8)),AND('[1]Input-Output Data'!$J12>'[1]Input-Output Data'!$M12,OR('[1]Input-Output Data'!$J12<'[1]Input-Output Data'!$N12,'[1]Input-Output Data'!$J12='[1]Input-Output Data'!$N12))),'[1]TABLE DATA'!K$9,IF(AND(AND($I12>'[1]TABLE DATA'!$D$7,OR($I12<'[1]TABLE DATA'!$D$8,$I12='[1]TABLE DATA'!$D$8)),$J12>'[1]Input-Output Data'!$N12),\"SIGN TOO WIDE\",IF(AND(AND($I12>'[1]TABLE DATA'!$D$8,OR($I12<'[1]TABLE DATA'!$D$9,$I12='[1]TABLE DATA'!$D$9)),'[1]Input-Output Data'!$J12<'[1]Input-Output Data'!$K12),'[1]TABLE DATA'!K$9,\"SIGN TOO WIDE\"))))))))))","v":60},{"$f":"IF(I12=\"Arm Too Long\", \"Reduce V or W\",IF($I12>'[1]TABLE DATA'!$D$9,\"SIGN TOO LARGE\",IF(AND(OR($I12<'[1]TABLE DATA'!$D$7,$I12='[1]TABLE DATA'!$D$7),OR('[1]Input-Output Data'!$J12<'[1]Input-Output Data'!$K12,'[1]Input-Output Data'!$J12='[1]Input-Output Data'!$K12)),'[1]TABLE DATA'!L$7,IF(AND(OR($I12<'[1]TABLE DATA'!$D$7,$I12='[1]TABLE DATA'!$D$7),AND($J12>$L12),OR('[1]Input-Output Data'!$J12<'[1]Input-Output Data'!$M12,'[1]Input-Output Data'!$J12='[1]Input-Output Data'!$M12)),'[1]TABLE DATA'!L$8,IF(AND(OR($I12<'[1]TABLE DATA'!$D$7,$I12='[1]TABLE DATA'!$D$7),AND($J12>$M12),OR('[1]Input-Output Data'!$J12<'[1]Input-Output Data'!$N12,'[1]Input-Output Data'!$J12='[1]Input-Output Data'!$N12)),'[1]TABLE DATA'!L$9,IF(AND(OR($I12<'[1]TABLE DATA'!$D$7,$I12='[1]TABLE DATA'!$D$7),$J12>$N12),\"SIGN TOO WIDE\",IF(AND(AND($I12>'[1]TABLE DATA'!$D$7,OR($I12<'[1]TABLE DATA'!$D$8,$I12='[1]TABLE DATA'!$D$8)),'[1]Input-Output Data'!$J12<'[1]Input-Output Data'!$K12),'[1]TABLE DATA'!L$8,IF(AND(AND($I12>'[1]TABLE DATA'!$D$7,OR($I12<'[1]TABLE DATA'!$D$8,$I12='[1]TABLE DATA'!$D$8)),AND('[1]Input-Output Data'!$J12>'[1]Input-Output Data'!$M12,OR('[1]Input-Output Data'!$J12<'[1]Input-Output Data'!$N12,'[1]Input-Output Data'!$J12='[1]Input-Output Data'!$N12))),'[1]TABLE DATA'!L$9,IF(AND(AND($I12>'[1]TABLE DATA'!$D$7,OR($I12<'[1]TABLE DATA'!$D$8,$I12='[1]TABLE DATA'!$D$8)),$J12>'[1]Input-Output Data'!$N12),\"SIGN TOO WIDE\",IF(AND(AND($I12>'[1]TABLE DATA'!$D$8,OR($I12<'[1]TABLE DATA'!$D$9,$I12='[1]TABLE DATA'!$D$9)),'[1]Input-Output Data'!$J12<'[1]Input-Output Data'!$K12),'[1]TABLE DATA'!L$9,\"SIGN TOO WIDE\"))))))))))","v":7.4},{"$f":"IF(I12=\"Arm Too Long\", \"Reduce V or W\",IF($I12>'[1]TABLE DATA'!$D$9,\"SIGN TOO LARGE\",IF(AND(OR($I12<'[1]TABLE DATA'!$D$7,$I12='[1]TABLE DATA'!$D$7),OR('[1]Input-Output Data'!$J12<'[1]Input-Output Data'!$K12,'[1]Input-Output Data'!$J12='[1]Input-Output Data'!$K12)),'[1]TABLE DATA'!M$7,IF(AND(OR($I12<'[1]TABLE DATA'!$D$7,$I12='[1]TABLE DATA'!$D$7),AND($J12>$L12),OR('[1]Input-Output Data'!$J12<'[1]Input-Output Data'!$M12,'[1]Input-Output Data'!$J12='[1]Input-Output Data'!$M12)),'[1]TABLE DATA'!M$8,IF(AND(OR($I12<'[1]TABLE DATA'!$D$7,$I12='[1]TABLE DATA'!$D$7),AND($J12>$M12),OR('[1]Input-Output Data'!$J12<'[1]Input-Output Data'!$N12,'[1]Input-Output Data'!$J12='[1]Input-Output Data'!$N12)),'[1]TABLE DATA'!M$9,IF(AND(OR($I12<'[1]TABLE DATA'!$D$7,$I12='[1]TABLE DATA'!$D$7),$J12>$N12),\"SIGN TOO WIDE\",IF(AND(AND($I12>'[1]TABLE DATA'!$D$7,OR($I12<'[1]TABLE DATA'!$D$8,$I12='[1]TABLE DATA'!$D$8)),'[1]Input-Output Data'!$J12<'[1]Input-Output Data'!$K12),'[1]TABLE DATA'!M$8,IF(AND(AND($I12>'[1]TABLE DATA'!$D$7,OR($I12<'[1]TABLE DATA'!$D$8,$I12='[1]TABLE DATA'!$D$8)),AND('[1]Input-Output Data'!$J12>'[1]Input-Output Data'!$M12,OR('[1]Input-Output Data'!$J12<'[1]Input-Output Data'!$N12,'[1]Input-Output Data'!$J12='[1]Input-Output Data'!$N12))),'[1]TABLE DATA'!M$9,IF(AND(AND($I12>'[1]TABLE DATA'!$D$7,OR($I12<'[1]TABLE DATA'!$D$8,$I12='[1]TABLE DATA'!$D$8)),$J12>'[1]Input-Output Data'!$N12),\"SIGN TOO WIDE\",IF(AND(AND($I12>'[1]TABLE DATA'!$D$8,OR($I12<'[1]TABLE DATA'!$D$9,$I12='[1]TABLE DATA'!$D$9)),'[1]Input-Output Data'!$J12<'[1]Input-Output Data'!$K12),'[1]TABLE DATA'!M$9,\"SIGN TOO WIDE\"))))))))))","v":0.5},{"$f":"IF(I12=\"Arm Too Long\", \"Reduce V or W\",IF($I12>'[1]TABLE DATA'!$D$9,\"SIGN TOO LARGE\",IF(AND(OR($I12<'[1]TABLE DATA'!$D$7,$I12='[1]TABLE DATA'!$D$7),OR('[1]Input-Output Data'!$J12<'[1]Input-Output Data'!$K12,'[1]Input-Output Data'!$J12='[1]Input-Output Data'!$K12)),'[1]TABLE DATA'!N$7,IF(AND(OR($I12<'[1]TABLE DATA'!$D$7,$I12='[1]TABLE DATA'!$D$7),AND($J12>$L12),OR('[1]Input-Output Data'!$J12<'[1]Input-Output Data'!$M12,'[1]Input-Output Data'!$J12='[1]Input-Output Data'!$M12)),'[1]TABLE DATA'!N$8,IF(AND(OR($I12<'[1]TABLE DATA'!$D$7,$I12='[1]TABLE DATA'!$D$7),AND($J12>$M12),OR('[1]Input-Output Data'!$J12<'[1]Input-Output Data'!$N12,'[1]Input-Output Data'!$J12='[1]Input-Output Data'!$N12)),'[1]TABLE DATA'!N$9,IF(AND(OR($I12<'[1]TABLE DATA'!$D$7,$I12='[1]TABLE DATA'!$D$7),$J12>$N12),\"SIGN TOO WIDE\",IF(AND(AND($I12>'[1]TABLE DATA'!$D$7,OR($I12<'[1]TABLE DATA'!$D$8,$I12='[1]TABLE DATA'!$D$8)),'[1]Input-Output Data'!$J12<'[1]Input-Output Data'!$K12),'[1]TABLE DATA'!N$8,IF(AND(AND($I12>'[1]TABLE DATA'!$D$7,OR($I12<'[1]TABLE DATA'!$D$8,$I12='[1]TABLE DATA'!$D$8)),AND('[1]Input-Output Data'!$J12>'[1]Input-Output Data'!$M12,OR('[1]Input-Output Data'!$J12<'[1]Input-Output Data'!$N12,'[1]Input-Output Data'!$J12='[1]Input-Output Data'!$N12))),'[1]TABLE DATA'!N$9,IF(AND(AND($I12>'[1]TABLE DATA'!$D$7,OR($I12<'[1]TABLE DATA'!$D$8,$I12='[1]TABLE DATA'!$D$8)),$J12>'[1]Input-Output Data'!$N12),\"SIGN TOO WIDE\",IF(AND(AND($I12>'[1]TABLE DATA'!$D$8,OR($I12<'[1]TABLE DATA'!$D$9,$I12='[1]TABLE DATA'!$D$9)),'[1]Input-Output Data'!$J12<'[1]Input-Output Data'!$K12),'[1]TABLE DATA'!N$9,\"SIGN TOO WIDE\"))))))))))","v":0.5},{"$f":"IF(I12=\"Arm Too Long\", \"Reduce V or W\",IF($I12>'[1]TABLE DATA'!$D$9,\"SIGN TOO LARGE\",IF(AND(OR($I12<'[1]TABLE DATA'!$D$7,$I12='[1]TABLE DATA'!$D$7),OR('[1]Input-Output Data'!$J12<'[1]Input-Output Data'!$K12,'[1]Input-Output Data'!$J12='[1]Input-Output Data'!$K12)),'[1]TABLE DATA'!O$7,IF(AND(OR($I12<'[1]TABLE DATA'!$D$7,$I12='[1]TABLE DATA'!$D$7),AND($J12>$L12),OR('[1]Input-Output Data'!$J12<'[1]Input-Output Data'!$M12,'[1]Input-Output Data'!$J12='[1]Input-Output Data'!$M12)),'[1]TABLE DATA'!O$8,IF(AND(OR($I12<'[1]TABLE DATA'!$D$7,$I12='[1]TABLE DATA'!$D$7),AND($J12>$M12),OR('[1]Input-Output Data'!$J12<'[1]Input-Output Data'!$N12,'[1]Input-Output Data'!$J12='[1]Input-Output Data'!$N12)),'[1]TABLE DATA'!O$9,IF(AND(OR($I12<'[1]TABLE DATA'!$D$7,$I12='[1]TABLE DATA'!$D$7),$J12>$N12),\"SIGN TOO WIDE\",IF(AND(AND($I12>'[1]TABLE DATA'!$D$7,OR($I12<'[1]TABLE DATA'!$D$8,$I12='[1]TABLE DATA'!$D$8)),'[1]Input-Output Data'!$J12<'[1]Input-Output Data'!$K12),'[1]TABLE DATA'!O$8,IF(AND(AND($I12>'[1]TABLE DATA'!$D$7,OR($I12<'[1]TABLE DATA'!$D$8,$I12='[1]TABLE DATA'!$D$8)),AND('[1]Input-Output Data'!$J12>'[1]Input-Output Data'!$M12,OR('[1]Input-Output Data'!$J12<'[1]Input-Output Data'!$N12,'[1]Input-Output Data'!$J12='[1]Input-Output Data'!$N12))),'[1]TABLE DATA'!O$9,IF(AND(AND($I12>'[1]TABLE DATA'!$D$7,OR($I12<'[1]TABLE DATA'!$D$8,$I12='[1]TABLE DATA'!$D$8)),$J12>'[1]Input-Output Data'!$N12),\"SIGN TOO WIDE\",IF(AND(AND($I12>'[1]TABLE DATA'!$D$8,OR($I12<'[1]TABLE DATA'!$D$9,$I12='[1]TABLE DATA'!$D$9)),'[1]Input-Output Data'!$J12<'[1]Input-Output Data'!$K12),'[1]TABLE DATA'!O$9,\"SIGN TOO WIDE\"))))))))))","v":0.5},{"$f":"IF(V12=0.5,\"I\",IF(V12=0.625,\"II\",IF(V12=0.75,\"III\",\"N/A\")))","v":"I"}]
[]
[null,null,null,24,12,"Square",{"$f":"Y14","v":"I"},null,{"$f":"(D14*E14+D15*E15+D16*E16)/144","v":8.19},{"$f":"MAX(IF(F14=\"Square\",2+D14/2,2+(SQRT(2)/2)*D14),IF(F15=\"Square\",2+D15/2,2+(SQRT(2)/2)*D15),IF(F16=\"Square\",2+D16/2,2+(SQRT(2)/2)*D16))","v":14},{"$f":"IF(OR(I14<'[1]TABLE DATA'!$D$7,I14='[1]TABLE DATA'!$D$7),717.75/I14,IF(AND('[1]TABLE DATA'!$D$7<I14,OR(I14<'[1]TABLE DATA'!$D$8,I14='[1]TABLE DATA'!$D$8)),1695/I14,IF(AND('[1]TABLE DATA'!$D$8<I14,OR(I14<'[1]TABLE DATA'!$D$9,I14='[1]TABLE DATA'!$D$9)),2268/I14,\"Sign Too Wide\")))","v":87.64},{"$f":"717.75/I14","v":87.64},{"$f":"1695/I14","v":206.96},{"$f":"2268/I14","v":276.92},{"$f":"IF(I5=\"Arm Too Long\", \"Reduce V or W\",IF($I14>'[1]TABLE DATA'!$D$9,\"SIGN TOO LARGE\",IF(AND(OR($I14<'[1]TABLE DATA'!$D$7,$I14='[1]TABLE DATA'!$D$7),OR('[1]Input-Output Data'!$J14<'[1]Input-Output Data'!$K14,'[1]Input-Output Data'!$J14='[1]Input-Output Data'!$K14)),'[1]TABLE DATA'!F$7,IF(AND(OR($I14<'[1]TABLE DATA'!$D$7,$I14='[1]TABLE DATA'!$D$7),AND($J14>$L14),OR('[1]Input-Output Data'!$J14<'[1]Input-Output Data'!$M14,'[1]Input-Output Data'!$J14='[1]Input-Output Data'!$M14)),'[1]TABLE DATA'!F$8,IF(AND(OR($I14<'[1]TABLE DATA'!$D$7,$I14='[1]TABLE DATA'!$D$7),AND($J14>$M14),OR('[1]Input-Output Data'!$J14<'[1]Input-Output Data'!$N14,'[1]Input-Output Data'!$J14='[1]Input-Output Data'!$N14)),'[1]TABLE DATA'!F$9,IF(AND(OR($I14<'[1]TABLE DATA'!$D$7,$I14='[1]TABLE DATA'!$D$7),$J14>$N14),\"SIGN TOO WIDE\",IF(AND(AND($I14>'[1]TABLE DATA'!$D$7,OR($I14<'[1]TABLE DATA'!$D$8,$I14='[1]TABLE DATA'!$D$8)),'[1]Input-Output Data'!$J14<'[1]Input-Output Data'!$K14),'[1]TABLE DATA'!F$8,IF(AND(AND($I14>'[1]TABLE DATA'!$D$7,OR($I14<'[1]TABLE DATA'!$D$8,$I14='[1]TABLE DATA'!$D$8)),AND('[1]Input-Output Data'!$J14>'[1]Input-Output Data'!$M14,OR('[1]Input-Output Data'!$J14<'[1]Input-Output Data'!$N14,'[1]Input-Output Data'!$J14='[1]Input-Output Data'!$N14))),'[1]TABLE DATA'!F$9,IF(AND(AND($I14>'[1]TABLE DATA'!$D$7,OR($I14<'[1]TABLE DATA'!$D$8,$I14='[1]TABLE DATA'!$D$8)),$J14>'[1]Input-Output Data'!$N14),\"SIGN TOO WIDE\",IF(AND(AND($I14>'[1]TABLE DATA'!$D$8,OR($I14<'[1]TABLE DATA'!$D$9,$I14='[1]TABLE DATA'!$D$9)),'[1]Input-Output Data'!$J14<'[1]Input-Output Data'!$K14),'[1]TABLE DATA'!F$9,\"SIGN TOO WIDE\"))))))))))","v":4},{"$f":"IF(I5=\"Arm Too Long\", \"Reduce V or W\",IF($I14>'[1]TABLE DATA'!$D$9,\"SIGN TOO LARGE\",IF(AND(OR($I14<'[1]TABLE DATA'!$D$7,$I14='[1]TABLE DATA'!$D$7),OR('[1]Input-Output Data'!$J14<'[1]Input-Output Data'!$K14,'[1]Input-Output Data'!$J14='[1]Input-Output Data'!$K14)),'[1]TABLE DATA'!G$7,IF(AND(OR($I14<'[1]TABLE DATA'!$D$7,$I14='[1]TABLE DATA'!$D$7),AND($J14>$L14),OR('[1]Input-Output Data'!$J14<'[1]Input-Output Data'!$M14,'[1]Input-Output Data'!$J14='[1]Input-Output Data'!$M14)),'[1]TABLE DATA'!G$8,IF(AND(OR($I14<'[1]TABLE DATA'!$D$7,$I14='[1]TABLE DATA'!$D$7),AND($J14>$M14),OR('[1]Input-Output Data'!$J14<'[1]Input-Output Data'!$N14,'[1]Input-Output Data'!$J14='[1]Input-Output Data'!$N14)),'[1]TABLE DATA'!G$9,IF(AND(OR($I14<'[1]TABLE DATA'!$D$7,$I14='[1]TABLE DATA'!$D$7),$J14>$N14),\"SIGN TOO WIDE\",IF(AND(AND($I14>'[1]TABLE DATA'!$D$7,OR($I14<'[1]TABLE DATA'!$D$8,$I14='[1]TABLE DATA'!$D$8)),'[1]Input-Output Data'!$J14<'[1]Input-Output Data'!$K14),'[1]TABLE DATA'!G$8,IF(AND(AND($I14>'[1]TABLE DATA'!$D$7,OR($I14<'[1]TABLE DATA'!$D$8,$I14='[1]TABLE DATA'!$D$8)),AND('[1]Input-Output Data'!$J14>'[1]Input-Output Data'!$M14,OR('[1]Input-Output Data'!$J14<'[1]Input-Output Data'!$N14,'[1]Input-Output Data'!$J14='[1]Input-Output Data'!$N14))),'[1]TABLE DATA'!G$9,IF(AND(AND($I14>'[1]TABLE DATA'!$D$7,OR($I14<'[1]TABLE DATA'!$D$8,$I14='[1]TABLE DATA'!$D$8)),$J14>'[1]Input-Output Data'!$N14),\"SIGN TOO WIDE\",IF(AND(AND($I14>'[1]TABLE DATA'!$D$8,OR($I14<'[1]TABLE DATA'!$D$9,$I14='[1]TABLE DATA'!$D$9)),'[1]Input-Output Data'!$J14<'[1]Input-Output Data'!$K14),'[1]TABLE DATA'!G$9,\"SIGN TOO WIDE\"))))))))))","v":2},{"$f":"IF(I5=\"Arm Too Long\", \"Reduce V or W\",IF($I14>'[1]TABLE DATA'!$D$9,\"SIGN TOO LARGE\",IF(AND(OR($I14<'[1]TABLE DATA'!$D$7,$I14='[1]TABLE DATA'!$D$7),OR('[1]Input-Output Data'!$J14<'[1]Input-Output Data'!$K14,'[1]Input-Output Data'!$J14='[1]Input-Output Data'!$K14)),'[1]TABLE DATA'!H$7,IF(AND(OR($I14<'[1]TABLE DATA'!$D$7,$I14='[1]TABLE DATA'!$D$7),AND($J14>$L14),OR('[1]Input-Output Data'!$J14<'[1]Input-Output Data'!$M14,'[1]Input-Output Data'!$J14='[1]Input-Output Data'!$M14)),'[1]TABLE DATA'!H$8,IF(AND(OR($I14<'[1]TABLE DATA'!$D$7,$I14='[1]TABLE DATA'!$D$7),AND($J14>$M14),OR('[1]Input-Output Data'!$J14<'[1]Input-Output Data'!$N14,'[1]Input-Output Data'!$J14='[1]Input-Output Data'!$N14)),'[1]TABLE DATA'!H$9,IF(AND(OR($I14<'[1]TABLE DATA'!$D$7,$I14='[1]TABLE DATA'!$D$7),$J14>$N14),\"SIGN TOO WIDE\",IF(AND(AND($I14>'[1]TABLE DATA'!$D$7,OR($I14<'[1]TABLE DATA'!$D$8,$I14='[1]TABLE DATA'!$D$8)),'[1]Input-Output Data'!$J14<'[1]Input-Output Data'!$K14),'[1]TABLE DATA'!H$8,IF(AND(AND($I14>'[1]TABLE DATA'!$D$7,OR($I14<'[1]TABLE DATA'!$D$8,$I14='[1]TABLE DATA'!$D$8)),AND('[1]Input-Output Data'!$J14>'[1]Input-Output Data'!$M14,OR('[1]Input-Output Data'!$J14<'[1]Input-Output Data'!$N14,'[1]Input-Output Data'!$J14='[1]Input-Output Data'!$N14))),'[1]TABLE DATA'!H$9,IF(AND(AND($I14>'[1]TABLE DATA'!$D$7,OR($I14<'[1]TABLE DATA'!$D$8,$I14='[1]TABLE DATA'!$D$8)),$J14>'[1]Input-Output Data'!$N14),\"SIGN TOO WIDE\",IF(AND(AND($I14>'[1]TABLE DATA'!$D$8,OR($I14<'[1]TABLE DATA'!$D$9,$I14='[1]TABLE DATA'!$D$9)),'[1]Input-Output Data'!$J14<'[1]Input-Output Data'!$K14),'[1]TABLE DATA'!H$9,\"SIGN TOO WIDE\"))))))))))","v":0.625},{"$f":"IF(I5=\"Arm Too Long\", \"Reduce V or W\",IF($I14>'[1]TABLE DATA'!$D$9,\"SIGN TOO LARGE\",IF(AND(OR($I14<'[1]TABLE DATA'!$D$7,$I14='[1]TABLE DATA'!$D$7),OR('[1]Input-Output Data'!$J14<'[1]Input-Output Data'!$K14,'[1]Input-Output Data'!$J14='[1]Input-Output Data'!$K14)),'[1]TABLE DATA'!I$7,IF(AND(OR($I14<'[1]TABLE DATA'!$D$7,$I14='[1]TABLE DATA'!$D$7),AND($J14>$L14),OR('[1]Input-Output Data'!$J14<'[1]Input-Output Data'!$M14,'[1]Input-Output Data'!$J14='[1]Input-Output Data'!$M14)),'[1]TABLE DATA'!I$8,IF(AND(OR($I14<'[1]TABLE DATA'!$D$7,$I14='[1]TABLE DATA'!$D$7),AND($J14>$M14),OR('[1]Input-Output Data'!$J14<'[1]Input-Output Data'!$N14,'[1]Input-Output Data'!$J14='[1]Input-Output Data'!$N14)),'[1]TABLE DATA'!I$9,IF(AND(OR($I14<'[1]TABLE DATA'!$D$7,$I14='[1]TABLE DATA'!$D$7),$J14>$N14),\"SIGN TOO WIDE\",IF(AND(AND($I14>'[1]TABLE DATA'!$D$7,OR($I14<'[1]TABLE DATA'!$D$8,$I14='[1]TABLE DATA'!$D$8)),'[1]Input-Output Data'!$J14<'[1]Input-Output Data'!$K14),'[1]TABLE DATA'!I$8,IF(AND(AND($I14>'[1]TABLE DATA'!$D$7,OR($I14<'[1]TABLE DATA'!$D$8,$I14='[1]TABLE DATA'!$D$8)),AND('[1]Input-Output Data'!$J14>'[1]Input-Output Data'!$M14,OR('[1]Input-Output Data'!$J14<'[1]Input-Output Data'!$N14,'[1]Input-Output Data'!$J14='[1]Input-Output Data'!$N14))),'[1]TABLE DATA'!I$9,IF(AND(AND($I14>'[1]TABLE DATA'!$D$7,OR($I14<'[1]TABLE DATA'!$D$8,$I14='[1]TABLE DATA'!$D$8)),$J14>'[1]Input-Output Data'!$N14),\"SIGN TOO WIDE\",IF(AND(AND($I14>'[1]TABLE DATA'!$D$8,OR($I14<'[1]TABLE DATA'!$D$9,$I14='[1]TABLE DATA'!$D$9)),'[1]Input-Output Data'!$J14<'[1]Input-Output Data'!$K14),'[1]TABLE DATA'!I$9,\"SIGN TOO WIDE\"))))))))))","v":5.625},{"$f":"IF(I5=\"Arm Too Long\", \"Reduce V or W\",IF($I14>'[1]TABLE DATA'!$D$9,\"SIGN TOO LARGE\",IF(AND(OR($I14<'[1]TABLE DATA'!$D$7,$I14='[1]TABLE DATA'!$D$7),OR('[1]Input-Output Data'!$J14<'[1]Input-Output Data'!$K14,'[1]Input-Output Data'!$J14='[1]Input-Output Data'!$K14)),'[1]TABLE DATA'!J$7,IF(AND(OR($I14<'[1]TABLE DATA'!$D$7,$I14='[1]TABLE DATA'!$D$7),AND($J14>$L14),OR('[1]Input-Output Data'!$J14<'[1]Input-Output Data'!$M14,'[1]Input-Output Data'!$J14='[1]Input-Output Data'!$M14)),'[1]TABLE DATA'!J$8,IF(AND(OR($I14<'[1]TABLE DATA'!$D$7,$I14='[1]TABLE DATA'!$D$7),AND($J14>$M14),OR('[1]Input-Output Data'!$J14<'[1]Input-Output Data'!$N14,'[1]Input-Output Data'!$J14='[1]Input-Output Data'!$N14)),'[1]TABLE DATA'!J$9,IF(AND(OR($I14<'[1]TABLE DATA'!$D$7,$I14='[1]TABLE DATA'!$D$7),$J14>$N14),\"SIGN TOO WIDE\",IF(AND(AND($I14>'[1]TABLE DATA'!$D$7,OR($I14<'[1]TABLE DATA'!$D$8,$I14='[1]TABLE DATA'!$D$8)),'[1]Input-Output Data'!$J14<'[1]Input-Output Data'!$K14),'[1]TABLE DATA'!J$8,IF(AND(AND($I14>'[1]TABLE DATA'!$D$7,OR($I14<'[1]TABLE DATA'!$D$8,$I14='[1]TABLE DATA'!$D$8)),AND('[1]Input-Output Data'!$J14>'[1]Input-Output Data'!$M14,OR('[1]Input-Output Data'!$J14<'[1]Input-Output Data'!$N14,'[1]Input-Output Data'!$J14='[1]Input-Output Data'!$N14))),'[1]TABLE DATA'!J$9,IF(AND(AND($I14>'[1]TABLE DATA'!$D$7,OR($I14<'[1]TABLE DATA'!$D$8,$I14='[1]TABLE DATA'!$D$8)),$J14>'[1]Input-Output Data'!$N14),\"SIGN TOO WIDE\",IF(AND(AND($I14>'[1]TABLE DATA'!$D$8,OR($I14<'[1]TABLE DATA'!$D$9,$I14='[1]TABLE DATA'!$D$9)),'[1]Input-Output Data'!$J14<'[1]Input-Output Data'!$K14),'[1]TABLE DATA'!J$9,\"SIGN TOO WIDE\"))))))))))","v":2},{"$f":"IF(I5=\"Arm Too Long\", \"Reduce V or W\",IF($I14>'[1]TABLE DATA'!$D$9,\"SIGN TOO LARGE\",IF(AND(OR($I14<'[1]TABLE DATA'!$D$7,$I14='[1]TABLE DATA'!$D$7),OR('[1]Input-Output Data'!$J14<'[1]Input-Output Data'!$K14,'[1]Input-Output Data'!$J14='[1]Input-Output Data'!$K14)),'[1]TABLE DATA'!K$7,IF(AND(OR($I14<'[1]TABLE DATA'!$D$7,$I14='[1]TABLE DATA'!$D$7),AND($J14>$L14),OR('[1]Input-Output Data'!$J14<'[1]Input-Output Data'!$M14,'[1]Input-Output Data'!$J14='[1]Input-Output Data'!$M14)),'[1]TABLE DATA'!K$8,IF(AND(OR($I14<'[1]TABLE DATA'!$D$7,$I14='[1]TABLE DATA'!$D$7),AND($J14>$M14),OR('[1]Input-Output Data'!$J14<'[1]Input-Output Data'!$N14,'[1]Input-Output Data'!$J14='[1]Input-Output Data'!$N14)),'[1]TABLE DATA'!K$9,IF(AND(OR($I14<'[1]TABLE DATA'!$D$7,$I14='[1]TABLE DATA'!$D$7),$J14>$N14),\"SIGN TOO WIDE\",IF(AND(AND($I14>'[1]TABLE DATA'!$D$7,OR($I14<'[1]TABLE DATA'!$D$8,$I14='[1]TABLE DATA'!$D$8)),'[1]Input-Output Data'!$J14<'[1]Input-Output Data'!$K14),'[1]TABLE DATA'!K$8,IF(AND(AND($I14>'[1]TABLE DATA'!$D$7,OR($I14<'[1]TABLE DATA'!$D$8,$I14='[1]TABLE DATA'!$D$8)),AND('[1]Input-Output Data'!$J14>'[1]Input-Output Data'!$M14,OR('[1]Input-Output Data'!$J14<'[1]Input-Output Data'!$N14,'[1]Input-Output Data'!$J14='[1]Input-Output Data'!$N14))),'[1]TABLE DATA'!K$9,IF(AND(AND($I14>'[1]TABLE DATA'!$D$7,OR($I14<'[1]TABLE DATA'!$D$8,$I14='[1]TABLE DATA'!$D$8)),$J14>'[1]Input-Output Data'!$N14),\"SIGN TOO WIDE\",IF(AND(AND($I14>'[1]TABLE DATA'!$D$8,OR($I14<'[1]TABLE DATA'!$D$9,$I14='[1]TABLE DATA'!$D$9)),'[1]Input-Output Data'!$J14<'[1]Input-Output Data'!$K14),'[1]TABLE DATA'!K$9,\"SIGN TOO WIDE\"))))))))))","v":60},{"$f":"IF(I5=\"Arm Too Long\", \"Reduce V or W\",IF($I14>'[1]TABLE DATA'!$D$9,\"SIGN TOO LARGE\",IF(AND(OR($I14<'[1]TABLE DATA'!$D$7,$I14='[1]TABLE DATA'!$D$7),OR('[1]Input-Output Data'!$J14<'[1]Input-Output Data'!$K14,'[1]Input-Output Data'!$J14='[1]Input-Output Data'!$K14)),'[1]TABLE DATA'!L$7,IF(AND(OR($I14<'[1]TABLE DATA'!$D$7,$I14='[1]TABLE DATA'!$D$7),AND($J14>$L14),OR('[1]Input-Output Data'!$J14<'[1]Input-Output Data'!$M14,'[1]Input-Output Data'!$J14='[1]Input-Output Data'!$M14)),'[1]TABLE DATA'!L$8,IF(AND(OR($I14<'[1]TABLE DATA'!$D$7,$I14='[1]TABLE DATA'!$D$7),AND($J14>$M14),OR('[1]Input-Output Data'!$J14<'[1]Input-Output Data'!$N14,'[1]Input-Output Data'!$J14='[1]Input-Output Data'!$N14)),'[1]TABLE DATA'!L$9,IF(AND(OR($I14<'[1]TABLE DATA'!$D$7,$I14='[1]TABLE DATA'!$D$7),$J14>$N14),\"SIGN TOO WIDE\",IF(AND(AND($I14>'[1]TABLE DATA'!$D$7,OR($I14<'[1]TABLE DATA'!$D$8,$I14='[1]TABLE DATA'!$D$8)),'[1]Input-Output Data'!$J14<'[1]Input-Output Data'!$K14),'[1]TABLE DATA'!L$8,IF(AND(AND($I14>'[1]TABLE DATA'!$D$7,OR($I14<'[1]TABLE DATA'!$D$8,$I14='[1]TABLE DATA'!$D$8)),AND('[1]Input-Output Data'!$J14>'[1]Input-Output Data'!$M14,OR('[1]Input-Output Data'!$J14<'[1]Input-Output Data'!$N14,'[1]Input-Output Data'!$J14='[1]Input-Output Data'!$N14))),'[1]TABLE DATA'!L$9,IF(AND(AND($I14>'[1]TABLE DATA'!$D$7,OR($I14<'[1]TABLE DATA'!$D$8,$I14='[1]TABLE DATA'!$D$8)),$J14>'[1]Input-Output Data'!$N14),\"SIGN TOO WIDE\",IF(AND(AND($I14>'[1]TABLE DATA'!$D$8,OR($I14<'[1]TABLE DATA'!$D$9,$I14='[1]TABLE DATA'!$D$9)),'[1]Input-Output Data'!$J14<'[1]Input-Output Data'!$K14),'[1]TABLE DATA'!L$9,\"SIGN TOO WIDE\"))))))))))","v":7.4},{"$f":"IF(I5=\"Arm Too Long\", \"Reduce V or W\",IF($I14>'[1]TABLE DATA'!$D$9,\"SIGN TOO LARGE\",IF(AND(OR($I14<'[1]TABLE DATA'!$D$7,$I14='[1]TABLE DATA'!$D$7),OR('[1]Input-Output Data'!$J14<'[1]Input-Output Data'!$K14,'[1]Input-Output Data'!$J14='[1]Input-Output Data'!$K14)),'[1]TABLE DATA'!M$7,IF(AND(OR($I14<'[1]TABLE DATA'!$D$7,$I14='[1]TABLE DATA'!$D$7),AND($J14>$L14),OR('[1]Input-Output Data'!$J14<'[1]Input-Output Data'!$M14,'[1]Input-Output Data'!$J14='[1]Input-Output Data'!$M14)),'[1]TABLE DATA'!M$8,IF(AND(OR($I14<'[1]TABLE DATA'!$D$7,$I14='[1]TABLE DATA'!$D$7),AND($J14>$M14),OR('[1]Input-Output Data'!$J14<'[1]Input-Output Data'!$N14,'[1]Input-Output Data'!$J14='[1]Input-Output Data'!$N14)),'[1]TABLE DATA'!M$9,IF(AND(OR($I14<'[1]TABLE DATA'!$D$7,$I14='[1]TABLE DATA'!$D$7),$J14>$N14),\"SIGN TOO WIDE\",IF(AND(AND($I14>'[1]TABLE DATA'!$D$7,OR($I14<'[1]TABLE DATA'!$D$8,$I14='[1]TABLE DATA'!$D$8)),'[1]Input-Output Data'!$J14<'[1]Input-Output Data'!$K14),'[1]TABLE DATA'!M$8,IF(AND(AND($I14>'[1]TABLE DATA'!$D$7,OR($I14<'[1]TABLE DATA'!$D$8,$I14='[1]TABLE DATA'!$D$8)),AND('[1]Input-Output Data'!$J14>'[1]Input-Output Data'!$M14,OR('[1]Input-Output Data'!$J14<'[1]Input-Output Data'!$N14,'[1]Input-Output Data'!$J14='[1]Input-Output Data'!$N14))),'[1]TABLE DATA'!M$9,IF(AND(AND($I14>'[1]TABLE DATA'!$D$7,OR($I14<'[1]TABLE DATA'!$D$8,$I14='[1]TABLE DATA'!$D$8)),$J14>'[1]Input-Output Data'!$N14),\"SIGN TOO WIDE\",IF(AND(AND($I14>'[1]TABLE DATA'!$D$8,OR($I14<'[1]TABLE DATA'!$D$9,$I14='[1]TABLE DATA'!$D$9)),'[1]Input-Output Data'!$J14<'[1]Input-Output Data'!$K14),'[1]TABLE DATA'!M$9,\"SIGN TOO WIDE\"))))))))))","v":0.5},{"$f":"IF(I5=\"Arm Too Long\", \"Reduce V or W\",IF($I14>'[1]TABLE DATA'!$D$9,\"SIGN TOO LARGE\",IF(AND(OR($I14<'[1]TABLE DATA'!$D$7,$I14='[1]TABLE DATA'!$D$7),OR('[1]Input-Output Data'!$J14<'[1]Input-Output Data'!$K14,'[1]Input-Output Data'!$J14='[1]Input-Output Data'!$K14)),'[1]TABLE DATA'!N$7,IF(AND(OR($I14<'[1]TABLE DATA'!$D$7,$I14='[1]TABLE DATA'!$D$7),AND($J14>$L14),OR('[1]Input-Output Data'!$J14<'[1]Input-Output Data'!$M14,'[1]Input-Output Data'!$J14='[1]Input-Output Data'!$M14)),'[1]TABLE DATA'!N$8,IF(AND(OR($I14<'[1]TABLE DATA'!$D$7,$I14='[1]TABLE DATA'!$D$7),AND($J14>$M14),OR('[1]Input-Output Data'!$J14<'[1]Input-Output Data'!$N14,'[1]Input-Output Data'!$J14='[1]Input-Output Data'!$N14)),'[1]TABLE DATA'!N$9,IF(AND(OR($I14<'[1]TABLE DATA'!$D$7,$I14='[1]TABLE DATA'!$D$7),$J14>$N14),\"SIGN TOO WIDE\",IF(AND(AND($I14>'[1]TABLE DATA'!$D$7,OR($I14<'[1]TABLE DATA'!$D$8,$I14='[1]TABLE DATA'!$D$8)),'[1]Input-Output Data'!$J14<'[1]Input-Output Data'!$K14),'[1]TABLE DATA'!N$8,IF(AND(AND($I14>'[1]TABLE DATA'!$D$7,OR($I14<'[1]TABLE DATA'!$D$8,$I14='[1]TABLE DATA'!$D$8)),AND('[1]Input-Output Data'!$J14>'[1]Input-Output Data'!$M14,OR('[1]Input-Output Data'!$J14<'[1]Input-Output Data'!$N14,'[1]Input-Output Data'!$J14='[1]Input-Output Data'!$N14))),'[1]TABLE DATA'!N$9,IF(AND(AND($I14>'[1]TABLE DATA'!$D$7,OR($I14<'[1]TABLE DATA'!$D$8,$I14='[1]TABLE DATA'!$D$8)),$J14>'[1]Input-Output Data'!$N14),\"SIGN TOO WIDE\",IF(AND(AND($I14>'[1]TABLE DATA'!$D$8,OR($I14<'[1]TABLE DATA'!$D$9,$I14='[1]TABLE DATA'!$D$9)),'[1]Input-Output Data'!$J14<'[1]Input-Output Data'!$K14),'[1]TABLE DATA'!N$9,\"SIGN TOO WIDE\"))))))))))","v":0.5},{"$f":"IF(I5=\"Arm Too Long\", \"Reduce V or W\",IF($I14>'[1]TABLE DATA'!$D$9,\"SIGN TOO LARGE\",IF(AND(OR($I14<'[1]TABLE DATA'!$D$7,$I14='[1]TABLE DATA'!$D$7),OR('[1]Input-Output Data'!$J14<'[1]Input-Output Data'!$K14,'[1]Input-Output Data'!$J14='[1]Input-Output Data'!$K14)),'[1]TABLE DATA'!O$7,IF(AND(OR($I14<'[1]TABLE DATA'!$D$7,$I14='[1]TABLE DATA'!$D$7),AND($J14>$L14),OR('[1]Input-Output Data'!$J14<'[1]Input-Output Data'!$M14,'[1]Input-Output Data'!$J14='[1]Input-Output Data'!$M14)),'[1]TABLE DATA'!O$8,IF(AND(OR($I14<'[1]TABLE DATA'!$D$7,$I14='[1]TABLE DATA'!$D$7),AND($J14>$M14),OR('[1]Input-Output Data'!$J14<'[1]Input-Output Data'!$N14,'[1]Input-Output Data'!$J14='[1]Input-Output Data'!$N14)),'[1]TABLE DATA'!O$9,IF(AND(OR($I14<'[1]TABLE DATA'!$D$7,$I14='[1]TABLE DATA'!$D$7),$J14>$N14),\"SIGN TOO WIDE\",IF(AND(AND($I14>'[1]TABLE DATA'!$D$7,OR($I14<'[1]TABLE DATA'!$D$8,$I14='[1]TABLE DATA'!$D$8)),'[1]Input-Output Data'!$J14<'[1]Input-Output Data'!$K14),'[1]TABLE DATA'!O$8,IF(AND(AND($I14>'[1]TABLE DATA'!$D$7,OR($I14<'[1]TABLE DATA'!$D$8,$I14='[1]TABLE DATA'!$D$8)),AND('[1]Input-Output Data'!$J14>'[1]Input-Output Data'!$M14,OR('[1]Input-Output Data'!$J14<'[1]Input-Output Data'!$N14,'[1]Input-Output Data'!$J14='[1]Input-Output Data'!$N14))),'[1]TABLE DATA'!O$9,IF(AND(AND($I14>'[1]TABLE DATA'!$D$7,OR($I14<'[1]TABLE DATA'!$D$8,$I14='[1]TABLE DATA'!$D$8)),$J14>'[1]Input-Output Data'!$N14),\"SIGN TOO WIDE\",IF(AND(AND($I14>'[1]TABLE DATA'!$D$8,OR($I14<'[1]TABLE DATA'!$D$9,$I14='[1]TABLE DATA'!$D$9)),'[1]Input-Output Data'!$J14<'[1]Input-Output Data'!$K14),'[1]TABLE DATA'!O$9,\"SIGN TOO WIDE\"))))))))))","v":0.5},{"$f":"IF(V14=0.5,\"I\",IF(V14=0.625,\"II\",IF(V14=0.75,\"III\",\"N/A\")))","v":"I"}]
[null,null,null,24,24,"Square"]
[null,null,null,21,15,"Square"]
[]
[null,null,null,48,48,"Square",{"$f":"Y18","v":"I"},null,{"$f":"(D18*E18+D19*E19)/144","v":20},{"$f":"MAX(IF(F18=\"Square\",2+D18/2,2+(SQRT(2)/2)*D18),IF(F19=\"Square\",2+D19/2,2+(SQRT(2)/2)*D19))","v":26},{"$f":"IF(OR(I18<'[1]TABLE DATA'!$D$7,I18='[1]TABLE DATA'!$D$7),717.75/I18,IF(AND('[1]TABLE DATA'!$D$7<I18,OR(I18<'[1]TABLE DATA'!$D$8,I18='[1]TABLE DATA'!$D$8)),1695/I18,IF(AND('[1]TABLE DATA'!$D$8<I18,OR(I18<'[1]TABLE DATA'!$D$9,I18='[1]TABLE DATA'!$D$9)),2268/I18,\"Sign Too Wide\")))","v":35.89},{"$f":"717.75/I18","v":35.89},{"$f":"1695/I18","v":84.75},{"$f":"2268/I18","v":113.4},{"$f":"IF(I5=\"Arm Too Long\", \"Reduce V or W\",IF($I18>'[1]TABLE DATA'!$D$9,\"SIGN TOO LARGE\",IF(AND(OR($I18<'[1]TABLE DATA'!$D$7,$I18='[1]TABLE DATA'!$D$7),OR('[1]Input-Output Data'!$J18<'[1]Input-Output Data'!$K18,'[1]Input-Output Data'!$J18='[1]Input-Output Data'!$K18)),'[1]TABLE DATA'!F$7,IF(AND(OR($I18<'[1]TABLE DATA'!$D$7,$I18='[1]TABLE DATA'!$D$7),AND($J18>$L18),OR('[1]Input-Output Data'!$J18<'[1]Input-Output Data'!$M18,'[1]Input-Output Data'!$J18='[1]Input-Output Data'!$M18)),'[1]TABLE DATA'!F$8,IF(AND(OR($I18<'[1]TABLE DATA'!$D$7,$I18='[1]TABLE DATA'!$D$7),AND($J18>$M18),OR('[1]Input-Output Data'!$J18<'[1]Input-Output Data'!$N18,'[1]Input-Output Data'!$J18='[1]Input-Output Data'!$N18)),'[1]TABLE DATA'!F$9,IF(AND(OR($I18<'[1]TABLE DATA'!$D$7,$I18='[1]TABLE DATA'!$D$7),$J18>$N18),\"SIGN TOO WIDE\",IF(AND(AND($I18>'[1]TABLE DATA'!$D$7,OR($I18<'[1]TABLE DATA'!$D$8,$I18='[1]TABLE DATA'!$D$8)),'[1]Input-Output Data'!$J18<'[1]Input-Output Data'!$K18),'[1]TABLE DATA'!F$8,IF(AND(AND($I18>'[1]TABLE DATA'!$D$7,OR($I18<'[1]TABLE DATA'!$D$8,$I18='[1]TABLE DATA'!$D$8)),AND('[1]Input-Output Data'!$J18>'[1]Input-Output Data'!$M18,OR('[1]Input-Output Data'!$J18<'[1]Input-Output Data'!$N18,'[1]Input-Output Data'!$J18='[1]Input-Output Data'!$N18))),'[1]TABLE DATA'!F$9,IF(AND(AND($I18>'[1]TABLE DATA'!$D$7,OR($I18<'[1]TABLE DATA'!$D$8,$I18='[1]TABLE DATA'!$D$8)),$J18>'[1]Input-Output Data'!$N18),\"SIGN TOO WIDE\",IF(AND(AND($I18>'[1]TABLE DATA'!$D$8,OR($I18<'[1]TABLE DATA'!$D$9,$I18='[1]TABLE DATA'!$D$9)),'[1]Input-Output Data'!$J18<'[1]Input-Output Data'!$K18),'[1]TABLE DATA'!F$9,\"SIGN TOO WIDE\"))))))))))","v":4},{"$f":"IF(I5=\"Arm Too Long\", \"Reduce V or W\",IF($I18>'[1]TABLE DATA'!$D$9,\"SIGN TOO LARGE\",IF(AND(OR($I18<'[1]TABLE DATA'!$D$7,$I18='[1]TABLE DATA'!$D$7),OR('[1]Input-Output Data'!$J18<'[1]Input-Output Data'!$K18,'[1]Input-Output Data'!$J18='[1]Input-Output Data'!$K18)),'[1]TABLE DATA'!G$7,IF(AND(OR($I18<'[1]TABLE DATA'!$D$7,$I18='[1]TABLE DATA'!$D$7),AND($J18>$L18),OR('[1]Input-Output Data'!$J18<'[1]Input-Output Data'!$M18,'[1]Input-Output Data'!$J18='[1]Input-Output Data'!$M18)),'[1]TABLE DATA'!G$8,IF(AND(OR($I18<'[1]TABLE DATA'!$D$7,$I18='[1]TABLE DATA'!$D$7),AND($J18>$M18),OR('[1]Input-Output Data'!$J18<'[1]Input-Output Data'!$N18,'[1]Input-Output Data'!$J18='[1]Input-Output Data'!$N18)),'[1]TABLE DATA'!G$9,IF(AND(OR($I18<'[1]TABLE DATA'!$D$7,$I18='[1]TABLE DATA'!$D$7),$J18>$N18),\"SIGN TOO WIDE\",IF(AND(AND($I18>'[1]TABLE DATA'!$D$7,OR($I18<'[1]TABLE DATA'!$D$8,$I18='[1]TABLE DATA'!$D$8)),'[1]Input-Output Data'!$J18<'[1]Input-Output Data'!$K18),'[1]TABLE DATA'!G$8,IF(AND(AND($I18>'[1]TABLE DATA'!$D$7,OR($I18<'[1]TABLE DATA'!$D$8,$I18='[1]TABLE DATA'!$D$8)),AND('[1]Input-Output Data'!$J18>'[1]Input-Output Data'!$M18,OR('[1]Input-Output Data'!$J18<'[1]Input-Output Data'!$N18,'[1]Input-Output Data'!$J18='[1]Input-Output Data'!$N18))),'[1]TABLE DATA'!G$9,IF(AND(AND($I18>'[1]TABLE DATA'!$D$7,OR($I18<'[1]TABLE DATA'!$D$8,$I18='[1]TABLE DATA'!$D$8)),$J18>'[1]Input-Output Data'!$N18),\"SIGN TOO WIDE\",IF(AND(AND($I18>'[1]TABLE DATA'!$D$8,OR($I18<'[1]TABLE DATA'!$D$9,$I18='[1]TABLE DATA'!$D$9)),'[1]Input-Output Data'!$J18<'[1]Input-Output Data'!$K18),'[1]TABLE DATA'!G$9,\"SIGN TOO WIDE\"))))))))))","v":2},{"$f":"IF(I5=\"Arm Too Long\", \"Reduce V or W\",IF($I18>'[1]TABLE DATA'!$D$9,\"SIGN TOO LARGE\",IF(AND(OR($I18<'[1]TABLE DATA'!$D$7,$I18='[1]TABLE DATA'!$D$7),OR('[1]Input-Output Data'!$J18<'[1]Input-Output Data'!$K18,'[1]Input-Output Data'!$J18='[1]Input-Output Data'!$K18)),'[1]TABLE DATA'!H$7,IF(AND(OR($I18<'[1]TABLE DATA'!$D$7,$I18='[1]TABLE DATA'!$D$7),AND($J18>$L18),OR('[1]Input-Output Data'!$J18<'[1]Input-Output Data'!$M18,'[1]Input-Output Data'!$J18='[1]Input-Output Data'!$M18)),'[1]TABLE DATA'!H$8,IF(AND(OR($I18<'[1]TABLE DATA'!$D$7,$I18='[1]TABLE DATA'!$D$7),AND($J18>$M18),OR('[1]Input-Output Data'!$J18<'[1]Input-Output Data'!$N18,'[1]Input-Output Data'!$J18='[1]Input-Output Data'!$N18)),'[1]TABLE DATA'!H$9,IF(AND(OR($I18<'[1]TABLE DATA'!$D$7,$I18='[1]TABLE DATA'!$D$7),$J18>$N18),\"SIGN TOO WIDE\",IF(AND(AND($I18>'[1]TABLE DATA'!$D$7,OR($I18<'[1]TABLE DATA'!$D$8,$I18='[1]TABLE DATA'!$D$8)),'[1]Input-Output Data'!$J18<'[1]Input-Output Data'!$K18),'[1]TABLE DATA'!H$8,IF(AND(AND($I18>'[1]TABLE DATA'!$D$7,OR($I18<'[1]TABLE DATA'!$D$8,$I18='[1]TABLE DATA'!$D$8)),AND('[1]Input-Output Data'!$J18>'[1]Input-Output Data'!$M18,OR('[1]Input-Output Data'!$J18<'[1]Input-Output Data'!$N18,'[1]Input-Output Data'!$J18='[1]Input-Output Data'!$N18))),'[1]TABLE DATA'!H$9,IF(AND(AND($I18>'[1]TABLE DATA'!$D$7,OR($I18<'[1]TABLE DATA'!$D$8,$I18='[1]TABLE DATA'!$D$8)),$J18>'[1]Input-Output Data'!$N18),\"SIGN TOO WIDE\",IF(AND(AND($I18>'[1]TABLE DATA'!$D$8,OR($I18<'[1]TABLE DATA'!$D$9,$I18='[1]TABLE DATA'!$D$9)),'[1]Input-Output Data'!$J18<'[1]Input-Output Data'!$K18),'[1]TABLE DATA'!H$9,\"SIGN TOO WIDE\"))))))))))","v":0.625},{"$f":"IF(I5=\"Arm Too Long\", \"Reduce V or W\",IF($I18>'[1]TABLE DATA'!$D$9,\"SIGN TOO LARGE\",IF(AND(OR($I18<'[1]TABLE DATA'!$D$7,$I18='[1]TABLE DATA'!$D$7),OR('[1]Input-Output Data'!$J18<'[1]Input-Output Data'!$K18,'[1]Input-Output Data'!$J18='[1]Input-Output Data'!$K18)),'[1]TABLE DATA'!I$7,IF(AND(OR($I18<'[1]TABLE DATA'!$D$7,$I18='[1]TABLE DATA'!$D$7),AND($J18>$L18),OR('[1]Input-Output Data'!$J18<'[1]Input-Output Data'!$M18,'[1]Input-Output Data'!$J18='[1]Input-Output Data'!$M18)),'[1]TABLE DATA'!I$8,IF(AND(OR($I18<'[1]TABLE DATA'!$D$7,$I18='[1]TABLE DATA'!$D$7),AND($J18>$M18),OR('[1]Input-Output Data'!$J18<'[1]Input-Output Data'!$N18,'[1]Input-Output Data'!$J18='[1]Input-Output Data'!$N18)),'[1]TABLE DATA'!I$9,IF(AND(OR($I18<'[1]TABLE DATA'!$D$7,$I18='[1]TABLE DATA'!$D$7),$J18>$N18),\"SIGN TOO WIDE\",IF(AND(AND($I18>'[1]TABLE DATA'!$D$7,OR($I18<'[1]TABLE DATA'!$D$8,$I18='[1]TABLE DATA'!$D$8)),'[1]Input-Output Data'!$J18<'[1]Input-Output Data'!$K18),'[1]TABLE DATA'!I$8,IF(AND(AND($I18>'[1]TABLE DATA'!$D$7,OR($I18<'[1]TABLE DATA'!$D$8,$I18='[1]TABLE DATA'!$D$8)),AND('[1]Input-Output Data'!$J18>'[1]Input-Output Data'!$M18,OR('[1]Input-Output Data'!$J18<'[1]Input-Output Data'!$N18,'[1]Input-Output Data'!$J18='[1]Input-Output Data'!$N18))),'[1]TABLE DATA'!I$9,IF(AND(AND($I18>'[1]TABLE DATA'!$D$7,OR($I18<'[1]TABLE DATA'!$D$8,$I18='[1]TABLE DATA'!$D$8)),$J18>'[1]Input-Output Data'!$N18),\"SIGN TOO WIDE\",IF(AND(AND($I18>'[1]TABLE DATA'!$D$8,OR($I18<'[1]TABLE DATA'!$D$9,$I18='[1]TABLE DATA'!$D$9)),'[1]Input-Output Data'!$J18<'[1]Input-Output Data'!$K18),'[1]TABLE DATA'!I$9,\"SIGN TOO WIDE\"))))))))))","v":5.625},{"$f":"IF(I5=\"Arm Too Long\", \"Reduce V or W\",IF($I18>'[1]TABLE DATA'!$D$9,\"SIGN TOO LARGE\",IF(AND(OR($I18<'[1]TABLE DATA'!$D$7,$I18='[1]TABLE DATA'!$D$7),OR('[1]Input-Output Data'!$J18<'[1]Input-Output Data'!$K18,'[1]Input-Output Data'!$J18='[1]Input-Output Data'!$K18)),'[1]TABLE DATA'!J$7,IF(AND(OR($I18<'[1]TABLE DATA'!$D$7,$I18='[1]TABLE DATA'!$D$7),AND($J18>$L18),OR('[1]Input-Output Data'!$J18<'[1]Input-Output Data'!$M18,'[1]Input-Output Data'!$J18='[1]Input-Output Data'!$M18)),'[1]TABLE DATA'!J$8,IF(AND(OR($I18<'[1]TABLE DATA'!$D$7,$I18='[1]TABLE DATA'!$D$7),AND($J18>$M18),OR('[1]Input-Output Data'!$J18<'[1]Input-Output Data'!$N18,'[1]Input-Output Data'!$J18='[1]Input-Output Data'!$N18)),'[1]TABLE DATA'!J$9,IF(AND(OR($I18<'[1]TABLE DATA'!$D$7,$I18='[1]TABLE DATA'!$D$7),$J18>$N18),\"SIGN TOO WIDE\",IF(AND(AND($I18>'[1]TABLE DATA'!$D$7,OR($I18<'[1]TABLE DATA'!$D$8,$I18='[1]TABLE DATA'!$D$8)),'[1]Input-Output Data'!$J18<'[1]Input-Output Data'!$K18),'[1]TABLE DATA'!J$8,IF(AND(AND($I18>'[1]TABLE DATA'!$D$7,OR($I18<'[1]TABLE DATA'!$D$8,$I18='[1]TABLE DATA'!$D$8)),AND('[1]Input-Output Data'!$J18>'[1]Input-Output Data'!$M18,OR('[1]Input-Output Data'!$J18<'[1]Input-Output Data'!$N18,'[1]Input-Output Data'!$J18='[1]Input-Output Data'!$N18))),'[1]TABLE DATA'!J$9,IF(AND(AND($I18>'[1]TABLE DATA'!$D$7,OR($I18<'[1]TABLE DATA'!$D$8,$I18='[1]TABLE DATA'!$D$8)),$J18>'[1]Input-Output Data'!$N18),\"SIGN TOO WIDE\",IF(AND(AND($I18>'[1]TABLE DATA'!$D$8,OR($I18<'[1]TABLE DATA'!$D$9,$I18='[1]TABLE DATA'!$D$9)),'[1]Input-Output Data'!$J18<'[1]Input-Output Data'!$K18),'[1]TABLE DATA'!J$9,\"SIGN TOO WIDE\"))))))))))","v":2},{"$f":"IF(I5=\"Arm Too Long\", \"Reduce V or W\",IF($I18>'[1]TABLE DATA'!$D$9,\"SIGN TOO LARGE\",IF(AND(OR($I18<'[1]TABLE DATA'!$D$7,$I18='[1]TABLE DATA'!$D$7),OR('[1]Input-Output Data'!$J18<'[1]Input-Output Data'!$K18,'[1]Input-Output Data'!$J18='[1]Input-Output Data'!$K18)),'[1]TABLE DATA'!K$7,IF(AND(OR($I18<'[1]TABLE DATA'!$D$7,$I18='[1]TABLE DATA'!$D$7),AND($J18>$L18),OR('[1]Input-Output Data'!$J18<'[1]Input-Output Data'!$M18,'[1]Input-Output Data'!$J18='[1]Input-Output Data'!$M18)),'[1]TABLE DATA'!K$8,IF(AND(OR($I18<'[1]TABLE DATA'!$D$7,$I18='[1]TABLE DATA'!$D$7),AND($J18>$M18),OR('[1]Input-Output Data'!$J18<'[1]Input-Output Data'!$N18,'[1]Input-Output Data'!$J18='[1]Input-Output Data'!$N18)),'[1]TABLE DATA'!K$9,IF(AND(OR($I18<'[1]TABLE DATA'!$D$7,$I18='[1]TABLE DATA'!$D$7),$J18>$N18),\"SIGN TOO WIDE\",IF(AND(AND($I18>'[1]TABLE DATA'!$D$7,OR($I18<'[1]TABLE DATA'!$D$8,$I18='[1]TABLE DATA'!$D$8)),'[1]Input-Output Data'!$J18<'[1]Input-Output Data'!$K18),'[1]TABLE DATA'!K$8,IF(AND(AND($I18>'[1]TABLE DATA'!$D$7,OR($I18<'[1]TABLE DATA'!$D$8,$I18='[1]TABLE DATA'!$D$8)),AND('[1]Input-Output Data'!$J18>'[1]Input-Output Data'!$M18,OR('[1]Input-Output Data'!$J18<'[1]Input-Output Data'!$N18,'[1]Input-Output Data'!$J18='[1]Input-Output Data'!$N18))),'[1]TABLE DATA'!K$9,IF(AND(AND($I18>'[1]TABLE DATA'!$D$7,OR($I18<'[1]TABLE DATA'!$D$8,$I18='[1]TABLE DATA'!$D$8)),$J18>'[1]Input-Output Data'!$N18),\"SIGN TOO WIDE\",IF(AND(AND($I18>'[1]TABLE DATA'!$D$8,OR($I18<'[1]TABLE DATA'!$D$9,$I18='[1]TABLE DATA'!$D$9)),'[1]Input-Output Data'!$J18<'[1]Input-Output Data'!$K18),'[1]TABLE DATA'!K$9,\"SIGN TOO WIDE\"))))))))))","v":60},{"$f":"IF(I5=\"Arm Too Long\", \"Reduce V or W\",IF($I18>'[1]TABLE DATA'!$D$9,\"SIGN TOO LARGE\",IF(AND(OR($I18<'[1]TABLE DATA'!$D$7,$I18='[1]TABLE DATA'!$D$7),OR('[1]Input-Output Data'!$J18<'[1]Input-Output Data'!$K18,'[1]Input-Output Data'!$J18='[1]Input-Output Data'!$K18)),'[1]TABLE DATA'!L$7,IF(AND(OR($I18<'[1]TABLE DATA'!$D$7,$I18='[1]TABLE DATA'!$D$7),AND($J18>$L18),OR('[1]Input-Output Data'!$J18<'[1]Input-Output Data'!$M18,'[1]Input-Output Data'!$J18='[1]Input-Output Data'!$M18)),'[1]TABLE DATA'!L$8,IF(AND(OR($I18<'[1]TABLE DATA'!$D$7,$I18='[1]TABLE DATA'!$D$7),AND($J18>$M18),OR('[1]Input-Output Data'!$J18<'[1]Input-Output Data'!$N18,'[1]Input-Output Data'!$J18='[1]Input-Output Data'!$N18)),'[1]TABLE DATA'!L$9,IF(AND(OR($I18<'[1]TABLE DATA'!$D$7,$I18='[1]TABLE DATA'!$D$7),$J18>$N18),\"SIGN TOO WIDE\",IF(AND(AND($I18>'[1]TABLE DATA'!$D$7,OR($I18<'[1]TABLE DATA'!$D$8,$I18='[1]TABLE DATA'!$D$8)),'[1]Input-Output Data'!$J18<'[1]Input-Output Data'!$K18),'[1]TABLE DATA'!L$8,IF(AND(AND($I18>'[1]TABLE DATA'!$D$7,OR($I18<'[1]TABLE DATA'!$D$8,$I18='[1]TABLE DATA'!$D$8)),AND('[1]Input-Output Data'!$J18>'[1]Input-Output Data'!$M18,OR('[1]Input-Output Data'!$J18<'[1]Input-Output Data'!$N18,'[1]Input-Output Data'!$J18='[1]Input-Output Data'!$N18))),'[1]TABLE DATA'!L$9,IF(AND(AND($I18>'[1]TABLE DATA'!$D$7,OR($I18<'[1]TABLE DATA'!$D$8,$I18='[1]TABLE DATA'!$D$8)),$J18>'[1]Input-Output Data'!$N18),\"SIGN TOO WIDE\",IF(AND(AND($I18>'[1]TABLE DATA'!$D$8,OR($I18<'[1]TABLE DATA'!$D$9,$I18='[1]TABLE DATA'!$D$9)),'[1]Input-Output Data'!$J18<'[1]Input-Output Data'!$K18),'[1]TABLE DATA'!L$9,\"SIGN TOO WIDE\"))))))))))","v":7.4},{"$f":"IF(I5=\"Arm Too Long\", \"Reduce V or W\",IF($I18>'[1]TABLE DATA'!$D$9,\"SIGN TOO LARGE\",IF(AND(OR($I18<'[1]TABLE DATA'!$D$7,$I18='[1]TABLE DATA'!$D$7),OR('[1]Input-Output Data'!$J18<'[1]Input-Output Data'!$K18,'[1]Input-Output Data'!$J18='[1]Input-Output Data'!$K18)),'[1]TABLE DATA'!M$7,IF(AND(OR($I18<'[1]TABLE DATA'!$D$7,$I18='[1]TABLE DATA'!$D$7),AND($J18>$L18),OR('[1]Input-Output Data'!$J18<'[1]Input-Output Data'!$M18,'[1]Input-Output Data'!$J18='[1]Input-Output Data'!$M18)),'[1]TABLE DATA'!M$8,IF(AND(OR($I18<'[1]TABLE DATA'!$D$7,$I18='[1]TABLE DATA'!$D$7),AND($J18>$M18),OR('[1]Input-Output Data'!$J18<'[1]Input-Output Data'!$N18,'[1]Input-Output Data'!$J18='[1]Input-Output Data'!$N18)),'[1]TABLE DATA'!M$9,IF(AND(OR($I18<'[1]TABLE DATA'!$D$7,$I18='[1]TABLE DATA'!$D$7),$J18>$N18),\"SIGN TOO WIDE\",IF(AND(AND($I18>'[1]TABLE DATA'!$D$7,OR($I18<'[1]TABLE DATA'!$D$8,$I18='[1]TABLE DATA'!$D$8)),'[1]Input-Output Data'!$J18<'[1]Input-Output Data'!$K18),'[1]TABLE DATA'!M$8,IF(AND(AND($I18>'[1]TABLE DATA'!$D$7,OR($I18<'[1]TABLE DATA'!$D$8,$I18='[1]TABLE DATA'!$D$8)),AND('[1]Input-Output Data'!$J18>'[1]Input-Output Data'!$M18,OR('[1]Input-Output Data'!$J18<'[1]Input-Output Data'!$N18,'[1]Input-Output Data'!$J18='[1]Input-Output Data'!$N18))),'[1]TABLE DATA'!M$9,IF(AND(AND($I18>'[1]TABLE DATA'!$D$7,OR($I18<'[1]TABLE DATA'!$D$8,$I18='[1]TABLE DATA'!$D$8)),$J18>'[1]Input-Output Data'!$N18),\"SIGN TOO WIDE\",IF(AND(AND($I18>'[1]TABLE DATA'!$D$8,OR($I18<'[1]TABLE DATA'!$D$9,$I18='[1]TABLE DATA'!$D$9)),'[1]Input-Output Data'!$J18<'[1]Input-Output Data'!$K18),'[1]TABLE DATA'!M$9,\"SIGN TOO WIDE\"))))))))))","v":0.5},{"$f":"IF(I5=\"Arm Too Long\", \"Reduce V or W\",IF($I18>'[1]TABLE DATA'!$D$9,\"SIGN TOO LARGE\",IF(AND(OR($I18<'[1]TABLE DATA'!$D$7,$I18='[1]TABLE DATA'!$D$7),OR('[1]Input-Output Data'!$J18<'[1]Input-Output Data'!$K18,'[1]Input-Output Data'!$J18='[1]Input-Output Data'!$K18)),'[1]TABLE DATA'!N$7,IF(AND(OR($I18<'[1]TABLE DATA'!$D$7,$I18='[1]TABLE DATA'!$D$7),AND($J18>$L18),OR('[1]Input-Output Data'!$J18<'[1]Input-Output Data'!$M18,'[1]Input-Output Data'!$J18='[1]Input-Output Data'!$M18)),'[1]TABLE DATA'!N$8,IF(AND(OR($I18<'[1]TABLE DATA'!$D$7,$I18='[1]TABLE DATA'!$D$7),AND($J18>$M18),OR('[1]Input-Output Data'!$J18<'[1]Input-Output Data'!$N18,'[1]Input-Output Data'!$J18='[1]Input-Output Data'!$N18)),'[1]TABLE DATA'!N$9,IF(AND(OR($I18<'[1]TABLE DATA'!$D$7,$I18='[1]TABLE DATA'!$D$7),$J18>$N18),\"SIGN TOO WIDE\",IF(AND(AND($I18>'[1]TABLE DATA'!$D$7,OR($I18<'[1]TABLE DATA'!$D$8,$I18='[1]TABLE DATA'!$D$8)),'[1]Input-Output Data'!$J18<'[1]Input-Output Data'!$K18),'[1]TABLE DATA'!N$8,IF(AND(AND($I18>'[1]TABLE DATA'!$D$7,OR($I18<'[1]TABLE DATA'!$D$8,$I18='[1]TABLE DATA'!$D$8)),AND('[1]Input-Output Data'!$J18>'[1]Input-Output Data'!$M18,OR('[1]Input-Output Data'!$J18<'[1]Input-Output Data'!$N18,'[1]Input-Output Data'!$J18='[1]Input-Output Data'!$N18))),'[1]TABLE DATA'!N$9,IF(AND(AND($I18>'[1]TABLE DATA'!$D$7,OR($I18<'[1]TABLE DATA'!$D$8,$I18='[1]TABLE DATA'!$D$8)),$J18>'[1]Input-Output Data'!$N18),\"SIGN TOO WIDE\",IF(AND(AND($I18>'[1]TABLE DATA'!$D$8,OR($I18<'[1]TABLE DATA'!$D$9,$I18='[1]TABLE DATA'!$D$9)),'[1]Input-Output Data'!$J18<'[1]Input-Output Data'!$K18),'[1]TABLE DATA'!N$9,\"SIGN TOO WIDE\"))))))))))","v":0.5},{"$f":"IF(I5=\"Arm Too Long\", \"Reduce V or W\",IF($I18>'[1]TABLE DATA'!$D$9,\"SIGN TOO LARGE\",IF(AND(OR($I18<'[1]TABLE DATA'!$D$7,$I18='[1]TABLE DATA'!$D$7),OR('[1]Input-Output Data'!$J18<'[1]Input-Output Data'!$K18,'[1]Input-Output Data'!$J18='[1]Input-Output Data'!$K18)),'[1]TABLE DATA'!O$7,IF(AND(OR($I18<'[1]TABLE DATA'!$D$7,$I18='[1]TABLE DATA'!$D$7),AND($J18>$L18),OR('[1]Input-Output Data'!$J18<'[1]Input-Output Data'!$M18,'[1]Input-Output Data'!$J18='[1]Input-Output Data'!$M18)),'[1]TABLE DATA'!O$8,IF(AND(OR($I18<'[1]TABLE DATA'!$D$7,$I18='[1]TABLE DATA'!$D$7),AND($J18>$M18),OR('[1]Input-Output Data'!$J18<'[1]Input-Output Data'!$N18,'[1]Input-Output Data'!$J18='[1]Input-Output Data'!$N18)),'[1]TABLE DATA'!O$9,IF(AND(OR($I18<'[1]TABLE DATA'!$D$7,$I18='[1]TABLE DATA'!$D$7),$J18>$N18),\"SIGN TOO WIDE\",IF(AND(AND($I18>'[1]TABLE DATA'!$D$7,OR($I18<'[1]TABLE DATA'!$D$8,$I18='[1]TABLE DATA'!$D$8)),'[1]Input-Output Data'!$J18<'[1]Input-Output Data'!$K18),'[1]TABLE DATA'!O$8,IF(AND(AND($I18>'[1]TABLE DATA'!$D$7,OR($I18<'[1]TABLE DATA'!$D$8,$I18='[1]TABLE DATA'!$D$8)),AND('[1]Input-Output Data'!$J18>'[1]Input-Output Data'!$M18,OR('[1]Input-Output Data'!$J18<'[1]Input-Output Data'!$N18,'[1]Input-Output Data'!$J18='[1]Input-Output Data'!$N18))),'[1]TABLE DATA'!O$9,IF(AND(AND($I18>'[1]TABLE DATA'!$D$7,OR($I18<'[1]TABLE DATA'!$D$8,$I18='[1]TABLE DATA'!$D$8)),$J18>'[1]Input-Output Data'!$N18),\"SIGN TOO WIDE\",IF(AND(AND($I18>'[1]TABLE DATA'!$D$8,OR($I18<'[1]TABLE DATA'!$D$9,$I18='[1]TABLE DATA'!$D$9)),'[1]Input-Output Data'!$J18<'[1]Input-Output Data'!$K18),'[1]TABLE DATA'!O$9,\"SIGN TOO WIDE\"))))))))))","v":0.5},{"$f":"IF(V18=0.5,\"I\",IF(V18=0.625,\"II\",IF(V18=0.75,\"III\",\"N/A\")))","v":"I"}]
[null,null,null,24,24,"Square"]
[]
[null,null,null,48,48,"Diamond",{"$f":"Y21","v":"II"},null,{"$f":"(D21*E21+D22*E22)/144","v":21.25},{"$f":"MAX(IF(F21=\"Square\",2+D21/2,2+(SQRT(2)/2)*D21),IF(F22=\"Square\",2+D22/2,2+(SQRT(2)/2)*D22))","v":35.9},{"$f":"IF(OR(I21<'[1]TABLE DATA'!$D$7,I21='[1]TABLE DATA'!$D$7),717.75/I21,IF(AND('[1]TABLE DATA'!$D$7<I21,OR(I21<'[1]TABLE DATA'!$D$8,I21='[1]TABLE DATA'!$D$8)),1695/I21,IF(AND('[1]TABLE DATA'!$D$8<I21,OR(I21<'[1]TABLE DATA'!$D$9,I21='[1]TABLE DATA'!$D$9)),2268/I21,\"Sign Too Wide\")))","v":33.78},{"$f":"717.75/I21","v":33.78},{"$f":"1695/I21","v":79.760000000000005},{"$f":"2268/I21","v":106.73},{"$f":"IF(I5=\"Arm Too Long\", \"Reduce V or W\",IF($I21>'[1]TABLE DATA'!$D$9,\"SIGN TOO LARGE\",IF(AND(OR($I21<'[1]TABLE DATA'!$D$7,$I21='[1]TABLE DATA'!$D$7),OR('[1]Input-Output Data'!$J21<'[1]Input-Output Data'!$K21,'[1]Input-Output Data'!$J21='[1]Input-Output Data'!$K21)),'[1]TABLE DATA'!F$7,IF(AND(OR($I21<'[1]TABLE DATA'!$D$7,$I21='[1]TABLE DATA'!$D$7),AND($J21>$L21),OR('[1]Input-Output Data'!$J21<'[1]Input-Output Data'!$M21,'[1]Input-Output Data'!$J21='[1]Input-Output Data'!$M21)),'[1]TABLE DATA'!F$8,IF(AND(OR($I21<'[1]TABLE DATA'!$D$7,$I21='[1]TABLE DATA'!$D$7),AND($J21>$M21),OR('[1]Input-Output Data'!$J21<'[1]Input-Output Data'!$N21,'[1]Input-Output Data'!$J21='[1]Input-Output Data'!$N21)),'[1]TABLE DATA'!F$9,IF(AND(OR($I21<'[1]TABLE DATA'!$D$7,$I21='[1]TABLE DATA'!$D$7),$J21>$N21),\"SIGN TOO WIDE\",IF(AND(AND($I21>'[1]TABLE DATA'!$D$7,OR($I21<'[1]TABLE DATA'!$D$8,$I21='[1]TABLE DATA'!$D$8)),'[1]Input-Output Data'!$J21<'[1]Input-Output Data'!$K21),'[1]TABLE DATA'!F$8,IF(AND(AND($I21>'[1]TABLE DATA'!$D$7,OR($I21<'[1]TABLE DATA'!$D$8,$I21='[1]TABLE DATA'!$D$8)),AND('[1]Input-Output Data'!$J21>'[1]Input-Output Data'!$M21,OR('[1]Input-Output Data'!$J21<'[1]Input-Output Data'!$N21,'[1]Input-Output Data'!$J21='[1]Input-Output Data'!$N21))),'[1]TABLE DATA'!F$9,IF(AND(AND($I21>'[1]TABLE DATA'!$D$7,OR($I21<'[1]TABLE DATA'!$D$8,$I21='[1]TABLE DATA'!$D$8)),$J21>'[1]Input-Output Data'!$N21),\"SIGN TOO WIDE\",IF(AND(AND($I21>'[1]TABLE DATA'!$D$8,OR($I21<'[1]TABLE DATA'!$D$9,$I21='[1]TABLE DATA'!$D$9)),'[1]Input-Output Data'!$J21<'[1]Input-Output Data'!$K21),'[1]TABLE DATA'!F$9,\"SIGN TOO WIDE\"))))))))))","v":5},{"$f":"IF(I5=\"Arm Too Long\", \"Reduce V or W\",IF($I21>'[1]TABLE DATA'!$D$9,\"SIGN TOO LARGE\",IF(AND(OR($I21<'[1]TABLE DATA'!$D$7,$I21='[1]TABLE DATA'!$D$7),OR('[1]Input-Output Data'!$J21<'[1]Input-Output Data'!$K21,'[1]Input-Output Data'!$J21='[1]Input-Output Data'!$K21)),'[1]TABLE DATA'!G$7,IF(AND(OR($I21<'[1]TABLE DATA'!$D$7,$I21='[1]TABLE DATA'!$D$7),AND($J21>$L21),OR('[1]Input-Output Data'!$J21<'[1]Input-Output Data'!$M21,'[1]Input-Output Data'!$J21='[1]Input-Output Data'!$M21)),'[1]TABLE DATA'!G$8,IF(AND(OR($I21<'[1]TABLE DATA'!$D$7,$I21='[1]TABLE DATA'!$D$7),AND($J21>$M21),OR('[1]Input-Output Data'!$J21<'[1]Input-Output Data'!$N21,'[1]Input-Output Data'!$J21='[1]Input-Output Data'!$N21)),'[1]TABLE DATA'!G$9,IF(AND(OR($I21<'[1]TABLE DATA'!$D$7,$I21='[1]TABLE DATA'!$D$7),$J21>$N21),\"SIGN TOO WIDE\",IF(AND(AND($I21>'[1]TABLE DATA'!$D$7,OR($I21<'[1]TABLE DATA'!$D$8,$I21='[1]TABLE DATA'!$D$8)),'[1]Input-Output Data'!$J21<'[1]Input-Output Data'!$K21),'[1]TABLE DATA'!G$8,IF(AND(AND($I21>'[1]TABLE DATA'!$D$7,OR($I21<'[1]TABLE DATA'!$D$8,$I21='[1]TABLE DATA'!$D$8)),AND('[1]Input-Output Data'!$J21>'[1]Input-Output Data'!$M21,OR('[1]Input-Output Data'!$J21<'[1]Input-Output Data'!$N21,'[1]Input-Output Data'!$J21='[1]Input-Output Data'!$N21))),'[1]TABLE DATA'!G$9,IF(AND(AND($I21>'[1]TABLE DATA'!$D$7,OR($I21<'[1]TABLE DATA'!$D$8,$I21='[1]TABLE DATA'!$D$8)),$J21>'[1]Input-Output Data'!$N21),\"SIGN TOO WIDE\",IF(AND(AND($I21>'[1]TABLE DATA'!$D$8,OR($I21<'[1]TABLE DATA'!$D$9,$I21='[1]TABLE DATA'!$D$9)),'[1]Input-Output Data'!$J21<'[1]Input-Output Data'!$K21),'[1]TABLE DATA'!G$9,\"SIGN TOO WIDE\"))))))))))","v":3},{"$f":"IF(I5=\"Arm Too Long\", \"Reduce V or W\",IF($I21>'[1]TABLE DATA'!$D$9,\"SIGN TOO LARGE\",IF(AND(OR($I21<'[1]TABLE DATA'!$D$7,$I21='[1]TABLE DATA'!$D$7),OR('[1]Input-Output Data'!$J21<'[1]Input-Output Data'!$K21,'[1]Input-Output Data'!$J21='[1]Input-Output Data'!$K21)),'[1]TABLE DATA'!H$7,IF(AND(OR($I21<'[1]TABLE DATA'!$D$7,$I21='[1]TABLE DATA'!$D$7),AND($J21>$L21),OR('[1]Input-Output Data'!$J21<'[1]Input-Output Data'!$M21,'[1]Input-Output Data'!$J21='[1]Input-Output Data'!$M21)),'[1]TABLE DATA'!H$8,IF(AND(OR($I21<'[1]TABLE DATA'!$D$7,$I21='[1]TABLE DATA'!$D$7),AND($J21>$M21),OR('[1]Input-Output Data'!$J21<'[1]Input-Output Data'!$N21,'[1]Input-Output Data'!$J21='[1]Input-Output Data'!$N21)),'[1]TABLE DATA'!H$9,IF(AND(OR($I21<'[1]TABLE DATA'!$D$7,$I21='[1]TABLE DATA'!$D$7),$J21>$N21),\"SIGN TOO WIDE\",IF(AND(AND($I21>'[1]TABLE DATA'!$D$7,OR($I21<'[1]TABLE DATA'!$D$8,$I21='[1]TABLE DATA'!$D$8)),'[1]Input-Output Data'!$J21<'[1]Input-Output Data'!$K21),'[1]TABLE DATA'!H$8,IF(AND(AND($I21>'[1]TABLE DATA'!$D$7,OR($I21<'[1]TABLE DATA'!$D$8,$I21='[1]TABLE DATA'!$D$8)),AND('[1]Input-Output Data'!$J21>'[1]Input-Output Data'!$M21,OR('[1]Input-Output Data'!$J21<'[1]Input-Output Data'!$N21,'[1]Input-Output Data'!$J21='[1]Input-Output Data'!$N21))),'[1]TABLE DATA'!H$9,IF(AND(AND($I21>'[1]TABLE DATA'!$D$7,OR($I21<'[1]TABLE DATA'!$D$8,$I21='[1]TABLE DATA'!$D$8)),$J21>'[1]Input-Output Data'!$N21),\"SIGN TOO WIDE\",IF(AND(AND($I21>'[1]TABLE DATA'!$D$8,OR($I21<'[1]TABLE DATA'!$D$9,$I21='[1]TABLE DATA'!$D$9)),'[1]Input-Output Data'!$J21<'[1]Input-Output Data'!$K21),'[1]TABLE DATA'!H$9,\"SIGN TOO WIDE\"))))))))))","v":0.875},{"$f":"IF(I5=\"Arm Too Long\", \"Reduce V or W\",IF($I21>'[1]TABLE DATA'!$D$9,\"SIGN TOO LARGE\",IF(AND(OR($I21<'[1]TABLE DATA'!$D$7,$I21='[1]TABLE DATA'!$D$7),OR('[1]Input-Output Data'!$J21<'[1]Input-Output Data'!$K21,'[1]Input-Output Data'!$J21='[1]Input-Output Data'!$K21)),'[1]TABLE DATA'!I$7,IF(AND(OR($I21<'[1]TABLE DATA'!$D$7,$I21='[1]TABLE DATA'!$D$7),AND($J21>$L21),OR('[1]Input-Output Data'!$J21<'[1]Input-Output Data'!$M21,'[1]Input-Output Data'!$J21='[1]Input-Output Data'!$M21)),'[1]TABLE DATA'!I$8,IF(AND(OR($I21<'[1]TABLE DATA'!$D$7,$I21='[1]TABLE DATA'!$D$7),AND($J21>$M21),OR('[1]Input-Output Data'!$J21<'[1]Input-Output Data'!$N21,'[1]Input-Output Data'!$J21='[1]Input-Output Data'!$N21)),'[1]TABLE DATA'!I$9,IF(AND(OR($I21<'[1]TABLE DATA'!$D$7,$I21='[1]TABLE DATA'!$D$7),$J21>$N21),\"SIGN TOO WIDE\",IF(AND(AND($I21>'[1]TABLE DATA'!$D$7,OR($I21<'[1]TABLE DATA'!$D$8,$I21='[1]TABLE DATA'!$D$8)),'[1]Input-Output Data'!$J21<'[1]Input-Output Data'!$K21),'[1]TABLE DATA'!I$8,IF(AND(AND($I21>'[1]TABLE DATA'!$D$7,OR($I21<'[1]TABLE DATA'!$D$8,$I21='[1]TABLE DATA'!$D$8)),AND('[1]Input-Output Data'!$J21>'[1]Input-Output Data'!$M21,OR('[1]Input-Output Data'!$J21<'[1]Input-Output Data'!$N21,'[1]Input-Output Data'!$J21='[1]Input-Output Data'!$N21))),'[1]TABLE DATA'!I$9,IF(AND(AND($I21>'[1]TABLE DATA'!$D$7,OR($I21<'[1]TABLE DATA'!$D$8,$I21='[1]TABLE DATA'!$D$8)),$J21>'[1]Input-Output Data'!$N21),\"SIGN TOO WIDE\",IF(AND(AND($I21>'[1]TABLE DATA'!$D$8,OR($I21<'[1]TABLE DATA'!$D$9,$I21='[1]TABLE DATA'!$D$9)),'[1]Input-Output Data'!$J21<'[1]Input-Output Data'!$K21),'[1]TABLE DATA'!I$9,\"SIGN TOO WIDE\"))))))))))","v":8},{"$f":"IF(I5=\"Arm Too Long\", \"Reduce V or W\",IF($I21>'[1]TABLE DATA'!$D$9,\"SIGN TOO LARGE\",IF(AND(OR($I21<'[1]TABLE DATA'!$D$7,$I21='[1]TABLE DATA'!$D$7),OR('[1]Input-Output Data'!$J21<'[1]Input-Output Data'!$K21,'[1]Input-Output Data'!$J21='[1]Input-Output Data'!$K21)),'[1]TABLE DATA'!J$7,IF(AND(OR($I21<'[1]TABLE DATA'!$D$7,$I21='[1]TABLE DATA'!$D$7),AND($J21>$L21),OR('[1]Input-Output Data'!$J21<'[1]Input-Output Data'!$M21,'[1]Input-Output Data'!$J21='[1]Input-Output Data'!$M21)),'[1]TABLE DATA'!J$8,IF(AND(OR($I21<'[1]TABLE DATA'!$D$7,$I21='[1]TABLE DATA'!$D$7),AND($J21>$M21),OR('[1]Input-Output Data'!$J21<'[1]Input-Output Data'!$N21,'[1]Input-Output Data'!$J21='[1]Input-Output Data'!$N21)),'[1]TABLE DATA'!J$9,IF(AND(OR($I21<'[1]TABLE DATA'!$D$7,$I21='[1]TABLE DATA'!$D$7),$J21>$N21),\"SIGN TOO WIDE\",IF(AND(AND($I21>'[1]TABLE DATA'!$D$7,OR($I21<'[1]TABLE DATA'!$D$8,$I21='[1]TABLE DATA'!$D$8)),'[1]Input-Output Data'!$J21<'[1]Input-Output Data'!$K21),'[1]TABLE DATA'!J$8,IF(AND(AND($I21>'[1]TABLE DATA'!$D$7,OR($I21<'[1]TABLE DATA'!$D$8,$I21='[1]TABLE DATA'!$D$8)),AND('[1]Input-Output Data'!$J21>'[1]Input-Output Data'!$M21,OR('[1]Input-Output Data'!$J21<'[1]Input-Output Data'!$N21,'[1]Input-Output Data'!$J21='[1]Input-Output Data'!$N21))),'[1]TABLE DATA'!J$9,IF(AND(AND($I21>'[1]TABLE DATA'!$D$7,OR($I21<'[1]TABLE DATA'!$D$8,$I21='[1]TABLE DATA'!$D$8)),$J21>'[1]Input-Output Data'!$N21),\"SIGN TOO WIDE\",IF(AND(AND($I21>'[1]TABLE DATA'!$D$8,OR($I21<'[1]TABLE DATA'!$D$9,$I21='[1]TABLE DATA'!$D$9)),'[1]Input-Output Data'!$J21<'[1]Input-Output Data'!$K21),'[1]TABLE DATA'!J$9,\"SIGN TOO WIDE\"))))))))))","v":2},{"$f":"IF(I5=\"Arm Too Long\", \"Reduce V or W\",IF($I21>'[1]TABLE DATA'!$D$9,\"SIGN TOO LARGE\",IF(AND(OR($I21<'[1]TABLE DATA'!$D$7,$I21='[1]TABLE DATA'!$D$7),OR('[1]Input-Output Data'!$J21<'[1]Input-Output Data'!$K21,'[1]Input-Output Data'!$J21='[1]Input-Output Data'!$K21)),'[1]TABLE DATA'!K$7,IF(AND(OR($I21<'[1]TABLE DATA'!$D$7,$I21='[1]TABLE DATA'!$D$7),AND($J21>$L21),OR('[1]Input-Output Data'!$J21<'[1]Input-Output Data'!$M21,'[1]Input-Output Data'!$J21='[1]Input-Output Data'!$M21)),'[1]TABLE DATA'!K$8,IF(AND(OR($I21<'[1]TABLE DATA'!$D$7,$I21='[1]TABLE DATA'!$D$7),AND($J21>$M21),OR('[1]Input-Output Data'!$J21<'[1]Input-Output Data'!$N21,'[1]Input-Output Data'!$J21='[1]Input-Output Data'!$N21)),'[1]TABLE DATA'!K$9,IF(AND(OR($I21<'[1]TABLE DATA'!$D$7,$I21='[1]TABLE DATA'!$D$7),$J21>$N21),\"SIGN TOO WIDE\",IF(AND(AND($I21>'[1]TABLE DATA'!$D$7,OR($I21<'[1]TABLE DATA'!$D$8,$I21='[1]TABLE DATA'!$D$8)),'[1]Input-Output Data'!$J21<'[1]Input-Output Data'!$K21),'[1]TABLE DATA'!K$8,IF(AND(AND($I21>'[1]TABLE DATA'!$D$7,OR($I21<'[1]TABLE DATA'!$D$8,$I21='[1]TABLE DATA'!$D$8)),AND('[1]Input-Output Data'!$J21>'[1]Input-Output Data'!$M21,OR('[1]Input-Output Data'!$J21<'[1]Input-Output Data'!$N21,'[1]Input-Output Data'!$J21='[1]Input-Output Data'!$N21))),'[1]TABLE DATA'!K$9,IF(AND(AND($I21>'[1]TABLE DATA'!$D$7,OR($I21<'[1]TABLE DATA'!$D$8,$I21='[1]TABLE DATA'!$D$8)),$J21>'[1]Input-Output Data'!$N21),\"SIGN TOO WIDE\",IF(AND(AND($I21>'[1]TABLE DATA'!$D$8,OR($I21<'[1]TABLE DATA'!$D$9,$I21='[1]TABLE DATA'!$D$9)),'[1]Input-Output Data'!$J21<'[1]Input-Output Data'!$K21),'[1]TABLE DATA'!K$9,\"SIGN TOO WIDE\"))))))))))","v":80},{"$f":"IF(I5=\"Arm Too Long\", \"Reduce V or W\",IF($I21>'[1]TABLE DATA'!$D$9,\"SIGN TOO LARGE\",IF(AND(OR($I21<'[1]TABLE DATA'!$D$7,$I21='[1]TABLE DATA'!$D$7),OR('[1]Input-Output Data'!$J21<'[1]Input-Output Data'!$K21,'[1]Input-Output Data'!$J21='[1]Input-Output Data'!$K21)),'[1]TABLE DATA'!L$7,IF(AND(OR($I21<'[1]TABLE DATA'!$D$7,$I21='[1]TABLE DATA'!$D$7),AND($J21>$L21),OR('[1]Input-Output Data'!$J21<'[1]Input-Output Data'!$M21,'[1]Input-Output Data'!$J21='[1]Input-Output Data'!$M21)),'[1]TABLE DATA'!L$8,IF(AND(OR($I21<'[1]TABLE DATA'!$D$7,$I21='[1]TABLE DATA'!$D$7),AND($J21>$M21),OR('[1]Input-Output Data'!$J21<'[1]Input-Output Data'!$N21,'[1]Input-Output Data'!$J21='[1]Input-Output Data'!$N21)),'[1]TABLE DATA'!L$9,IF(AND(OR($I21<'[1]TABLE DATA'!$D$7,$I21='[1]TABLE DATA'!$D$7),$J21>$N21),\"SIGN TOO WIDE\",IF(AND(AND($I21>'[1]TABLE DATA'!$D$7,OR($I21<'[1]TABLE DATA'!$D$8,$I21='[1]TABLE DATA'!$D$8)),'[1]Input-Output Data'!$J21<'[1]Input-Output Data'!$K21),'[1]TABLE DATA'!L$8,IF(AND(AND($I21>'[1]TABLE DATA'!$D$7,OR($I21<'[1]TABLE DATA'!$D$8,$I21='[1]TABLE DATA'!$D$8)),AND('[1]Input-Output Data'!$J21>'[1]Input-Output Data'!$M21,OR('[1]Input-Output Data'!$J21<'[1]Input-Output Data'!$N21,'[1]Input-Output Data'!$J21='[1]Input-Output Data'!$N21))),'[1]TABLE DATA'!L$9,IF(AND(AND($I21>'[1]TABLE DATA'!$D$7,OR($I21<'[1]TABLE DATA'!$D$8,$I21='[1]TABLE DATA'!$D$8)),$J21>'[1]Input-Output Data'!$N21),\"SIGN TOO WIDE\",IF(AND(AND($I21>'[1]TABLE DATA'!$D$8,OR($I21<'[1]TABLE DATA'!$D$9,$I21='[1]TABLE DATA'!$D$9)),'[1]Input-Output Data'!$J21<'[1]Input-Output Data'!$K21),'[1]TABLE DATA'!L$9,\"SIGN TOO WIDE\"))))))))))","v":14.5},{"$f":"IF(I5=\"Arm Too Long\", \"Reduce V or W\",IF($I21>'[1]TABLE DATA'!$D$9,\"SIGN TOO LARGE\",IF(AND(OR($I21<'[1]TABLE DATA'!$D$7,$I21='[1]TABLE DATA'!$D$7),OR('[1]Input-Output Data'!$J21<'[1]Input-Output Data'!$K21,'[1]Input-Output Data'!$J21='[1]Input-Output Data'!$K21)),'[1]TABLE DATA'!M$7,IF(AND(OR($I21<'[1]TABLE DATA'!$D$7,$I21='[1]TABLE DATA'!$D$7),AND($J21>$L21),OR('[1]Input-Output Data'!$J21<'[1]Input-Output Data'!$M21,'[1]Input-Output Data'!$J21='[1]Input-Output Data'!$M21)),'[1]TABLE DATA'!M$8,IF(AND(OR($I21<'[1]TABLE DATA'!$D$7,$I21='[1]TABLE DATA'!$D$7),AND($J21>$M21),OR('[1]Input-Output Data'!$J21<'[1]Input-Output Data'!$N21,'[1]Input-Output Data'!$J21='[1]Input-Output Data'!$N21)),'[1]TABLE DATA'!M$9,IF(AND(OR($I21<'[1]TABLE DATA'!$D$7,$I21='[1]TABLE DATA'!$D$7),$J21>$N21),\"SIGN TOO WIDE\",IF(AND(AND($I21>'[1]TABLE DATA'!$D$7,OR($I21<'[1]TABLE DATA'!$D$8,$I21='[1]TABLE DATA'!$D$8)),'[1]Input-Output Data'!$J21<'[1]Input-Output Data'!$K21),'[1]TABLE DATA'!M$8,IF(AND(AND($I21>'[1]TABLE DATA'!$D$7,OR($I21<'[1]TABLE DATA'!$D$8,$I21='[1]TABLE DATA'!$D$8)),AND('[1]Input-Output Data'!$J21>'[1]Input-Output Data'!$M21,OR('[1]Input-Output Data'!$J21<'[1]Input-Output Data'!$N21,'[1]Input-Output Data'!$J21='[1]Input-Output Data'!$N21))),'[1]TABLE DATA'!M$9,IF(AND(AND($I21>'[1]TABLE DATA'!$D$7,OR($I21<'[1]TABLE DATA'!$D$8,$I21='[1]TABLE DATA'!$D$8)),$J21>'[1]Input-Output Data'!$N21),\"SIGN TOO WIDE\",IF(AND(AND($I21>'[1]TABLE DATA'!$D$8,OR($I21<'[1]TABLE DATA'!$D$9,$I21='[1]TABLE DATA'!$D$9)),'[1]Input-Output Data'!$J21<'[1]Input-Output Data'!$K21),'[1]TABLE DATA'!M$9,\"SIGN TOO WIDE\"))))))))))","v":0.625},{"$f":"IF(I5=\"Arm Too Long\", \"Reduce V or W\",IF($I21>'[1]TABLE DATA'!$D$9,\"SIGN TOO LARGE\",IF(AND(OR($I21<'[1]TABLE DATA'!$D$7,$I21='[1]TABLE DATA'!$D$7),OR('[1]Input-Output Data'!$J21<'[1]Input-Output Data'!$K21,'[1]Input-Output Data'!$J21='[1]Input-Output Data'!$K21)),'[1]TABLE DATA'!N$7,IF(AND(OR($I21<'[1]TABLE DATA'!$D$7,$I21='[1]TABLE DATA'!$D$7),AND($J21>$L21),OR('[1]Input-Output Data'!$J21<'[1]Input-Output Data'!$M21,'[1]Input-Output Data'!$J21='[1]Input-Output Data'!$M21)),'[1]TABLE DATA'!N$8,IF(AND(OR($I21<'[1]TABLE DATA'!$D$7,$I21='[1]TABLE DATA'!$D$7),AND($J21>$M21),OR('[1]Input-Output Data'!$J21<'[1]Input-Output Data'!$N21,'[1]Input-Output Data'!$J21='[1]Input-Output Data'!$N21)),'[1]TABLE DATA'!N$9,IF(AND(OR($I21<'[1]TABLE DATA'!$D$7,$I21='[1]TABLE DATA'!$D$7),$J21>$N21),\"SIGN TOO WIDE\",IF(AND(AND($I21>'[1]TABLE DATA'!$D$7,OR($I21<'[1]TABLE DATA'!$D$8,$I21='[1]TABLE DATA'!$D$8)),'[1]Input-Output Data'!$J21<'[1]Input-Output Data'!$K21),'[1]TABLE DATA'!N$8,IF(AND(AND($I21>'[1]TABLE DATA'!$D$7,OR($I21<'[1]TABLE DATA'!$D$8,$I21='[1]TABLE DATA'!$D$8)),AND('[1]Input-Output Data'!$J21>'[1]Input-Output Data'!$M21,OR('[1]Input-Output Data'!$J21<'[1]Input-Output Data'!$N21,'[1]Input-Output Data'!$J21='[1]Input-Output Data'!$N21))),'[1]TABLE DATA'!N$9,IF(AND(AND($I21>'[1]TABLE DATA'!$D$7,OR($I21<'[1]TABLE DATA'!$D$8,$I21='[1]TABLE DATA'!$D$8)),$J21>'[1]Input-Output Data'!$N21),\"SIGN TOO WIDE\",IF(AND(AND($I21>'[1]TABLE DATA'!$D$8,OR($I21<'[1]TABLE DATA'!$D$9,$I21='[1]TABLE DATA'!$D$9)),'[1]Input-Output Data'!$J21<'[1]Input-Output Data'!$K21),'[1]TABLE DATA'!N$9,\"SIGN TOO WIDE\"))))))))))","v":0.625},{"$f":"IF(I5=\"Arm Too Long\", \"Reduce V or W\",IF($I21>'[1]TABLE DATA'!$D$9,\"SIGN TOO LARGE\",IF(AND(OR($I21<'[1]TABLE DATA'!$D$7,$I21='[1]TABLE DATA'!$D$7),OR('[1]Input-Output Data'!$J21<'[1]Input-Output Data'!$K21,'[1]Input-Output Data'!$J21='[1]Input-Output Data'!$K21)),'[1]TABLE DATA'!O$7,IF(AND(OR($I21<'[1]TABLE DATA'!$D$7,$I21='[1]TABLE DATA'!$D$7),AND($J21>$L21),OR('[1]Input-Output Data'!$J21<'[1]Input-Output Data'!$M21,'[1]Input-Output Data'!$J21='[1]Input-Output Data'!$M21)),'[1]TABLE DATA'!O$8,IF(AND(OR($I21<'[1]TABLE DATA'!$D$7,$I21='[1]TABLE DATA'!$D$7),AND($J21>$M21),OR('[1]Input-Output Data'!$J21<'[1]Input-Output Data'!$N21,'[1]Input-Output Data'!$J21='[1]Input-Output Data'!$N21)),'[1]TABLE DATA'!O$9,IF(AND(OR($I21<'[1]TABLE DATA'!$D$7,$I21='[1]TABLE DATA'!$D$7),$J21>$N21),\"SIGN TOO WIDE\",IF(AND(AND($I21>'[1]TABLE DATA'!$D$7,OR($I21<'[1]TABLE DATA'!$D$8,$I21='[1]TABLE DATA'!$D$8)),'[1]Input-Output Data'!$J21<'[1]Input-Output Data'!$K21),'[1]TABLE DATA'!O$8,IF(AND(AND($I21>'[1]TABLE DATA'!$D$7,OR($I21<'[1]TABLE DATA'!$D$8,$I21='[1]TABLE DATA'!$D$8)),AND('[1]Input-Output Data'!$J21>'[1]Input-Output Data'!$M21,OR('[1]Input-Output Data'!$J21<'[1]Input-Output Data'!$N21,'[1]Input-Output Data'!$J21='[1]Input-Output Data'!$N21))),'[1]TABLE DATA'!O$9,IF(AND(AND($I21>'[1]TABLE DATA'!$D$7,OR($I21<'[1]TABLE DATA'!$D$8,$I21='[1]TABLE DATA'!$D$8)),$J21>'[1]Input-Output Data'!$N21),\"SIGN TOO WIDE\",IF(AND(AND($I21>'[1]TABLE DATA'!$D$8,OR($I21<'[1]TABLE DATA'!$D$9,$I21='[1]TABLE DATA'!$D$9)),'[1]Input-Output Data'!$J21<'[1]Input-Output Data'!$K21),'[1]TABLE DATA'!O$9,\"SIGN TOO WIDE\"))))))))))","v":0.625},{"$f":"IF(V21=0.5,\"I\",IF(V21=0.625,\"II\",IF(V21=0.75,\"III\",\"N/A\")))","v":"II"}]
[null,null,null,42,18,"Square"]

{"sheet":" D REM - REMOVE THIS TAB","index":86,"n_rows":26,"n_cols":14,"rows_kept":26,"cut":false,"hidden":false,"merged":[[1,1,1,7],[1,8,1,9],[3,3,5,5],[14,6,14,7],[9,6,9,7],[10,6,10,7],[11,6,11,7],[12,6,12,7],[13,6,13,7],[7,1,8,1],[7,2,8,2],[2,8,2,9],[3,6,3,7],[2,1,5,1],[2,2,5,2],[2,3,2,7],[4,12,4,13],[6,6,6,7],[7,6,7,7],[8,6,8,7],[4,6,4,7],[5,6,5,7],[7,8,8,8],[7,9,8,9],[3,8,5,8]]}
[]
[null,"REMOVE SIGN TYPE D",null,null,null,null,null,null,"ST-D"]
[null,"SIGN\nNUMBER","QUANTITY\n(EACH)","PANEL",null,null,null,null,"POSTS"]
[null,null,null,"(1)\nSIZE\n(EACH) ",null,null,null,null,"NO &\nTYPE\n(2)","KNEE"]
[null,null,null,null,null,null,"LEGEND",null,null,"BRACES",null,null,"DEFAULT VALUES"]
[null,null,null,null,null,null,null,null,null,"QTY",null,null,"POST #","POST TYPE"]
[null,"D-101",1,48,"x",60,"EXIT 35B",null,{"$f":"postnumb(D7,F7,M7,N7)","v":{"$error":"#NAME?"}},{"$f":"postknee(D7,F7,M7,N7)","v":{"$error":"#NAME?"}},null,null,"2.5","U"]
[null,"D-102",2,24,"x",15,"NORTH",null,{"$f":"postnumb(MAX(D8,D9),F8+F9,M8,N8)","v":{"$error":"#NAME?"}},{"$f":"postknee(MAX(D8,D9),F8+F9,M8,N8)","v":{"$error":"#NAME?"}},null,null,"2.5","U"]
[null,null,null,24,"x",24,"INTERSTATE 35",null,null,null,null,null,"2.5","U"]
[null,null,null,null,"x",null,null,null,{"$f":"postnumb(D10,F10,M10,N10)","v":{"$error":"#NAME?"}},{"$f":"postknee(D10,F10,M10,N10)","v":{"$error":"#NAME?"}},null,null,"2.5","U"]
[null,null,null,null,"x",null,null,null,{"$f":"postnumb(D11,F11,M11,N11)","v":{"$error":"#NAME?"}},{"$f":"postknee(D11,F11,M11,N11)","v":{"$error":"#NAME?"}},null,null,"2.5","U"]
[null,null,null,null,"x",null,null,null,{"$f":"postnumb(D12,F12,M12,N12)","v":{"$error":"#NAME?"}},{"$f":"postknee(D12,F12,M12,N12)","v":{"$error":"#NAME?"}},null,null,"2.5","U"]
[null,null,null,null,"x",null,null,null,{"$f":"postnumb(D13,F13,M13,N13)","v":{"$error":"#NAME?"}},{"$f":"postknee(D13,F13,M13,N13)","v":{"$error":"#NAME?"}},null,null,"2.5","U"]
[null,null,null,null,"x",null,null,null,{"$f":"postnumb(D14,F14,M14,N14)","v":{"$error":"#NAME?"}},{"$f":"postknee(D14,F14,M14,N14)","v":{"$error":"#NAME?"}},null,null,"2.5","U"]
[null,"TOTAL",{"$f":"SUM(C7:C14)","v":3}]
[null,null,null,null," "]
[]
[null,"SPECIFIC NOTE:"]
[null,"(1) SIZES ARE APPROXIMATE"]
[null,"(2) POST TYPE ABBREVIATIONS (SQ = SQUARE TUBE, R = ROUND POST, U = U CHANNEL)"]
[]
[]
[]
[]
[]
[null,null,null,null,null,null,"DO WE NEED TO TAB THESE ?"]

{"sheet":"Sheet1","index":87,"n_rows":0,"n_cols":0,"rows_kept":0,"cut":false,"hidden":false,"merged":[]}