{"text_format":"3","workbook":"xlsx","n_sheets":11,"sheets":["Data sheet","Street Report","Tape ","IC-106","Core Stationing","random numbers","Core Wksht","Blank Core Wksht","Core Stationing Blank","Notes","Drop Downs"],"not_rendered":{"images":1,"macros":1,"defined_names":36,"comments":3},"read":"whole","date_system":"1900"}

{"sheet":"Data sheet","index":0,"n_rows":110,"n_cols":56,"rows_kept":110,"merged":[[0,0,0,11],[1,0,1,11],[2,0,3,0],[2,1,3,1],[2,2,4,2],[2,3,3,3],[2,4,3,4],[2,5,5,6],[2,7,3,7],[2,8,3,8],[2,9,5,9],[2,10,3,10],[2,11,3,11],[4,0,5,0],[4,1,5,1],[4,3,5,3],[4,4,5,4],[4,7,5,7],[4,8,5,8],[4,10,5,10],[4,11,5,11],[6,0,13,1],[6,6,6,7],[7,6,7,7],[8,6,8,7],[9,6,9,7],[10,6,10,7],[11,6,11,7],[12,6,12,7],[13,6,13,7],[14,0,18,2],[15,6,15,7],[16,6,16,7],[17,6,17,7],[18,6,18,7],[19,5,19,8],[20,0,20,11],[22,9,22,10],[22,12,24,12],[23,9,23,10],[24,9,24,10],[25,9,25,10],[26,9,26,10],[27,9,27,10],[28,9,28,10],[29,9,29,10],[32,0,32,11],[32,24,32,25],[33,0,33,11],[34,0,35,11],[51,4,52,15],[53,4,53,12],[61,26,61,33],[62,18,62,24],[80,26,80,33],[83,4,83,5],[94,16,95,18],[99,4,99,5],[106,0,108,4],[106,5,108,8],[109,6,109,7]]}
["ONE WORKBOOK PER DAY PER MIX DESIGN"]
["BITUMINOUS STREET REPORT PROJECT DATA"]
["TH",null,null,"ENGINEER:",null,"ms",null,"PAVING CONTRACTOR:",null,null,"DATE:"]
[]
["SP",null,null,"CONTRACT:",{"$nulls":3},"PLANT IDENTIFICATION:",null,null,"REPORT#:"]
[null,null,{"$f":"A5","v":"SP"}]
["LIST ALL S.P.'S ASSOCIATED WITH CONTRACT",null,{"$f":"B5","v":0},"MDR/Rec#","SPEC.","MIX DESIGN","ITEM",null,"UNITS","Price Per Unit","LBS. PER CU FT","LBS PER SY.IN."]
[{"$nulls":11},{"$f":"K8/12*9","v":{"v":0,"d":"0.00"}}]
[{"$nulls":11},{"$f":"K9/12*9","v":{"v":0,"d":"0.00"}}]
[{"$nulls":11},{"v":0,"d":"0.00"}]
[{"$nulls":11},{"v":0,"d":"0.00"}]
[{"$nulls":11},{"v":0,"d":"0.00"}]
[{"$nulls":11},{"v":0,"d":"0.00"}]
[{"$nulls":11},{"v":0,"d":"0.00"}]
[{"$nulls":11},{"v":0,"d":"0.00"}]
[{"$nulls":11},{"v":0,"d":"0.00"}]
[{"$nulls":11},{"v":0,"d":"0.00"}]
[{"$nulls":11},{"v":0,"d":"0.00"}]
[{"$nulls":11},{"v":0,"d":"0.00"}]
[]
["ONE WORKBOOK PER DAY\nEDIT DATA IN BLUE BOXES ONLY"]
["MDR/Rec#","ITEM","MIX DESIGN","SPEC.","UNITS","Price Per Ton",null,"LBS. PER CU FT","LBS PER SY.IN.",{"$nulls":9},"WEATHER",null,null,"MIX. TEMP.",null,null,"PAID BY"]
["01-2019-128","TYPE SP 9.5 WEARING COURSE MIX (3,B)","SPWEA330B",2360.504,"TON",{"v":50,"d":"$50.00"},null,{"v":161,"d":"161.00"},{"$f":"H23*0.75","v":120.75},"T.H.",null,1,"LIST ALL S.P.'S ASSOCIATED WITH DAYS PAVING BELOW"]
[{"$nulls":8},0,"LOW SP:",null,"1111-11",{"$nulls":6},"RAIN / SNOW",null,null,"BELOW 32° F",null,null,"TON",null,"TOTAL TONS (PLACED/PRODUCED):","TOTAL TONS DEDUCTED (WASTE / OVERLOAD):","TOTAL TONS PAID FOR (THIS REPORT):"]
[{"$nulls":8},0,"CONTRACT:",null,191111,{"$nulls":6},"CLOUDY",null,null,"32° F - 40° F",null,null,"SQ. YD.",null,"TOTAL SQUARE YARDS PLACED:","TOTAL SQUARE YARDS DEDUCTED (REMARKS):","TOTAL SQUARE YARDS PAID FOR (THIS REPORT):"]
[{"$nulls":8},0,"ENGINEER:",null,"JON DOE","1111-11",{"$nulls":5},"PARTLY CLOUDY",null,null,"41° F - 50° F"]
[{"$nulls":8},0,"PAVING\nCONTRACTOR:",null,"BIT PAVERS",{"$nulls":6},"CLEAR",null,null,"51° F - 60° F"]
[{"$nulls":8},0,"PLANT:",null,"BP111",{"$nulls":9},"61° F - 70° F",{"$nulls":8},"SHEET TOTALS MUST BE THE SAME AMOUNT","&"]
[{"$nulls":8},0,"DATE",null,"2020-08-01",{"$nulls":9},"71° F - 80° F"]
[{"$nulls":8},0,"REPORT #",null,1,{"$nulls":9},"81° F - 90° F"]
[{"$nulls":8},0,{"$nulls":12},"ABOVE 90° F"]
[{"$nulls":8},0]
["ENTER ALL MIX DESIGNS IN THE ABOVE ROWS THAT ARE ASSOCIATED WITH THE INDICATED CONTRACT #",{"$nulls":17},"LIFT",null,"LANE TYPE",null,"Direction of Travel",null,"MAINLINE",{"$nulls":6},{"$f":"AD35","v":0},{"$f":"AD36","v":0},{"$f":"AD37","v":0},{"$f":"AD38","v":0}]
["ENTER ITEM IN BLUE BOXES IF NOT LISTED IN THE PULL DOWN BOX ABOVE",{"$nulls":17},"L1",null,"Traffic Lane",null,"NB",{"$nulls":6},{"$f":"'Street Report'!C9","v":0},{"$f":"MIN(FIND({0,1,2,3,4,5,6,7,8,9},AD34&\"0123456789\"))","v":1},{"$f":"LEFT(AD34,AE34-1)","v":""},{"$f":"RIGHT(AD34,LEN(AD34)-AE34+1)","v":"0"},{"$f":"IF(AG34=\"0\",AI34,AG34)","v":0},null,{"$f":"'Street Report'!J9","v":0},"-",{"$f":"'Street Report'!K9","v":0},{"$f":"AJ34&AK34&AL34","v":"0-0"},null,{"$f":"IF(AM34=\"0-0\",AN34,AM34)","v":0}]
["DO NOT COPY AND PASTE ON THIS SHEET.  TYPE IN FIELDS ONLY FROM PROVISION AND PROJECT MIX DESIGN.",{"$nulls":17},"L2",null,"Lt Shoulder",null,"SB",null,"12L-CL",12,{"$nulls":3},{"$f":"'Street Report'!C10","v":0},{"$f":"MIN(FIND({0,1,2,3,4,5,6,7,8,9},AD35&\"0123456789\"))","v":1},{"$f":"LEFT(AD35,AE35-1)","v":""},{"$f":"RIGHT(AD35,LEN(AD35)-AE35+1)","v":"0"},{"$f":"IF(AG35=\"0\",AI35,AG35)","v":0},null,{"$f":"'Street Report'!J10","v":0},"-",{"$f":"'Street Report'!K10","v":0},{"$f":"IF(AJ35<>\"\",AJ35&AK35&AL35,\" \")","v":"0-0"},null,{"$f":"IF(AM35=\"0-0\",AN35,AM35)","v":0}]
[{"$nulls":18},"L3",null,"Lt Turnlane  ",null,"EB",null,"CL-12R",12,{"$nulls":3},{"$f":"'Street Report'!C11","v":0},{"$f":"MIN(FIND({0,1,2,3,4,5,6,7,8,9},AD36&\"0123456789\"))","v":1},"","0",0,null,{"$f":"'Street Report'!J11","v":0},"-",{"$f":"'Street Report'!K11","v":0},"0-0",null,0]
[{"$nulls":18},"L4",null,"Lt Lane",null,"WB",null,"18L-CL",18,{"$nulls":3},{"$f":"'Street Report'!C12","v":0},{"$f":"MIN(FIND({0,1,2,3,4,5,6,7,8,9},AD37&\"0123456789\"))","v":1},"","0",0,null,{"$f":"'Street Report'!J12","v":0},"-",{"$f":"'Street Report'!K12","v":0},"0-0",null,0]
[null,"EXAMPLE",{"$nulls":16},"L5",null,"Center Lane",{"$nulls":3},"CL-18R",18,{"$nulls":3},{"$f":"'Street Report'!C13","v":0},{"$f":"MIN(FIND({0,1,2,3,4,5,6,7,8,9},AD38&\"0123456789\"))","v":1},"","0",0,null,{"$f":"'Street Report'!J13","v":0},"-",{"$f":"'Street Report'!K13","v":0},"0-0",null,0]
[2360.501,"TYPE SP 12.5 WEARING COURSE MIX (3,B)","SPWEB330B","99-2020-999","TON",50,null,149.2,{"$f":"H39*0.75","v":111.89999999999999},{"$nulls":9},"L6",null,"Rt Lane",{"$nulls":3},"18L-6L",12,{"$nulls":3},{"$f":"'Street Report'!C14","v":0},{"$f":"MIN(FIND({0,1,2,3,4,5,6,7,8,9},AD39&\"0123456789\"))","v":1},"","0",0,null,{"$f":"'Street Report'!J14","v":0},"-",{"$f":"'Street Report'!K14","v":0},"0-0",null,0]
[{"$nulls":20},"Rt Turnlane  ",{"$nulls":3},"6R-18R",12,{"$nulls":3},{"$f":"'Street Report'!C15","v":0},{"$f":"MIN(FIND({0,1,2,3,4,5,6,7,8,9},AD40&\"0123456789\"))","v":1},"","0",0,null,{"$f":"'Street Report'!J15","v":0},"-",{"$f":"'Street Report'!K15","v":0},"0-0",null,0]
[{"$nulls":18},"TH",null,"Rt Shoulder",{"$nulls":3},"24L-12L",12,{"$nulls":3},{"$f":"'Street Report'!C16","v":0},{"$f":"MIN(FIND({0,1,2,3,4,5,6,7,8,9},AD41&\"0123456789\"))","v":1},"","0",0,null,{"$f":"'Street Report'!J16","v":0},"-",{"$f":"'Street Report'!K16","v":0},"0-0",null,0]
[{"$nulls":18},"CSAH",null,"Ramp",{"$nulls":3},"12R-24R",12,{"$nulls":3},{"$f":"'Street Report'!C17","v":0},{"$f":"MIN(FIND({0,1,2,3,4,5,6,7,8,9},AD42&\"0123456789\"))","v":1},"","0",0,null,{"$f":"'Street Report'!J17","v":0},"-",{"$f":"'Street Report'!K17","v":0},"0-0",null,0]
[{"$nulls":18},"CR",null,"Loop",{"$nulls":3},"36L-24L",12,{"$nulls":3},{"$f":"'Street Report'!C18","v":0},{"$f":"MIN(FIND({0,1,2,3,4,5,6,7,8,9},AD43&\"0123456789\"))","v":1},"","0",0,null,{"$f":"'Street Report'!J18","v":0},"-",{"$f":"'Street Report'!K18","v":0},"0-0",null,0]
[2360.504,"TYPE SP 9.5 WEARING COURSE MIX","SPWEA330B",{"$nulls":15},"MS",null,"Shld Bypass",{"$nulls":3},"24R-36R",12,{"$nulls":3},{"$f":"'Street Report'!C19","v":0},{"$f":"MIN(FIND({0,1,2,3,4,5,6,7,8,9},AD44&\"0123456789\"))","v":1},"","0",0,null,{"$f":"'Street Report'!J19","v":0},"-",{"$f":"'Street Report'!K19","v":0},"0-0",null,0]
[2360.509,"TYPE SP 9.5 WEAR CRS MIX","SPWEA340B",{"$nulls":15},"MSAH",null,"HOV Lane",{"$nulls":3},"48L-36L",12,{"$nulls":3},{"$f":"'Street Report'!C20","v":0},{"$f":"MIN(FIND({0,1,2,3,4,5,6,7,8,9},AD45&\"0123456789\"))","v":1},"","0",0,null,{"$f":"'Street Report'!J20","v":0},"-",{"$f":"'Street Report'!K20","v":0},"0-0",null,0]
[2360.609,"TYPE SP 9.5 NON WEAR COURSE MIX","SPWEA440B",{"$nulls":17},"Crossover",{"$nulls":3},"36R-48R",12,{"$nulls":3},{"$f":"'Street Report'!C21","v":0},{"$f":"MIN(FIND({0,1,2,3,4,5,6,7,8,9},AD46&\"0123456789\"))","v":1},"","0",0,null,{"$f":"'Street Report'!J21","v":0},"-",{"$f":"'Street Report'!K21","v":0},"0-0",null,0]
[null,"TYPE SP 9.5 NON WR CRS MIX","SPWEB330B",{"$nulls":21},"6L-6R",12,{"$nulls":3},{"$f":"'Street Report'!C22","v":0},{"$f":"MIN(FIND({0,1,2,3,4,5,6,7,8,9},AD47&\"0123456789\"))","v":1},"","0",0,null,{"$f":"'Street Report'!J22","v":0},"-",{"$f":"'Street Report'!K22","v":0},"0-0",null,0]
[null,"TYPE SP 12.5 WEARING COURSE MIX","SPWEB430B",{"$nulls":21},"20L-12L (8' SHLD)",8,{"$nulls":3},{"$f":"'Street Report'!C23","v":0},{"$f":"MIN(FIND({0,1,2,3,4,5,6,7,8,9},AD48&\"0123456789\"))","v":1},"","0",0,null,{"$f":"'Street Report'!J23","v":0},"-",{"$f":"'Street Report'!K23","v":0},"0-0",null,0]
[null,"TYPE SP 12.5 WEAR CRS MIX","SPWEB440B",{"$nulls":21},"22L-12L (10' SHLD)",10,{"$nulls":3},{"$f":"'Street Report'!C24","v":0},{"$f":"MIN(FIND({0,1,2,3,4,5,6,7,8,9},AD49&\"0123456789\"))","v":1},"","0",0,null,{"$f":"'Street Report'!J24","v":0},"-",{"$f":"'Street Report'!K24","v":0},"0-0",null,0]
[null,"TYPE SP 12.5 NON WEAR COURSE MIX","SPWEB340B",{"$nulls":21},"12R-20R (8' SHLD)",8,{"$nulls":3},{"$f":"'Street Report'!C25","v":0},{"$f":"MIN(FIND({0,1,2,3,4,5,6,7,8,9},AD50&\"0123456789\"))","v":1},"","0",0,null,{"$f":"'Street Report'!J25","v":0},"-",{"$f":"'Street Report'!K25","v":0},"0-0",null,0]
[null,"TYPE SP 12.5 NON WR CRS MIX","SPNWA330B",{"$nulls":21},"12R-22R (10' SHLD)",10,{"$nulls":3},{"$f":"'Street Report'!C26","v":0},{"$f":"MIN(FIND({0,1,2,3,4,5,6,7,8,9},AD51&\"0123456789\"))","v":1},"","0",0,null,{"$f":"'Street Report'!J26","v":0},"-",{"$f":"'Street Report'!K26","v":0},"0-0",null,0]
[null,"TYPE SP 4.75 WEAR CRS MIX","SPNWA340B",null,"Density and non-density tons tabulation separated by S.P. ",{"$nulls":19},"32L-24L (8' SHLD)",8,{"$nulls":3},{"$f":"'Street Report'!C27","v":0},{"$f":"MIN(FIND({0,1,2,3,4,5,6,7,8,9},AD52&\"0123456789\"))","v":1},"","0",0,null,{"$f":"'Street Report'!J27","v":0},"-",{"$f":"'Street Report'!K27","v":0},"0-0",null,0]
[null,"TYPE SP 4.75 WEARING COURSE MIX","SPNWA440B",{"$nulls":21},"34L-24L (10' SHLD)",10,{"$nulls":3},{"$f":"'Street Report'!C28","v":0},{"$f":"MIN(FIND({0,1,2,3,4,5,6,7,8,9},AD53&\"0123456789\"))","v":1},"","0",0,null,{"$f":"'Street Report'!J28","v":0},"-",{"$f":"'Street Report'!K28","v":0},"0-0",null,0]
[null,"TYPE SP 9.5 BIT MIXTURE FOR PATCHING","SPNWB340B",null,"s.p.",{"$nulls":19},"24R-32R (8' SHLD)",8,{"$nulls":3},{"$f":"'Street Report'!C29","v":0},{"$f":"MIN(FIND({0,1,2,3,4,5,6,7,8,9},AD54&\"0123456789\"))","v":1},"","0",0,null,{"$f":"'Street Report'!J29","v":0},"-",{"$f":"'Street Report'!K29","v":0},"0-0",null,0]
[null,"TYPE SP 12.5 BIT MIXTURE FOR PATCHING","SPNWB330B",{"$nulls":4},"tons",{"$f":"C7","v":0},{"$f":"C8","v":0},{"$f":"C9","v":0},{"$f":"C10","v":0},{"$f":"C11","v":0},{"$f":"C12","v":0},{"$f":"C13","v":0},{"$f":"C14","v":0},{"$nulls":8},"24R-34R (10' SHLD)",10,{"$nulls":3},{"$f":"'Street Report'!C30","v":0},{"$f":"MIN(FIND({0,1,2,3,4,5,6,7,8,9},AD55&\"0123456789\"))","v":1},"","0",0,null,{"$f":"'Street Report'!J30","v":0},"-",{"$f":"'Street Report'!K30","v":0},"0-0",null,0]
[null,"TYPE SP 9.5 BIT MIXTURE PRODUCTION","SPNWB440B",null,null,{"$f":"'Street Report'!B9","v":0},null,{"$f":"'Street Report'!S9","v":{"v":0,"d":"0.00"}},{"$f":"IFERROR(VLOOKUP(I$55,$F56:$H56,3,FALSE),\" \")","v":0},{"$f":"IFERROR(VLOOKUP(J$55,$F56:$H56,3,FALSE),\" \")","v":0},{"$f":"IFERROR(VLOOKUP(K$55,$F56:$H56,3,FALSE),\" \")","v":0},0,0,0,0,0,{"$nulls":8},"44L-36L (8' SHLD)",8,{"$nulls":3},{"$f":"'Street Report'!C31","v":0},{"$f":"MIN(FIND({0,1,2,3,4,5,6,7,8,9},AD56&\"0123456789\"))","v":1},"","0",0,null,{"$f":"'Street Report'!J31","v":0},"-",{"$f":"'Street Report'!K31","v":0},"0-0",null,0]
[null,"TYPE SP 12.5 BIT MIXTURE PRODUCTION","SPNWB430B",null,null,{"$f":"'Street Report'!B10","v":0},null,{"$f":"'Street Report'!S10","v":{"v":0,"d":"0.00"}},{"$f":"IFERROR(VLOOKUP(I$55,$F57:$H57,3,FALSE),\" \")","v":0},0,0,0,0,0,0,0,{"$nulls":8},"46L-36L (10' SHLD)",10,{"$nulls":3},{"$f":"'Street Report'!C32","v":0},{"$f":"MIN(FIND({0,1,2,3,4,5,6,7,8,9},AD57&\"0123456789\"))","v":1},"","0",0,null,{"$f":"'Street Report'!J32","v":0},"-",{"$f":"'Street Report'!K32","v":0},"0-0",null,0]
[null,"TYPE SP 9.5 BIT MIX FOR TIGHT BLADE LEV",{"$nulls":3},{"$f":"'Street Report'!B11","v":0},null,{"$f":"'Street Report'!S11","v":{"v":0,"d":"0.00"}},0,0,0,0,0,0,0,0,{"$nulls":8},"36R-44R (8' SHLD)",8,{"$nulls":3},{"$f":"'Street Report'!C33","v":0},{"$f":"MIN(FIND({0,1,2,3,4,5,6,7,8,9},AD58&\"0123456789\"))","v":1},"","0",0,null,{"$f":"'Street Report'!J33","v":0},"-",{"$f":"'Street Report'!K33","v":0},"0-0",null,0]
[null,"TYPE SP 12.5 BIT MIX FOR TIGHT BLADE LEV",{"$nulls":3},{"$f":"'Street Report'!B12","v":0},null,{"$f":"'Street Report'!S12","v":{"v":0,"d":"0.00"}},0,0,0,0,0,0,0,0,{"$nulls":8},"36R-46R (10' SHLD)",10,{"$nulls":3},{"$f":"'Street Report'!C34","v":0},{"$f":"MIN(FIND({0,1,2,3,4,5,6,7,8,9},AD59&\"0123456789\"))","v":1},"","0",0,null,{"$f":"'Street Report'!J34","v":0},"-",{"$f":"'Street Report'!K34","v":0},"0-0",null,0]
[null,"TYPE SP 4.75 BIT MIX FOR TIGHT BLADE LEV",{"$nulls":3},{"$f":"'Street Report'!B13","v":0},null,{"$f":"'Street Report'!S13","v":{"v":0,"d":"0.00"}},0,0,0,0,0,0,0,0,{"$nulls":13},{"$f":"'Street Report'!C35","v":0},{"$f":"MIN(FIND({0,1,2,3,4,5,6,7,8,9},AD60&\"0123456789\"))","v":1},"","0",0,null,{"$f":"'Street Report'!J35","v":0},"-",{"$f":"'Street Report'!K35","v":0},"0-0",null,0]
[{"$nulls":5},{"$f":"'Street Report'!B14","v":0},null,{"$f":"'Street Report'!S14","v":{"v":0,"d":"0.00"}},0,0,0,0,0,0,0,0,{"$nulls":13},{"$f":"'Street Report'!C36","v":0},{"$f":"MIN(FIND({0,1,2,3,4,5,6,7,8,9},AD61&\"0123456789\"))","v":1},"","0",0,null,{"$f":"'Street Report'!J36","v":0},"-",{"$f":"'Street Report'!K36","v":0},"0-0",null,0]
[{"$nulls":5},{"$f":"'Street Report'!B15","v":0},null,{"$f":"'Street Report'!S15","v":{"v":0,"d":"0.00"}},0,0,0,0,0,0,0,0,{"$nulls":10},"NON-DENSITY TONS SEPARATED BY AREA TYPE"]
[{"$nulls":5},{"$f":"'Street Report'!B16","v":0},null,{"$f":"'Street Report'!S16","v":{"v":0,"d":"0.00"}},0,0,0,0,0,0,0,0,null,null,"CUSTOM WIDTH LANE",{"$nulls":7},"AREA TYPE",null,"AREA TYPE","TONS","SHLD","ENT.","MISC.","PATCH",null,{"$f":"M27","v":0},{"$f":"M28","v":0},{"$f":"M29","v":0},{"$f":"M30","v":0},null,{"$f":"IFERROR(VLOOKUP(AN63,$AB$64:$AH$64,7,0),\" \")","v":" "},{"$f":"IFERROR(VLOOKUP(AN63,$AB$65:$AH$65,7,0),\" \")","v":" "},{"$f":"IFERROR(VLOOKUP(AN63,$AB$66:$AH$66,7,0),\" \")","v":" "},{"$f":"IFERROR(VLOOKUP(AN63,$AB$67:$AH$67,7,0),\" \")","v":" "},{"$f":"IFERROR(VLOOKUP(AN63,$AB$68:$AH$68,7,0),\" \")","v":" "},{"$f":"IFERROR(VLOOKUP(AN63,$AB$69:$AH$69,7,0),\" \")","v":" "},{"$f":"IFERROR(VLOOKUP(AN63,$AB$70:$AH$70,7,0),\" \")","v":" "},{"$f":"IFERROR(VLOOKUP(AN63,$AB$71:$AH$71,7,0),\" \")","v":" "},{"$f":"IFERROR(VLOOKUP(AN63,$AB$72:$AH$72,7,0),\" \")","v":" "},{"$f":"IFERROR(VLOOKUP(AN63,$AB$73:$AH$73,7,0),\" \")","v":" "},{"$f":"IFERROR(VLOOKUP(AN63,$AB$74:$AH$74,7,0),\" \")","v":" "},{"$f":"IFERROR(VLOOKUP(AN63,$AB$75:$AH$75,7,0),\" \")","v":" "},{"$f":"IFERROR(VLOOKUP(AN63,$AB$76:$AH$76,7,0),\" \")","v":" "},{"$f":"IFERROR(VLOOKUP(AN63,$AB$77:$AH$77,7,0),\" \")","v":" "},{"$f":"IFERROR(VLOOKUP(AN63,$AB$78:$AH$78,7,0),\" \")","v":" "},{"$f":"SUM(AO63:BC63)","v":0}]
[{"$nulls":5},{"$f":"'Street Report'!B17","v":0},null,{"$f":"'Street Report'!S17","v":{"v":0,"d":"0.00"}},0,0,0,0,0,0,0,0,null,{"$f":"IFERROR(MAX(ISNUMBER(VALUE(MID('Street Report'!J9,{1,2,3,4,5,6,7,8,9},1)))*{1,2,3,4,5,6,7,8,9})+1,\" \")","v":1},{"$f":"IFERROR(VALUE(LEFT('Street Report'!J9,R64-1)),\" \")","v":" "},{"$f":"IFERROR(TRIM(RIGHT('Street Report'!J9,LEN('Street Report'!J9)-R64+1)),\" \")","v":""},{"$f":"IFERROR(IF(ISNUMBER(SEARCH(\"r\",T64)),\"-1\",\"1\")*S64,\"0\")","v":"0"},{"$f":"IFERROR(VALUE(LEFT('Street Report'!K9,Z64-1)),\" \")","v":" "},{"$f":"IFERROR(TRIM(RIGHT('Street Report'!K9,LEN('Street Report'!K9)-Z64+1)),\" \")","v":""},{"$f":"IFERROR(IF(ISNUMBER(SEARCH(\"r\",W64)),\"-1\",\"1\")*V64,\"0\")","v":"0"},{"$f":"IFERROR(ABS(X64-U64),\" \")","v":0},{"$f":"IFERROR(MAX(ISNUMBER(VALUE(MID('Street Report'!K9,{1,2,3,4,5,6,7,8,9},1)))*{1,2,3,4,5,6,7,8,9})+1,\" \")","v":1},"<6' SHOULDER",{"$f":"'Street Report'!H44","v":0},{"$f":"'Street Report'!J44","v":0},{"$f":"'Street Report'!S44","v":0},{"$f":"IFERROR(VLOOKUP($AA$64,AC64:AD64,2,FALSE),\" \")","v":" "},{"$f":"IFERROR(VLOOKUP($AA$67,AC64:AD64,2,FALSE),\" \")","v":" "},{"$f":"IFERROR(VLOOKUP($AA$66,AC64:AD64,2,FALSE),\" \")","v":" "},{"$f":"IFERROR(VLOOKUP($AA$65,AC64:AD64,2,FALSE),\" \")","v":" "},{"$f":"IFERROR(VLOOKUP($AI$63,AB64:AH64,7,0),\" \")","v":" "},{"$f":"IFERROR(VLOOKUP($AJ$63,AB64:AH64,7,0),\" \")","v":" "},{"$f":"IFERROR(VLOOKUP($AK$63,$AB64:$AH64,7,0),\" \")","v":" "},{"$f":"IFERROR(VLOOKUP($AL$63,$AB64:$AH64,7,0),\" \")","v":" "},{"$f":"IFERROR(VLOOKUP($AM$63,$AB64:$AH64,7,0),\" \")","v":" "},{"$f":"M27","v":0},{"$f":"IFERROR(VLOOKUP(AN64,$AB$64:$AH$64,7,0),\" \")","v":" "},{"$f":"IFERROR(VLOOKUP(AN64,$AB$65:$AH$65,7,0),\" \")","v":" "},{"$f":"IFERROR(VLOOKUP(AN64,$AB$66:$AH$66,7,0),\" \")","v":" "},{"$f":"IFERROR(VLOOKUP(AN64,$AB$67:$AH$67,7,0),\" \")","v":" "},{"$f":"IFERROR(VLOOKUP(AN64,$AB$68:$AH$68,7,0),\" \")","v":" "},{"$f":"IFERROR(VLOOKUP(AN64,$AB$69:$AH$69,7,0),\" \")","v":" "},{"$f":"IFERROR(VLOOKUP(AN64,$AB$70:$AH$70,7,0),\" \")","v":" "},{"$f":"IFERROR(VLOOKUP(AN64,$AB$71:$AH$71,7,0),\" \")","v":" "},{"$f":"IFERROR(VLOOKUP(AN64,$AB$72:$AH$72,7,0),\" \")","v":" "},{"$f":"IFERROR(VLOOKUP(AN64,$AB$73:$AH$73,7,0),\" \")","v":" "},{"$f":"IFERROR(VLOOKUP(AN64,$AB$74:$AH$74,7,0),\" \")","v":" "},{"$f":"IFERROR(VLOOKUP(AN64,$AB$75:$AH$75,7,0),\" \")","v":" "},{"$f":"IFERROR(VLOOKUP(AN64,$AB$76:$AH$76,7,0),\" \")","v":" "},{"$f":"IFERROR(VLOOKUP(AN64,$AB$77:$AH$77,7,0),\" \")","v":" "},{"$f":"IFERROR(VLOOKUP(AN64,$AB$78:$AH$78,7,0),\" \")","v":" "},{"$f":"SUM(AO64:BC64)","v":0}]
[{"$nulls":5},{"$f":"'Street Report'!B18","v":0},null,{"$f":"'Street Report'!S18","v":{"v":0,"d":"0.00"}},0,0,0,0,0,0,0,0,null,{"$f":"MAX(ISNUMBER(VALUE(MID('Street Report'!J10,{1,2,3,4,5,6,7,8,9},1)))*{1,2,3,4,5,6,7,8,9})+1","v":1},{"$f":"IFERROR(VALUE(LEFT('Street Report'!J10,R65-1)),\" \")","v":" "},{"$f":"IFERROR(TRIM(RIGHT('Street Report'!J10,LEN('Street Report'!J10)-R65+1)),\" \")","v":""},{"$f":"IFERROR(IF(ISNUMBER(SEARCH(\"r\",T65)),\"-1\",\"1\")*S65,\"0\")","v":"0"},{"$f":"IFERROR(VALUE(LEFT('Street Report'!K10,Z65-1)),\" \")","v":" "},{"$f":"IFERROR(TRIM(RIGHT('Street Report'!K10,LEN('Street Report'!K10)-Z65+1)),\" \")","v":""},{"$f":"IFERROR(IF(ISNUMBER(SEARCH(\"r\",W65)),\"-1\",\"1\")*V65,\"0\")","v":"0"},{"$f":"IFERROR(ABS(X65-U65),\" \")","v":0},{"$f":"IFERROR(MAX(ISNUMBER(VALUE(MID('Street Report'!K10,{1,2,3,4,5,6,7,8,9},1)))*{1,2,3,4,5,6,7,8,9})+1,\" \")","v":1},"PATCHING",{"$f":"'Street Report'!H45","v":0},{"$f":"'Street Report'!J45","v":0},{"$f":"'Street Report'!S45","v":0},{"$f":"IFERROR(VLOOKUP($AA$64,AC65:AD65,2,FALSE),\" \")","v":" "},{"$f":"IFERROR(VLOOKUP($AA$67,AC65:AD65,2,FALSE),\" \")","v":" "},{"$f":"IFERROR(VLOOKUP($AA$66,AC65:AD65,2,FALSE),\" \")","v":" "},{"$f":"IFERROR(VLOOKUP($AA$65,AC65:AD65,2,FALSE),\" \")","v":" "},{"$f":"IFERROR(VLOOKUP($AI$63,AB65:AH65,7,0),\" \")","v":" "},{"$f":"IFERROR(VLOOKUP($AJ$63,AB65:AH65,7,0),\" \")","v":" "},{"$f":"IFERROR(VLOOKUP($AK$63,$AB65:$AH65,7,0),\" \")","v":" "},{"$f":"IFERROR(VLOOKUP($AL$63,$AB65:$AH65,7,0),\" \")","v":" "},{"$f":"IFERROR(VLOOKUP($AM$63,$AB65:$AH65,7,0),\" \")","v":" "},0," "," "," "," "," "," "," "," "," "," "," "," "," "," "," ",0]
[{"$nulls":5},{"$f":"'Street Report'!B19","v":0},null,{"$f":"'Street Report'!S19","v":{"v":0,"d":"0.00"}},0,0,0,0,0,0,0,0,null,{"$f":"MAX(ISNUMBER(VALUE(MID('Street Report'!J11,{1,2,3,4,5,6,7,8,9},1)))*{1,2,3,4,5,6,7,8,9})+1","v":1},{"$f":"IFERROR(VALUE(LEFT('Street Report'!J11,R66-1)),\" \")","v":" "},{"$f":"IFERROR(TRIM(RIGHT('Street Report'!J11,LEN('Street Report'!J11)-R66+1)),\" \")","v":""},"0",{"$f":"IFERROR(VALUE(LEFT('Street Report'!K11,Z66-1)),\" \")","v":" "},{"$f":"IFERROR(TRIM(RIGHT('Street Report'!K11,LEN('Street Report'!K11)-Z66+1)),\" \")","v":""},"0",{"$f":"IFERROR(ABS(X66-U66),\" \")","v":0},{"$f":"IFERROR(MAX(ISNUMBER(VALUE(MID('Street Report'!K11,{1,2,3,4,5,6,7,8,9},1)))*{1,2,3,4,5,6,7,8,9})+1,\" \")","v":1},"MISC. ",{"$f":"'Street Report'!H46","v":0},{"$f":"'Street Report'!J46","v":0},{"$f":"'Street Report'!S46","v":0}," "," "," "," "," "," "," "," "," ",0," "," "," "," "," "," "," "," "," "," "," "," "," "," "," ",0]
[{"$nulls":5},{"$f":"'Street Report'!B20","v":0},null,{"$f":"'Street Report'!S20","v":{"v":0,"d":"0.00"}},0,0,0,0,0,0,0,0,null,{"$f":"MAX(ISNUMBER(VALUE(MID('Street Report'!J12,{1,2,3,4,5,6,7,8,9},1)))*{1,2,3,4,5,6,7,8,9})+1","v":1},{"$f":"IFERROR(VALUE(LEFT('Street Report'!J12,R67-1)),\" \")","v":" "},{"$f":"IFERROR(TRIM(RIGHT('Street Report'!J12,LEN('Street Report'!J12)-R67+1)),\" \")","v":""},"0",{"$f":"IFERROR(VALUE(LEFT('Street Report'!K12,Z67-1)),\" \")","v":" "},{"$f":"IFERROR(TRIM(RIGHT('Street Report'!K12,LEN('Street Report'!K12)-Z67+1)),\" \")","v":""},"0",0,{"$f":"IFERROR(MAX(ISNUMBER(VALUE(MID('Street Report'!K12,{1,2,3,4,5,6,7,8,9},1)))*{1,2,3,4,5,6,7,8,9})+1,\" \")","v":1},"ENTRANCE",{"$f":"'Street Report'!H47","v":0},{"$f":"'Street Report'!J47","v":0},{"$f":"'Street Report'!S47","v":0}," "," "," "," "," "," "," "," "," ",0," "," "," "," "," "," "," "," "," "," "," "," "," "," "," ",0]
[{"$nulls":5},{"$f":"'Street Report'!B21","v":0},null,{"$f":"'Street Report'!S21","v":{"v":0,"d":"0.00"}},0,0,0,0,0,0,0,0,null,{"$f":"MAX(ISNUMBER(VALUE(MID('Street Report'!J13,{1,2,3,4,5,6,7,8,9},1)))*{1,2,3,4,5,6,7,8,9})+1","v":1},{"$f":"IFERROR(VALUE(LEFT('Street Report'!J13,R68-1)),\" \")","v":" "},{"$f":"IFERROR(TRIM(RIGHT('Street Report'!J13,LEN('Street Report'!J13)-R68+1)),\" \")","v":""},"0",{"$f":"IFERROR(VALUE(LEFT('Street Report'!K13,Z68-1)),\" \")","v":" "},{"$f":"IFERROR(TRIM(RIGHT('Street Report'!K13,LEN('Street Report'!K13)-Z68+1)),\" \")","v":""},"0",0,{"$f":"IFERROR(MAX(ISNUMBER(VALUE(MID('Street Report'!K13,{1,2,3,4,5,6,7,8,9},1)))*{1,2,3,4,5,6,7,8,9})+1,\" \")","v":1},null,{"$f":"'Street Report'!H48","v":0},{"$f":"'Street Report'!J48","v":0},{"$f":"'Street Report'!S48","v":0}," "," "," "," "," "," "," "," "," ",0]
[{"$nulls":5},{"$f":"'Street Report'!B22","v":0},null,{"$f":"'Street Report'!S22","v":{"v":0,"d":"0.00"}},0,0,0,0,0,0,0,0,null,{"$f":"MAX(ISNUMBER(VALUE(MID('Street Report'!J14,{1,2,3,4,5,6,7,8,9},1)))*{1,2,3,4,5,6,7,8,9})+1","v":1},{"$f":"IFERROR(VALUE(LEFT('Street Report'!J14,R69-1)),\" \")","v":" "},{"$f":"IFERROR(TRIM(RIGHT('Street Report'!J14,LEN('Street Report'!J14)-R69+1)),\" \")","v":""},"0",{"$f":"IFERROR(VALUE(LEFT('Street Report'!K14,Z69-1)),\" \")","v":" "},{"$f":"IFERROR(TRIM(RIGHT('Street Report'!K14,LEN('Street Report'!K14)-Z69+1)),\" \")","v":""},"0",0,{"$f":"IFERROR(MAX(ISNUMBER(VALUE(MID('Street Report'!K14,{1,2,3,4,5,6,7,8,9},1)))*{1,2,3,4,5,6,7,8,9})+1,\" \")","v":1},null,{"$f":"'Street Report'!H49","v":0},{"$f":"'Street Report'!J49","v":0},{"$f":"'Street Report'!S49","v":0}," ",{"$f":"IFERROR(VLOOKUP($AA$67,AC69:AD69,2,FALSE),\" \")","v":" "}," "," "," "," "," "," "," "]
[{"$nulls":5},{"$f":"'Street Report'!B23","v":0},null,{"$f":"'Street Report'!S23","v":{"v":0,"d":"0.00"}},0,0,0,0,0,0,0,0,null,{"$f":"MAX(ISNUMBER(VALUE(MID('Street Report'!J15,{1,2,3,4,5,6,7,8,9},1)))*{1,2,3,4,5,6,7,8,9})+1","v":1},{"$f":"IFERROR(VALUE(LEFT('Street Report'!J15,R70-1)),\" \")","v":" "},{"$f":"IFERROR(TRIM(RIGHT('Street Report'!J15,LEN('Street Report'!J15)-R70+1)),\" \")","v":""},"0",{"$f":"IFERROR(VALUE(LEFT('Street Report'!K15,Z70-1)),\" \")","v":" "},{"$f":"IFERROR(TRIM(RIGHT('Street Report'!K15,LEN('Street Report'!K15)-Z70+1)),\" \")","v":""},"0",0,{"$f":"IFERROR(MAX(ISNUMBER(VALUE(MID('Street Report'!K15,{1,2,3,4,5,6,7,8,9},1)))*{1,2,3,4,5,6,7,8,9})+1,\" \")","v":1},null,{"$f":"'Street Report'!H50","v":0},{"$f":"'Street Report'!J50","v":0},{"$f":"'Street Report'!S50","v":0}," "," "," "," "," "," "," "," "," "]
[{"$nulls":5},{"$f":"'Street Report'!B24","v":0},null,{"$f":"'Street Report'!S24","v":{"v":0,"d":"0.00"}},0,0,0,0,0,0,0,0,null,{"$f":"MAX(ISNUMBER(VALUE(MID('Street Report'!J16,{1,2,3,4,5,6,7,8,9},1)))*{1,2,3,4,5,6,7,8,9})+1","v":1},{"$f":"IFERROR(VALUE(LEFT('Street Report'!J16,R71-1)),\" \")","v":" "},{"$f":"IFERROR(TRIM(RIGHT('Street Report'!J16,LEN('Street Report'!J16)-R71+1)),\" \")","v":""},"0",{"$f":"IFERROR(VALUE(LEFT('Street Report'!K16,Z71-1)),\" \")","v":" "},{"$f":"IFERROR(TRIM(RIGHT('Street Report'!K16,LEN('Street Report'!K16)-Z71+1)),\" \")","v":""},"0",0,{"$f":"IFERROR(MAX(ISNUMBER(VALUE(MID('Street Report'!K16,{1,2,3,4,5,6,7,8,9},1)))*{1,2,3,4,5,6,7,8,9})+1,\" \")","v":1},null,{"$f":"'Street Report'!H51","v":0},{"$f":"'Street Report'!J51","v":0},{"$f":"'Street Report'!S51","v":0}," "," "," "," "," "," "," "," "," "]
[{"$nulls":5},{"$f":"'Street Report'!B25","v":0},null,{"$f":"'Street Report'!S25","v":{"v":0,"d":"0.00"}},0,0,0,0,0,0,0,0,null,{"$f":"MAX(ISNUMBER(VALUE(MID('Street Report'!J17,{1,2,3,4,5,6,7,8,9},1)))*{1,2,3,4,5,6,7,8,9})+1","v":1},{"$f":"IFERROR(VALUE(LEFT('Street Report'!J17,R72-1)),\" \")","v":" "},{"$f":"IFERROR(TRIM(RIGHT('Street Report'!J17,LEN('Street Report'!J17)-R72+1)),\" \")","v":""},"0",{"$f":"IFERROR(VALUE(LEFT('Street Report'!K17,Z72-1)),\" \")","v":" "},{"$f":"IFERROR(TRIM(RIGHT('Street Report'!K17,LEN('Street Report'!K17)-Z72+1)),\" \")","v":""},"0",0,{"$f":"IFERROR(MAX(ISNUMBER(VALUE(MID('Street Report'!K17,{1,2,3,4,5,6,7,8,9},1)))*{1,2,3,4,5,6,7,8,9})+1,\" \")","v":1},null,{"$f":"'Street Report'!H52","v":0},{"$f":"'Street Report'!J52","v":0},{"$f":"'Street Report'!S52","v":0}," "," "," "," "," "," "," "," "," "]
[{"$nulls":5},{"$f":"'Street Report'!B26","v":0},null,{"$f":"'Street Report'!S26","v":{"v":0,"d":"0.00"}},0,0,0,0,0,0,0,0,null,{"$f":"MAX(ISNUMBER(VALUE(MID('Street Report'!J18,{1,2,3,4,5,6,7,8,9},1)))*{1,2,3,4,5,6,7,8,9})+1","v":1},{"$f":"IFERROR(VALUE(LEFT('Street Report'!J18,R73-1)),\" \")","v":" "},{"$f":"IFERROR(TRIM(RIGHT('Street Report'!J18,LEN('Street Report'!J18)-R73+1)),\" \")","v":""},"0",{"$f":"IFERROR(VALUE(LEFT('Street Report'!K18,Z73-1)),\" \")","v":" "},{"$f":"IFERROR(TRIM(RIGHT('Street Report'!K18,LEN('Street Report'!K18)-Z73+1)),\" \")","v":""},"0",0,{"$f":"IFERROR(MAX(ISNUMBER(VALUE(MID('Street Report'!K18,{1,2,3,4,5,6,7,8,9},1)))*{1,2,3,4,5,6,7,8,9})+1,\" \")","v":1},null,{"$f":"'Street Report'!H53","v":0},{"$f":"'Street Report'!J53","v":0},{"$f":"'Street Report'!S53","v":0}," "," "," "," "," "," "," "," "," "]
[{"$nulls":5},{"$f":"'Street Report'!B27","v":0},null,{"$f":"'Street Report'!S27","v":{"v":0,"d":"0.00"}},0,0,0,0,0,0,0,0,null,{"$f":"MAX(ISNUMBER(VALUE(MID('Street Report'!J19,{1,2,3,4,5,6,7,8,9},1)))*{1,2,3,4,5,6,7,8,9})+1","v":1},{"$f":"IFERROR(VALUE(LEFT('Street Report'!J19,R74-1)),\" \")","v":" "},{"$f":"IFERROR(TRIM(RIGHT('Street Report'!J19,LEN('Street Report'!J19)-R74+1)),\" \")","v":""},"0",{"$f":"IFERROR(VALUE(LEFT('Street Report'!K19,Z74-1)),\" \")","v":" "},{"$f":"IFERROR(TRIM(RIGHT('Street Report'!K19,LEN('Street Report'!K19)-Z74+1)),\" \")","v":""},"0",0,{"$f":"IFERROR(MAX(ISNUMBER(VALUE(MID('Street Report'!K19,{1,2,3,4,5,6,7,8,9},1)))*{1,2,3,4,5,6,7,8,9})+1,\" \")","v":1},null,{"$f":"'Street Report'!H54","v":0},{"$f":"'Street Report'!J54","v":0},{"$f":"'Street Report'!S54","v":0}," "," "," "," "," "," "," "," "," "]
[{"$nulls":5},{"$f":"'Street Report'!B28","v":0},null,{"$f":"'Street Report'!S28","v":{"v":0,"d":"0.00"}},0,0,0,0,0,0,0,0,null,{"$f":"MAX(ISNUMBER(VALUE(MID('Street Report'!J20,{1,2,3,4,5,6,7,8,9},1)))*{1,2,3,4,5,6,7,8,9})+1","v":1},{"$f":"IFERROR(VALUE(LEFT('Street Report'!J20,R75-1)),\" \")","v":" "},{"$f":"IFERROR(TRIM(RIGHT('Street Report'!J20,LEN('Street Report'!J20)-R75+1)),\" \")","v":""},"0",{"$f":"IFERROR(VALUE(LEFT('Street Report'!K20,Z75-1)),\" \")","v":" "},{"$f":"IFERROR(TRIM(RIGHT('Street Report'!K20,LEN('Street Report'!K20)-Z75+1)),\" \")","v":""},"0",0,{"$f":"IFERROR(MAX(ISNUMBER(VALUE(MID('Street Report'!K20,{1,2,3,4,5,6,7,8,9},1)))*{1,2,3,4,5,6,7,8,9})+1,\" \")","v":1},null,{"$f":"'Street Report'!H55","v":0},{"$f":"'Street Report'!J55","v":0},{"$f":"'Street Report'!S55","v":0}," "," "," "," "," "," "," "," "," "]
[{"$nulls":5},{"$f":"'Street Report'!B29","v":0},null,{"$f":"'Street Report'!S29","v":{"v":0,"d":"0.00"}},0,0,0,0,0,0,0,0,null,{"$f":"MAX(ISNUMBER(VALUE(MID('Street Report'!J21,{1,2,3,4,5,6,7,8,9},1)))*{1,2,3,4,5,6,7,8,9})+1","v":1},{"$f":"IFERROR(VALUE(LEFT('Street Report'!J21,R76-1)),\" \")","v":" "},{"$f":"IFERROR(TRIM(RIGHT('Street Report'!J21,LEN('Street Report'!J21)-R76+1)),\" \")","v":""},"0",{"$f":"IFERROR(VALUE(LEFT('Street Report'!K21,Z76-1)),\" \")","v":" "},{"$f":"IFERROR(TRIM(RIGHT('Street Report'!K21,LEN('Street Report'!K21)-Z76+1)),\" \")","v":""},"0",0,{"$f":"IFERROR(MAX(ISNUMBER(VALUE(MID('Street Report'!K21,{1,2,3,4,5,6,7,8,9},1)))*{1,2,3,4,5,6,7,8,9})+1,\" \")","v":1},null,{"$f":"'Street Report'!H56","v":0},{"$f":"'Street Report'!J56","v":0},{"$f":"'Street Report'!S56","v":0}," "," "," "," "," "," "," "," "," "]
[{"$nulls":5},{"$f":"'Street Report'!B30","v":0},null,{"$f":"'Street Report'!S30","v":{"v":0,"d":"0.00"}},0,0,0,0,0,0,0,0,null,{"$f":"MAX(ISNUMBER(VALUE(MID('Street Report'!J22,{1,2,3,4,5,6,7,8,9},1)))*{1,2,3,4,5,6,7,8,9})+1","v":1},{"$f":"IFERROR(VALUE(LEFT('Street Report'!J22,R77-1)),\" \")","v":" "},{"$f":"IFERROR(TRIM(RIGHT('Street Report'!J22,LEN('Street Report'!J22)-R77+1)),\" \")","v":""},"0",{"$f":"IFERROR(VALUE(LEFT('Street Report'!K22,Z77-1)),\" \")","v":" "},{"$f":"IFERROR(TRIM(RIGHT('Street Report'!K22,LEN('Street Report'!K22)-Z77+1)),\" \")","v":""},"0",0,{"$f":"IFERROR(MAX(ISNUMBER(VALUE(MID('Street Report'!K22,{1,2,3,4,5,6,7,8,9},1)))*{1,2,3,4,5,6,7,8,9})+1,\" \")","v":1},null,{"$f":"'Street Report'!H57","v":0},{"$f":"'Street Report'!J57","v":0},{"$f":"'Street Report'!S57","v":0}," "," "," "," "," "," "," "," "," "]
[{"$nulls":5},{"$f":"'Street Report'!B31","v":0},null,{"$f":"'Street Report'!S31","v":{"v":0,"d":"0.00"}},0,0,0,0,0,0,0,0,null,{"$f":"MAX(ISNUMBER(VALUE(MID('Street Report'!J23,{1,2,3,4,5,6,7,8,9},1)))*{1,2,3,4,5,6,7,8,9})+1","v":1},{"$f":"IFERROR(VALUE(LEFT('Street Report'!J23,R78-1)),\" \")","v":" "},{"$f":"IFERROR(TRIM(RIGHT('Street Report'!J23,LEN('Street Report'!J23)-R78+1)),\" \")","v":""},"0",{"$f":"IFERROR(VALUE(LEFT('Street Report'!K23,Z78-1)),\" \")","v":" "},{"$f":"IFERROR(TRIM(RIGHT('Street Report'!K23,LEN('Street Report'!K23)-Z78+1)),\" \")","v":""},"0",0,{"$f":"IFERROR(MAX(ISNUMBER(VALUE(MID('Street Report'!K23,{1,2,3,4,5,6,7,8,9},1)))*{1,2,3,4,5,6,7,8,9})+1,\" \")","v":1},null,{"$f":"'Street Report'!H58","v":0},{"$f":"'Street Report'!J58","v":0},{"$f":"'Street Report'!S58","v":0}," "," "," "," "," "," "," "," "," "]
[{"$nulls":5},{"$f":"'Street Report'!B32","v":0},null,{"$f":"'Street Report'!S32","v":{"v":0,"d":"0.00"}},0,0,0,0,0,0,0,0,null,{"$f":"MAX(ISNUMBER(VALUE(MID('Street Report'!J24,{1,2,3,4,5,6,7,8,9},1)))*{1,2,3,4,5,6,7,8,9})+1","v":1},{"$f":"IFERROR(VALUE(LEFT('Street Report'!J24,R79-1)),\" \")","v":" "},{"$f":"IFERROR(TRIM(RIGHT('Street Report'!J24,LEN('Street Report'!J24)-R79+1)),\" \")","v":""},"0",{"$f":"IFERROR(VALUE(LEFT('Street Report'!K24,Z79-1)),\" \")","v":" "},{"$f":"IFERROR(TRIM(RIGHT('Street Report'!K24,LEN('Street Report'!K24)-Z79+1)),\" \")","v":""},"0",0,{"$f":"IFERROR(MAX(ISNUMBER(VALUE(MID('Street Report'!K24,{1,2,3,4,5,6,7,8,9},1)))*{1,2,3,4,5,6,7,8,9})+1,\" \")","v":1},null,{"$f":"'Street Report'!H59","v":0},null,"TOTAL",{"$f":"SUM(AE64:AE78)","v":0},{"$f":"SUM(AF64:AF78)","v":0},0,{"$f":"SUM(AH64:AH78)","v":0},{"$f":"SUM(AI64:AI78)","v":0},{"$f":"SUM(AJ64:AJ78)","v":0},0,0,0]
[{"$nulls":5},{"$f":"'Street Report'!B33","v":0},null,{"$f":"'Street Report'!S33","v":{"v":0,"d":"0.00"}},0,0,0,0,0,0,0,0,null,{"$f":"MAX(ISNUMBER(VALUE(MID('Street Report'!J25,{1,2,3,4,5,6,7,8,9},1)))*{1,2,3,4,5,6,7,8,9})+1","v":1},{"$f":"IFERROR(VALUE(LEFT('Street Report'!J25,R80-1)),\" \")","v":" "},{"$f":"IFERROR(TRIM(RIGHT('Street Report'!J25,LEN('Street Report'!J25)-R80+1)),\" \")","v":""},"0",{"$f":"IFERROR(VALUE(LEFT('Street Report'!K25,Z80-1)),\" \")","v":" "},{"$f":"IFERROR(TRIM(RIGHT('Street Report'!K25,LEN('Street Report'!K25)-Z80+1)),\" \")","v":""},"0",0,{"$f":"IFERROR(MAX(ISNUMBER(VALUE(MID('Street Report'!K25,{1,2,3,4,5,6,7,8,9},1)))*{1,2,3,4,5,6,7,8,9})+1,\" \")","v":1}]
[{"$nulls":5},{"$f":"'Street Report'!B34","v":0},null,{"$f":"'Street Report'!S34","v":{"v":0,"d":"0.00"}},0,0,0,0,0,0,0,0,null,{"$f":"MAX(ISNUMBER(VALUE(MID('Street Report'!J26,{1,2,3,4,5,6,7,8,9},1)))*{1,2,3,4,5,6,7,8,9})+1","v":1},{"$f":"IFERROR(VALUE(LEFT('Street Report'!J26,R81-1)),\" \")","v":" "},{"$f":"IFERROR(TRIM(RIGHT('Street Report'!J26,LEN('Street Report'!J26)-R81+1)),\" \")","v":""},"0",{"$f":"IFERROR(VALUE(LEFT('Street Report'!K26,Z81-1)),\" \")","v":" "},{"$f":"IFERROR(TRIM(RIGHT('Street Report'!K26,LEN('Street Report'!K26)-Z81+1)),\" \")","v":""},"0",0,{"$f":"IFERROR(MAX(ISNUMBER(VALUE(MID('Street Report'!K26,{1,2,3,4,5,6,7,8,9},1)))*{1,2,3,4,5,6,7,8,9})+1,\" \")","v":1},"NON-DENSITY TONS SEPARATED BY AREA TYPE",{"$nulls":7},"Density SY",{"$f":"'Street Report'!R37","v":0}]
[{"$nulls":5},{"$f":"'Street Report'!B35","v":0},null,{"$f":"'Street Report'!S35","v":{"v":0,"d":"0.00"}},0,0,0,0,0,0,0,0,null,{"$f":"MAX(ISNUMBER(VALUE(MID('Street Report'!J27,{1,2,3,4,5,6,7,8,9},1)))*{1,2,3,4,5,6,7,8,9})+1","v":1},{"$f":"IFERROR(VALUE(LEFT('Street Report'!J27,R82-1)),\" \")","v":" "},{"$f":"IFERROR(TRIM(RIGHT('Street Report'!J27,LEN('Street Report'!J27)-R82+1)),\" \")","v":""},"0",{"$f":"IFERROR(VALUE(LEFT('Street Report'!K27,Z82-1)),\" \")","v":" "},{"$f":"IFERROR(TRIM(RIGHT('Street Report'!K27,LEN('Street Report'!K27)-Z82+1)),\" \")","v":""},"0",0,{"$f":"IFERROR(MAX(ISNUMBER(VALUE(MID('Street Report'!K27,{1,2,3,4,5,6,7,8,9},1)))*{1,2,3,4,5,6,7,8,9})+1,\" \")","v":1},"AREA TYPE",null,"AREA TYPE","SY YDS","SHLD","ENT.","MISC.","PATCH","Non-density SY",{"$f":"'Street Report'!R59","v":0}]
[{"$nulls":5},{"$f":"'Street Report'!B36","v":0},null,{"$f":"'Street Report'!S36","v":{"v":0,"d":"0.00"}},0,0,0,0,0,0,0,0,null,{"$f":"MAX(ISNUMBER(VALUE(MID('Street Report'!J28,{1,2,3,4,5,6,7,8,9},1)))*{1,2,3,4,5,6,7,8,9})+1","v":1},{"$f":"IFERROR(VALUE(LEFT('Street Report'!J28,R83-1)),\" \")","v":" "},{"$f":"IFERROR(TRIM(RIGHT('Street Report'!J28,LEN('Street Report'!J28)-R83+1)),\" \")","v":""},"0",{"$f":"IFERROR(VALUE(LEFT('Street Report'!K28,Z83-1)),\" \")","v":" "},{"$f":"IFERROR(TRIM(RIGHT('Street Report'!K28,LEN('Street Report'!K28)-Z83+1)),\" \")","v":""},"0",0,{"$f":"IFERROR(MAX(ISNUMBER(VALUE(MID('Street Report'!K28,{1,2,3,4,5,6,7,8,9},1)))*{1,2,3,4,5,6,7,8,9})+1,\" \")","v":1},"<6' SHOULDER",{"$f":"'Street Report'!H63","v":0},{"$f":"'Street Report'!J44","v":0},{"$f":"'Street Report'!R44","v":0},{"$f":"IFERROR(VLOOKUP($AA$64,AC83:AD83,2,FALSE),\" \")","v":" "},{"$f":"IFERROR(VLOOKUP($AA$67,AC83:AD83,2,FALSE),\" \")","v":" "},{"$f":"IFERROR(VLOOKUP($AA$66,AC83:AD83,2,FALSE),\" \")","v":" "},{"$f":"IFERROR(VLOOKUP($AA$65,AC83:AD83,2,FALSE),\" \")","v":" "},"Patching SY",{"$f":"AH98","v":0}]
[{"$nulls":4},"denseity tons",null,null,{"$f":"SUM(H56:H83)","v":{"v":0,"d":"0.00"}},{"$f":"SUM(I56:I83)","v":{"v":0,"d":"0.00"}},{"v":0,"d":"0.00"},{"v":0,"d":"0.00"},{"v":0,"d":"0.00"},{"$f":"SUM(M56:M83)","v":{"v":0,"d":"0.00"}},{"$f":"SUM(N56:N83)","v":{"v":0,"d":"0.00"}},{"$f":"SUM(O56:O83)","v":{"v":0,"d":"0.00"}},{"v":0,"d":"0.00"},null,{"$f":"MAX(ISNUMBER(VALUE(MID('Street Report'!J29,{1,2,3,4,5,6,7,8,9},1)))*{1,2,3,4,5,6,7,8,9})+1","v":1},{"$f":"IFERROR(VALUE(LEFT('Street Report'!J29,R84-1)),\" \")","v":" "},{"$f":"IFERROR(TRIM(RIGHT('Street Report'!J29,LEN('Street Report'!J29)-R84+1)),\" \")","v":""},"0",{"$f":"IFERROR(VALUE(LEFT('Street Report'!K29,Z84-1)),\" \")","v":" "},{"$f":"IFERROR(TRIM(RIGHT('Street Report'!K29,LEN('Street Report'!K29)-Z84+1)),\" \")","v":""},"0",0,{"$f":"IFERROR(MAX(ISNUMBER(VALUE(MID('Street Report'!K29,{1,2,3,4,5,6,7,8,9},1)))*{1,2,3,4,5,6,7,8,9})+1,\" \")","v":1},"PATCHING",{"$f":"'Street Report'!H64","v":0},{"$f":"'Street Report'!J45","v":0},{"$f":"'Street Report'!R45","v":0},{"$f":"IFERROR(VLOOKUP($AA$64,AC84:AD84,2,FALSE),\" \")","v":" "},{"$f":"IFERROR(VLOOKUP($AA$67,AC84:AD84,2,FALSE),\" \")","v":" "},{"$f":"IFERROR(VLOOKUP($AA$66,AC84:AD84,2,FALSE),\" \")","v":" "},{"$f":"IFERROR(VLOOKUP($AA$65,AC84:AD84,2,FALSE),\" \")","v":" "},"TOTAL = ",{"$f":"MROUND(AJ81+AJ82-AJ83,(1+(MOD(AJ81+AJ82-AJ83*10^(1),10)=5))/10^0)","v":{"v":0,"d":"0.00"}}]
[{"$nulls":5},{"$f":"'Street Report'!H44","v":0},null,{"$f":"'Street Report'!S44","v":{"v":0,"d":"0.00"}},{"$f":"IFERROR(IF('Street Report'!$J44=\"PATCHING\",\"\",VLOOKUP(I$55,$F85:$H85,3,FALSE)),\" \")","v":0},{"$f":"IFERROR(IF('Street Report'!$J44=\"PATCHING\",\"\",VLOOKUP(J$55,$F85:$H85,3,FALSE)),\" \")","v":0},{"$f":"IFERROR(IF('Street Report'!$J44=\"PATCHING\",\"\",VLOOKUP(K$55,$F85:$H85,3,FALSE)),\" \")","v":0},{"$f":"IFERROR(IF('Street Report'!$J44=\"PATCHING\",\"\",VLOOKUP(L$55,$F85:$H85,3,FALSE)),\" \")","v":0},{"$f":"IFERROR(IF('Street Report'!$J44=\"PATCHING\",\"\",VLOOKUP(M$55,$F85:$H85,3,FALSE)),\" \")","v":0},{"$f":"IFERROR(IF('Street Report'!$J44=\"PATCHING\",\"\",VLOOKUP(N$55,$F85:$H85,3,FALSE)),\" \")","v":0},{"$f":"IFERROR(IF('Street Report'!$J44=\"PATCHING\",\"\",VLOOKUP(O$55,$F85:$H85,3,FALSE)),\" \")","v":0},{"$f":"IFERROR(IF('Street Report'!$J44=\"PATCHING\",\"\",VLOOKUP(P$55,$F85:$H85,3,FALSE)),\" \")","v":0},null,{"$f":"MAX(ISNUMBER(VALUE(MID('Street Report'!J30,{1,2,3,4,5,6,7,8,9},1)))*{1,2,3,4,5,6,7,8,9})+1","v":1},{"$f":"IFERROR(VALUE(LEFT('Street Report'!J30,R85-1)),\" \")","v":" "},{"$f":"IFERROR(TRIM(RIGHT('Street Report'!J30,LEN('Street Report'!J30)-R85+1)),\" \")","v":""},"0",{"$f":"IFERROR(VALUE(LEFT('Street Report'!K30,Z85-1)),\" \")","v":" "},{"$f":"IFERROR(TRIM(RIGHT('Street Report'!K30,LEN('Street Report'!K30)-Z85+1)),\" \")","v":""},"0",0,{"$f":"IFERROR(MAX(ISNUMBER(VALUE(MID('Street Report'!K30,{1,2,3,4,5,6,7,8,9},1)))*{1,2,3,4,5,6,7,8,9})+1,\" \")","v":1},"MISC. ",{"$f":"'Street Report'!H65","v":0},{"$f":"'Street Report'!J46","v":0},{"$f":"'Street Report'!R46","v":0}," "," "," "," "]
[{"$nulls":5},{"$f":"'Street Report'!H45","v":0},null,{"$f":"'Street Report'!S45","v":{"v":0,"d":"0.00"}},{"$f":"IFERROR(IF('Street Report'!$J45=\"PATCHING\",\"\",VLOOKUP(I$55,$F86:$H86,3,FALSE)),\" \")","v":0},{"$f":"IFERROR(IF('Street Report'!$J45=\"PATCHING\",\"\",VLOOKUP(J$55,$F86:$H86,3,FALSE)),\" \")","v":0},{"$f":"IFERROR(IF('Street Report'!$J45=\"PATCHING\",\"\",VLOOKUP(K$55,$F86:$H86,3,FALSE)),\" \")","v":0},{"$f":"IFERROR(IF('Street Report'!$J45=\"PATCHING\",\"\",VLOOKUP(L$55,$F86:$H86,3,FALSE)),\" \")","v":0},{"$f":"IFERROR(IF('Street Report'!$J45=\"PATCHING\",\"\",VLOOKUP(M$55,$F86:$H86,3,FALSE)),\" \")","v":0},{"$f":"IFERROR(IF('Street Report'!$J45=\"PATCHING\",\"\",VLOOKUP(N$55,$F86:$H86,3,FALSE)),\" \")","v":0},{"$f":"IFERROR(IF('Street Report'!$J45=\"PATCHING\",\"\",VLOOKUP(O$55,$F86:$H86,3,FALSE)),\" \")","v":0},{"$f":"IFERROR(IF('Street Report'!$J45=\"PATCHING\",\"\",VLOOKUP(P$55,$F86:$H86,3,FALSE)),\" \")","v":0},null,{"$f":"MAX(ISNUMBER(VALUE(MID('Street Report'!J31,{1,2,3,4,5,6,7,8,9},1)))*{1,2,3,4,5,6,7,8,9})+1","v":1},{"$f":"IFERROR(VALUE(LEFT('Street Report'!J31,R86-1)),\" \")","v":" "},{"$f":"IFERROR(TRIM(RIGHT('Street Report'!J31,LEN('Street Report'!J31)-R86+1)),\" \")","v":""},"0",{"$f":"IFERROR(VALUE(LEFT('Street Report'!K31,Z86-1)),\" \")","v":" "},{"$f":"IFERROR(TRIM(RIGHT('Street Report'!K31,LEN('Street Report'!K31)-Z86+1)),\" \")","v":""},"0",0,{"$f":"IFERROR(MAX(ISNUMBER(VALUE(MID('Street Report'!K31,{1,2,3,4,5,6,7,8,9},1)))*{1,2,3,4,5,6,7,8,9})+1,\" \")","v":1},"ENTRANCE",{"$f":"'Street Report'!H66","v":0},{"$f":"'Street Report'!J47","v":0},{"$f":"'Street Report'!R47","v":0}," "," "," "," "]
[{"$nulls":5},{"$f":"'Street Report'!H46","v":0},null,{"$f":"'Street Report'!S46","v":{"v":0,"d":"0.00"}},{"$f":"IFERROR(IF('Street Report'!$J46=\"PATCHING\",\"\",VLOOKUP(I$55,$F87:$H87,3,FALSE)),\" \")","v":0},{"$f":"IFERROR(IF('Street Report'!$J46=\"PATCHING\",\"\",VLOOKUP(J$55,$F87:$H87,3,FALSE)),\" \")","v":0},{"$f":"IFERROR(IF('Street Report'!$J46=\"PATCHING\",\"\",VLOOKUP(K$55,$F87:$H87,3,FALSE)),\" \")","v":0},{"$f":"IFERROR(IF('Street Report'!$J46=\"PATCHING\",\"\",VLOOKUP(L$55,$F87:$H87,3,FALSE)),\" \")","v":0},{"$f":"IFERROR(IF('Street Report'!$J46=\"PATCHING\",\"\",VLOOKUP(M$55,$F87:$H87,3,FALSE)),\" \")","v":0},{"$f":"IFERROR(IF('Street Report'!$J46=\"PATCHING\",\"\",VLOOKUP(N$55,$F87:$H87,3,FALSE)),\" \")","v":0},{"$f":"IFERROR(IF('Street Report'!$J46=\"PATCHING\",\"\",VLOOKUP(O$55,$F87:$H87,3,FALSE)),\" \")","v":0},{"$f":"IFERROR(IF('Street Report'!$J46=\"PATCHING\",\"\",VLOOKUP(P$55,$F87:$H87,3,FALSE)),\" \")","v":0},null,{"$f":"MAX(ISNUMBER(VALUE(MID('Street Report'!J32,{1,2,3,4,5,6,7,8,9},1)))*{1,2,3,4,5,6,7,8,9})+1","v":1},{"$f":"IFERROR(VALUE(LEFT('Street Report'!J32,R87-1)),\" \")","v":" "},{"$f":"IFERROR(TRIM(RIGHT('Street Report'!J32,LEN('Street Report'!J32)-R87+1)),\" \")","v":""},"0",{"$f":"IFERROR(VALUE(LEFT('Street Report'!K32,Z87-1)),\" \")","v":" "},{"$f":"IFERROR(TRIM(RIGHT('Street Report'!K32,LEN('Street Report'!K32)-Z87+1)),\" \")","v":""},"0",0,{"$f":"IFERROR(MAX(ISNUMBER(VALUE(MID('Street Report'!K32,{1,2,3,4,5,6,7,8,9},1)))*{1,2,3,4,5,6,7,8,9})+1,\" \")","v":1},null,{"$f":"'Street Report'!H67","v":0},{"$f":"'Street Report'!J48","v":0},{"$f":"'Street Report'!R48","v":0}," "," "," "," "]
[{"$nulls":5},{"$f":"'Street Report'!H47","v":0},null,{"$f":"'Street Report'!S47","v":{"v":0,"d":"0.00"}},{"$f":"IFERROR(IF('Street Report'!$J47=\"PATCHING\",\"\",VLOOKUP(I$55,$F88:$H88,3,FALSE)),\" \")","v":0},{"$f":"IFERROR(IF('Street Report'!$J47=\"PATCHING\",\"\",VLOOKUP(J$55,$F88:$H88,3,FALSE)),\" \")","v":0},{"$f":"IFERROR(IF('Street Report'!$J47=\"PATCHING\",\"\",VLOOKUP(K$55,$F88:$H88,3,FALSE)),\" \")","v":0},{"$f":"IFERROR(IF('Street Report'!$J47=\"PATCHING\",\"\",VLOOKUP(L$55,$F88:$H88,3,FALSE)),\" \")","v":0},{"$f":"IFERROR(IF('Street Report'!$J47=\"PATCHING\",\"\",VLOOKUP(M$55,$F88:$H88,3,FALSE)),\" \")","v":0},{"$f":"IFERROR(IF('Street Report'!$J47=\"PATCHING\",\"\",VLOOKUP(N$55,$F88:$H88,3,FALSE)),\" \")","v":0},{"$f":"IFERROR(IF('Street Report'!$J47=\"PATCHING\",\"\",VLOOKUP(O$55,$F88:$H88,3,FALSE)),\" \")","v":0},{"$f":"IFERROR(IF('Street Report'!$J47=\"PATCHING\",\"\",VLOOKUP(P$55,$F88:$H88,3,FALSE)),\" \")","v":0},null,{"$f":"MAX(ISNUMBER(VALUE(MID('Street Report'!J33,{1,2,3,4,5,6,7,8,9},1)))*{1,2,3,4,5,6,7,8,9})+1","v":1},{"$f":"IFERROR(VALUE(LEFT('Street Report'!J33,R88-1)),\" \")","v":" "},{"$f":"IFERROR(TRIM(RIGHT('Street Report'!J33,LEN('Street Report'!J33)-R88+1)),\" \")","v":""},"0",{"$f":"IFERROR(VALUE(LEFT('Street Report'!K33,Z88-1)),\" \")","v":" "},{"$f":"IFERROR(TRIM(RIGHT('Street Report'!K33,LEN('Street Report'!K33)-Z88+1)),\" \")","v":""},"0",0,{"$f":"IFERROR(MAX(ISNUMBER(VALUE(MID('Street Report'!K33,{1,2,3,4,5,6,7,8,9},1)))*{1,2,3,4,5,6,7,8,9})+1,\" \")","v":1},null,{"$f":"'Street Report'!H68","v":0},{"$f":"'Street Report'!J49","v":0},{"$f":"'Street Report'!R49","v":0}," ",{"$f":"IFERROR(VLOOKUP($AA$67,AC88:AD88,2,FALSE),\" \")","v":" "}," "," "]
[{"$nulls":5},{"$f":"'Street Report'!H48","v":0},null,{"$f":"'Street Report'!S48","v":{"v":0,"d":"0.00"}},{"$f":"IFERROR(IF('Street Report'!$J48=\"PATCHING\",\"\",VLOOKUP(I$55,$F89:$H89,3,FALSE)),\" \")","v":0},{"$f":"IFERROR(IF('Street Report'!$J48=\"PATCHING\",\"\",VLOOKUP(J$55,$F89:$H89,3,FALSE)),\" \")","v":0},{"$f":"IFERROR(IF('Street Report'!$J48=\"PATCHING\",\"\",VLOOKUP(K$55,$F89:$H89,3,FALSE)),\" \")","v":0},{"$f":"IFERROR(IF('Street Report'!$J48=\"PATCHING\",\"\",VLOOKUP(L$55,$F89:$H89,3,FALSE)),\" \")","v":0},{"$f":"IFERROR(IF('Street Report'!$J48=\"PATCHING\",\"\",VLOOKUP(M$55,$F89:$H89,3,FALSE)),\" \")","v":0},{"$f":"IFERROR(IF('Street Report'!$J48=\"PATCHING\",\"\",VLOOKUP(N$55,$F89:$H89,3,FALSE)),\" \")","v":0},{"$f":"IFERROR(IF('Street Report'!$J48=\"PATCHING\",\"\",VLOOKUP(O$55,$F89:$H89,3,FALSE)),\" \")","v":0},{"$f":"IFERROR(IF('Street Report'!$J48=\"PATCHING\",\"\",VLOOKUP(P$55,$F89:$H89,3,FALSE)),\" \")","v":0},null,{"$f":"MAX(ISNUMBER(VALUE(MID('Street Report'!J34,{1,2,3,4,5,6,7,8,9},1)))*{1,2,3,4,5,6,7,8,9})+1","v":1},{"$f":"IFERROR(VALUE(LEFT('Street Report'!J34,R89-1)),\" \")","v":" "},{"$f":"IFERROR(TRIM(RIGHT('Street Report'!J34,LEN('Street Report'!J34)-R89+1)),\" \")","v":""},"0",{"$f":"IFERROR(VALUE(LEFT('Street Report'!K34,Z89-1)),\" \")","v":" "},{"$f":"IFERROR(TRIM(RIGHT('Street Report'!K34,LEN('Street Report'!K34)-Z89+1)),\" \")","v":""},"0",0,{"$f":"IFERROR(MAX(ISNUMBER(VALUE(MID('Street Report'!K34,{1,2,3,4,5,6,7,8,9},1)))*{1,2,3,4,5,6,7,8,9})+1,\" \")","v":1},null,{"$f":"'Street Report'!H69","v":0},{"$f":"'Street Report'!J50","v":0},{"$f":"'Street Report'!R50","v":0}," ",{"$f":"IFERROR(VLOOKUP($AA$67,AC89:AD89,2,FALSE),\" \")","v":" "}," "," "]
[{"$nulls":5},{"$f":"'Street Report'!H49","v":0},null,{"$f":"'Street Report'!S49","v":{"v":0,"d":"0.00"}},{"$f":"IFERROR(IF('Street Report'!$J49=\"PATCHING\",\"\",VLOOKUP(I$55,$F90:$H90,3,FALSE)),\" \")","v":0},{"$f":"IFERROR(IF('Street Report'!$J49=\"PATCHING\",\"\",VLOOKUP(J$55,$F90:$H90,3,FALSE)),\" \")","v":0},{"$f":"IFERROR(IF('Street Report'!$J49=\"PATCHING\",\"\",VLOOKUP(K$55,$F90:$H90,3,FALSE)),\" \")","v":0},{"$f":"IFERROR(IF('Street Report'!$J49=\"PATCHING\",\"\",VLOOKUP(L$55,$F90:$H90,3,FALSE)),\" \")","v":0},{"$f":"IFERROR(IF('Street Report'!$J49=\"PATCHING\",\"\",VLOOKUP(M$55,$F90:$H90,3,FALSE)),\" \")","v":0},{"$f":"IFERROR(IF('Street Report'!$J49=\"PATCHING\",\"\",VLOOKUP(N$55,$F90:$H90,3,FALSE)),\" \")","v":0},{"$f":"IFERROR(IF('Street Report'!$J49=\"PATCHING\",\"\",VLOOKUP(O$55,$F90:$H90,3,FALSE)),\" \")","v":0},{"$f":"IFERROR(IF('Street Report'!$J49=\"PATCHING\",\"\",VLOOKUP(P$55,$F90:$H90,3,FALSE)),\" \")","v":0},null,{"$f":"MAX(ISNUMBER(VALUE(MID('Street Report'!J35,{1,2,3,4,5,6,7,8,9},1)))*{1,2,3,4,5,6,7,8,9})+1","v":1},{"$f":"IFERROR(VALUE(LEFT('Street Report'!J35,R90-1)),\" \")","v":" "},{"$f":"IFERROR(TRIM(RIGHT('Street Report'!J35,LEN('Street Report'!J35)-R90+1)),\" \")","v":""},"0",{"$f":"IFERROR(VALUE(LEFT('Street Report'!K35,Z90-1)),\" \")","v":" "},{"$f":"IFERROR(TRIM(RIGHT('Street Report'!K35,LEN('Street Report'!K35)-Z90+1)),\" \")","v":""},"0",0,{"$f":"IFERROR(MAX(ISNUMBER(VALUE(MID('Street Report'!K35,{1,2,3,4,5,6,7,8,9},1)))*{1,2,3,4,5,6,7,8,9})+1,\" \")","v":1},null,{"$f":"'Street Report'!H70","v":0},{"$f":"'Street Report'!J51","v":0},{"$f":"'Street Report'!R51","v":0}," "," "," "," "]
[{"$nulls":5},{"$f":"'Street Report'!H50","v":0},null,{"$f":"'Street Report'!S50","v":{"v":0,"d":"0.00"}},{"$f":"IFERROR(IF('Street Report'!$J50=\"PATCHING\",\"\",VLOOKUP(I$55,$F91:$H91,3,FALSE)),\" \")","v":0},{"$f":"IFERROR(IF('Street Report'!$J50=\"PATCHING\",\"\",VLOOKUP(J$55,$F91:$H91,3,FALSE)),\" \")","v":0},{"$f":"IFERROR(IF('Street Report'!$J50=\"PATCHING\",\"\",VLOOKUP(K$55,$F91:$H91,3,FALSE)),\" \")","v":0},{"$f":"IFERROR(IF('Street Report'!$J50=\"PATCHING\",\"\",VLOOKUP(L$55,$F91:$H91,3,FALSE)),\" \")","v":0},{"$f":"IFERROR(IF('Street Report'!$J50=\"PATCHING\",\"\",VLOOKUP(M$55,$F91:$H91,3,FALSE)),\" \")","v":0},{"$f":"IFERROR(IF('Street Report'!$J50=\"PATCHING\",\"\",VLOOKUP(N$55,$F91:$H91,3,FALSE)),\" \")","v":0},{"$f":"IFERROR(IF('Street Report'!$J50=\"PATCHING\",\"\",VLOOKUP(O$55,$F91:$H91,3,FALSE)),\" \")","v":0},{"$f":"IFERROR(IF('Street Report'!$J50=\"PATCHING\",\"\",VLOOKUP(P$55,$F91:$H91,3,FALSE)),\" \")","v":0},null,{"$f":"MAX(ISNUMBER(VALUE(MID('Street Report'!J36,{1,2,3,4,5,6,7,8,9},1)))*{1,2,3,4,5,6,7,8,9})+1","v":1},{"$f":"IFERROR(VALUE(LEFT('Street Report'!J36,R91-1)),\" \")","v":" "},{"$f":"IFERROR(TRIM(RIGHT('Street Report'!J36,LEN('Street Report'!J36)-R91+1)),\" \")","v":""},"0",{"$f":"IFERROR(VALUE(LEFT('Street Report'!K36,Z91-1)),\" \")","v":" "},{"$f":"IFERROR(TRIM(RIGHT('Street Report'!K36,LEN('Street Report'!K36)-Z91+1)),\" \")","v":""},"0",0,{"$f":"IFERROR(MAX(ISNUMBER(VALUE(MID('Street Report'!K36,{1,2,3,4,5,6,7,8,9},1)))*{1,2,3,4,5,6,7,8,9})+1,\" \")","v":1},null,{"$f":"'Street Report'!H71","v":0},{"$f":"'Street Report'!J52","v":0},{"$f":"'Street Report'!R52","v":0}," "," "," "," "]
[{"$nulls":5},{"$f":"'Street Report'!H51","v":0},null,{"$f":"'Street Report'!S51","v":{"v":0,"d":"0.00"}},{"$f":"IFERROR(IF('Street Report'!$J51=\"PATCHING\",\"\",VLOOKUP(I$55,$F92:$H92,3,FALSE)),\" \")","v":0},{"$f":"IFERROR(IF('Street Report'!$J51=\"PATCHING\",\"\",VLOOKUP(J$55,$F92:$H92,3,FALSE)),\" \")","v":0},{"$f":"IFERROR(IF('Street Report'!$J51=\"PATCHING\",\"\",VLOOKUP(K$55,$F92:$H92,3,FALSE)),\" \")","v":0},{"$f":"IFERROR(IF('Street Report'!$J51=\"PATCHING\",\"\",VLOOKUP(L$55,$F92:$H92,3,FALSE)),\" \")","v":0},{"$f":"IFERROR(IF('Street Report'!$J51=\"PATCHING\",\"\",VLOOKUP(M$55,$F92:$H92,3,FALSE)),\" \")","v":0},{"$f":"IFERROR(IF('Street Report'!$J51=\"PATCHING\",\"\",VLOOKUP(N$55,$F92:$H92,3,FALSE)),\" \")","v":0},{"$f":"IFERROR(IF('Street Report'!$J51=\"PATCHING\",\"\",VLOOKUP(O$55,$F92:$H92,3,FALSE)),\" \")","v":0},{"$f":"IFERROR(IF('Street Report'!$J51=\"PATCHING\",\"\",VLOOKUP(P$55,$F92:$H92,3,FALSE)),\" \")","v":0},{"$nulls":11},{"$f":"'Street Report'!H72","v":0},{"$f":"'Street Report'!J53","v":0},{"$f":"'Street Report'!R53","v":0}," "," "," "," "]
[{"$nulls":5},{"$f":"'Street Report'!H52","v":0},null,{"$f":"'Street Report'!S52","v":{"v":0,"d":"0.00"}},{"$f":"IFERROR(IF('Street Report'!$J52=\"PATCHING\",\"\",VLOOKUP(I$55,$F93:$H93,3,FALSE)),\" \")","v":0},{"$f":"IFERROR(IF('Street Report'!$J52=\"PATCHING\",\"\",VLOOKUP(J$55,$F93:$H93,3,FALSE)),\" \")","v":0},{"$f":"IFERROR(IF('Street Report'!$J52=\"PATCHING\",\"\",VLOOKUP(K$55,$F93:$H93,3,FALSE)),\" \")","v":0},{"$f":"IFERROR(IF('Street Report'!$J52=\"PATCHING\",\"\",VLOOKUP(L$55,$F93:$H93,3,FALSE)),\" \")","v":0},{"$f":"IFERROR(IF('Street Report'!$J52=\"PATCHING\",\"\",VLOOKUP(M$55,$F93:$H93,3,FALSE)),\" \")","v":0},{"$f":"IFERROR(IF('Street Report'!$J52=\"PATCHING\",\"\",VLOOKUP(N$55,$F93:$H93,3,FALSE)),\" \")","v":0},{"$f":"IFERROR(IF('Street Report'!$J52=\"PATCHING\",\"\",VLOOKUP(O$55,$F93:$H93,3,FALSE)),\" \")","v":0},{"$f":"IFERROR(IF('Street Report'!$J52=\"PATCHING\",\"\",VLOOKUP(P$55,$F93:$H93,3,FALSE)),\" \")","v":0},{"$nulls":11},{"$f":"'Street Report'!H73","v":0},{"$f":"'Street Report'!J54","v":0},{"$f":"'Street Report'!R54","v":0}," "," "," "," "]
[{"$nulls":5},{"$f":"'Street Report'!H53","v":0},null,{"$f":"'Street Report'!S53","v":{"v":0,"d":"0.00"}},{"$f":"IFERROR(IF('Street Report'!$J53=\"PATCHING\",\"\",VLOOKUP(I$55,$F94:$H94,3,FALSE)),\" \")","v":0},{"$f":"IFERROR(IF('Street Report'!$J53=\"PATCHING\",\"\",VLOOKUP(J$55,$F94:$H94,3,FALSE)),\" \")","v":0},{"$f":"IFERROR(IF('Street Report'!$J53=\"PATCHING\",\"\",VLOOKUP(K$55,$F94:$H94,3,FALSE)),\" \")","v":0},{"$f":"IFERROR(IF('Street Report'!$J53=\"PATCHING\",\"\",VLOOKUP(L$55,$F94:$H94,3,FALSE)),\" \")","v":0},{"$f":"IFERROR(IF('Street Report'!$J53=\"PATCHING\",\"\",VLOOKUP(M$55,$F94:$H94,3,FALSE)),\" \")","v":0},{"$f":"IFERROR(IF('Street Report'!$J53=\"PATCHING\",\"\",VLOOKUP(N$55,$F94:$H94,3,FALSE)),\" \")","v":0},{"$f":"IFERROR(IF('Street Report'!$J53=\"PATCHING\",\"\",VLOOKUP(O$55,$F94:$H94,3,FALSE)),\" \")","v":0},{"$f":"IFERROR(IF('Street Report'!$J53=\"PATCHING\",\"\",VLOOKUP(P$55,$F94:$H94,3,FALSE)),\" \")","v":0},{"$nulls":11},{"$f":"'Street Report'!H74","v":0},{"$f":"'Street Report'!J55","v":0},{"$f":"'Street Report'!R55","v":0}," "," "," "," "]
[{"$nulls":5},{"$f":"'Street Report'!H54","v":0},null,{"$f":"'Street Report'!S54","v":{"v":0,"d":"0.00"}},{"$f":"IFERROR(IF('Street Report'!$J54=\"PATCHING\",\"\",VLOOKUP(I$55,$F95:$H95,3,FALSE)),\" \")","v":0},{"$f":"IFERROR(IF('Street Report'!$J54=\"PATCHING\",\"\",VLOOKUP(J$55,$F95:$H95,3,FALSE)),\" \")","v":0},{"$f":"IFERROR(IF('Street Report'!$J54=\"PATCHING\",\"\",VLOOKUP(K$55,$F95:$H95,3,FALSE)),\" \")","v":0},{"$f":"IFERROR(IF('Street Report'!$J54=\"PATCHING\",\"\",VLOOKUP(L$55,$F95:$H95,3,FALSE)),\" \")","v":0},{"$f":"IFERROR(IF('Street Report'!$J54=\"PATCHING\",\"\",VLOOKUP(M$55,$F95:$H95,3,FALSE)),\" \")","v":0},{"$f":"IFERROR(IF('Street Report'!$J54=\"PATCHING\",\"\",VLOOKUP(N$55,$F95:$H95,3,FALSE)),\" \")","v":0},{"$f":"IFERROR(IF('Street Report'!$J54=\"PATCHING\",\"\",VLOOKUP(O$55,$F95:$H95,3,FALSE)),\" \")","v":0},{"$f":"IFERROR(IF('Street Report'!$J54=\"PATCHING\",\"\",VLOOKUP(P$55,$F95:$H95,3,FALSE)),\" \")","v":0},"REVIEW CHART",{"$nulls":10},{"$f":"'Street Report'!H75","v":0},{"$f":"'Street Report'!J56","v":0},{"$f":"'Street Report'!R56","v":0}," "," "," "," "]
[{"$nulls":5},{"$f":"'Street Report'!H55","v":0},null,{"$f":"'Street Report'!S55","v":{"v":0,"d":"0.00"}},{"$f":"IFERROR(IF('Street Report'!$J55=\"PATCHING\",\"\",VLOOKUP(I$55,$F96:$H96,3,FALSE)),\" \")","v":0},{"$f":"IFERROR(IF('Street Report'!$J55=\"PATCHING\",\"\",VLOOKUP(J$55,$F96:$H96,3,FALSE)),\" \")","v":0},{"$f":"IFERROR(IF('Street Report'!$J55=\"PATCHING\",\"\",VLOOKUP(K$55,$F96:$H96,3,FALSE)),\" \")","v":0},{"$f":"IFERROR(IF('Street Report'!$J55=\"PATCHING\",\"\",VLOOKUP(L$55,$F96:$H96,3,FALSE)),\" \")","v":0},{"$f":"IFERROR(IF('Street Report'!$J55=\"PATCHING\",\"\",VLOOKUP(M$55,$F96:$H96,3,FALSE)),\" \")","v":0},{"$f":"IFERROR(IF('Street Report'!$J55=\"PATCHING\",\"\",VLOOKUP(N$55,$F96:$H96,3,FALSE)),\" \")","v":0},{"$f":"IFERROR(IF('Street Report'!$J55=\"PATCHING\",\"\",VLOOKUP(O$55,$F96:$H96,3,FALSE)),\" \")","v":0},{"$f":"IFERROR(IF('Street Report'!$J55=\"PATCHING\",\"\",VLOOKUP(P$55,$F96:$H96,3,FALSE)),\" \")","v":0},{"$nulls":11},{"$f":"'Street Report'!H76","v":0},{"$f":"'Street Report'!J57","v":0},{"$f":"'Street Report'!R57","v":0}," "," "," "," "]
[{"$nulls":5},{"$f":"'Street Report'!H56","v":0},null,{"$f":"'Street Report'!S56","v":{"v":0,"d":"0.00"}},{"$f":"IFERROR(IF('Street Report'!$J56=\"PATCHING\",\"\",VLOOKUP(I$55,$F97:$H97,3,FALSE)),\" \")","v":0},{"$f":"IFERROR(IF('Street Report'!$J56=\"PATCHING\",\"\",VLOOKUP(J$55,$F97:$H97,3,FALSE)),\" \")","v":0},{"$f":"IFERROR(IF('Street Report'!$J56=\"PATCHING\",\"\",VLOOKUP(K$55,$F97:$H97,3,FALSE)),\" \")","v":0},{"$f":"IFERROR(IF('Street Report'!$J56=\"PATCHING\",\"\",VLOOKUP(L$55,$F97:$H97,3,FALSE)),\" \")","v":0},{"$f":"IFERROR(IF('Street Report'!$J56=\"PATCHING\",\"\",VLOOKUP(M$55,$F97:$H97,3,FALSE)),\" \")","v":0},{"$f":"IFERROR(IF('Street Report'!$J56=\"PATCHING\",\"\",VLOOKUP(N$55,$F97:$H97,3,FALSE)),\" \")","v":0},{"$f":"IFERROR(IF('Street Report'!$J56=\"PATCHING\",\"\",VLOOKUP(O$55,$F97:$H97,3,FALSE)),\" \")","v":0},{"$f":"IFERROR(IF('Street Report'!$J56=\"PATCHING\",\"\",VLOOKUP(P$55,$F97:$H97,3,FALSE)),\" \")","v":0},"SP","DENSITY","NON DENSITY",{"$nulls":8},{"$f":"'Street Report'!H77","v":0},{"$f":"'Street Report'!J58","v":0},{"$f":"'Street Report'!R58","v":0}," "," "," "," "]
[{"$nulls":5},{"$f":"'Street Report'!H57","v":0},null,{"$f":"'Street Report'!S57","v":{"v":0,"d":"0.00"}},{"$f":"IFERROR(IF('Street Report'!$J57=\"PATCHING\",\"\",VLOOKUP(I$55,$F98:$H98,3,FALSE)),\" \")","v":0},{"$f":"IFERROR(IF('Street Report'!$J57=\"PATCHING\",\"\",VLOOKUP(J$55,$F98:$H98,3,FALSE)),\" \")","v":0},{"$f":"IFERROR(IF('Street Report'!$J57=\"PATCHING\",\"\",VLOOKUP(K$55,$F98:$H98,3,FALSE)),\" \")","v":0},{"$f":"IFERROR(IF('Street Report'!$J57=\"PATCHING\",\"\",VLOOKUP(L$55,$F98:$H98,3,FALSE)),\" \")","v":0},{"$f":"IFERROR(IF('Street Report'!$J57=\"PATCHING\",\"\",VLOOKUP(M$55,$F98:$H98,3,FALSE)),\" \")","v":0},{"$f":"IFERROR(IF('Street Report'!$J57=\"PATCHING\",\"\",VLOOKUP(N$55,$F98:$H98,3,FALSE)),\" \")","v":0},{"$f":"IFERROR(IF('Street Report'!$J57=\"PATCHING\",\"\",VLOOKUP(O$55,$F98:$H98,3,FALSE)),\" \")","v":0},{"$f":"IFERROR(IF('Street Report'!$J57=\"PATCHING\",\"\",VLOOKUP(P$55,$F98:$H98,3,FALSE)),\" \")","v":0},{"$f":"I101","v":0},{"$f":"I84","v":{"v":0,"d":"0.00"}},{"$f":"I100","v":{"v":0,"d":"0.00"}},{"$nulls":8},{"$f":"'Street Report'!H78","v":0},null,"TOTAL",{"$f":"SUM(AE83:AE97)","v":0},{"$f":"SUM(AF83:AF97)","v":0},0,{"$f":"SUM(AH83:AH97)","v":0}]
[{"$nulls":5},{"$f":"'Street Report'!H58","v":0},null,{"$f":"'Street Report'!S58","v":{"v":0,"d":"0.00"}},{"$f":"IFERROR(IF('Street Report'!$J58=\"PATCHING\",\"\",VLOOKUP(I$55,$F99:$H99,3,FALSE)),\" \")","v":0},{"$f":"IFERROR(IF('Street Report'!$J58=\"PATCHING\",\"\",VLOOKUP(J$55,$F99:$H99,3,FALSE)),\" \")","v":0},{"$f":"IFERROR(IF('Street Report'!$J58=\"PATCHING\",\"\",VLOOKUP(K$55,$F99:$H99,3,FALSE)),\" \")","v":0},{"$f":"IFERROR(IF('Street Report'!$J58=\"PATCHING\",\"\",VLOOKUP(L$55,$F99:$H99,3,FALSE)),\" \")","v":0},{"$f":"IFERROR(IF('Street Report'!$J58=\"PATCHING\",\"\",VLOOKUP(M$55,$F99:$H99,3,FALSE)),\" \")","v":0},{"$f":"IFERROR(IF('Street Report'!$J58=\"PATCHING\",\"\",VLOOKUP(N$55,$F99:$H99,3,FALSE)),\" \")","v":0},{"$f":"IFERROR(IF('Street Report'!$J58=\"PATCHING\",\"\",VLOOKUP(O$55,$F99:$H99,3,FALSE)),\" \")","v":0},{"$f":"IFERROR(IF('Street Report'!$J58=\"PATCHING\",\"\",VLOOKUP(P$55,$F99:$H99,3,FALSE)),\" \")","v":0},{"$f":"J101","v":0},{"$f":"J84","v":{"v":0,"d":"0.00"}},{"$f":"J100","v":{"v":0,"d":"0.00"}}]
[{"$nulls":4},"nondensity",null,null,{"$f":"SUM(H85:H99)","v":{"v":0,"d":"0.00"}},{"$f":"SUM(I85:I99)","v":{"v":0,"d":"0.00"}},{"v":0,"d":"0.00"},{"v":0,"d":"0.00"},{"v":0,"d":"0.00"},{"v":0,"d":"0.00"},{"$f":"SUM(N85:N99)","v":{"v":0,"d":"0.00"}},{"$f":"SUM(O85:O99)","v":{"v":0,"d":"0.00"}},{"v":0,"d":"0.00"},{"$f":"K101","v":0},{"$f":"K84","v":{"v":0,"d":"0.00"}},{"$f":"K100","v":{"v":0,"d":"0.00"}}]
[{"$nulls":7},{"$f":"H55","v":"tons"},{"$f":"I55","v":0},0,0,0,0,{"$f":"N55","v":0},0,0,{"$f":"L101","v":0},{"$f":"L84","v":{"v":0,"d":"0.00"}},{"$f":"L100","v":{"v":0,"d":"0.00"}}]
[{"$nulls":5},"total = ",null,{"$f":"H100+H84","v":{"v":0,"d":"0.00"}},{"$f":"I100+I84","v":{"v":0,"d":"0.00"}},{"v":0,"d":"0.00"},{"v":0,"d":"0.00"},{"v":0,"d":"0.00"},{"v":0,"d":"0.00"},{"$f":"N100+N84","v":{"v":0,"d":"0.00"}},{"v":0,"d":"0.00"},{"v":0,"d":"0.00"},{"$f":"M101","v":0},{"$f":"M84","v":{"v":0,"d":"0.00"}},{"$f":"M100","v":{"v":0,"d":"0.00"}}]
[{"$nulls":16},{"$f":"N101","v":0},{"$f":"N84","v":{"v":0,"d":"0.00"}},{"$f":"N100","v":{"v":0,"d":"0.00"}}]
[{"$nulls":16},{"$f":"O101","v":0},{"$f":"O84","v":{"v":0,"d":"0.00"}},{"$f":"O100","v":{"v":0,"d":"0.00"}}]
[{"$nulls":16},{"$f":"P101","v":0},{"$f":"P84","v":{"v":0,"d":"0.00"}},{"$f":"P100","v":{"v":0,"d":"0.00"}}]
[]
["All BLUE cells in the workbook are editable by the User. ",{"$nulls":4},"If any errors occur, please use the email link below to send  a copy of the Bituminous Street Report. Please add a brief description of the error and your contact information. Thank you.  "]
[]
[]
[{"$nulls":6},"mathew.selin@state.mn.us"]

{"sheet":"Street Report","index":1,"n_rows":71,"n_cols":22,"rows_kept":71,"merged":[[1,1,2,21],[3,1,3,4],[3,5,3,6],[3,8,3,9],[3,10,3,11],[3,15,3,16],[3,17,3,18],[3,20,3,21],[4,1,4,4],[4,5,4,6],[4,7,4,8],[4,11,4,12],[4,15,4,16],[4,17,4,18],[4,20,4,21],[5,1,5,4],[5,5,5,6],[5,7,6,15],[5,16,6,21],[6,1,6,4],[6,5,6,6],[7,5,7,6],[8,5,8,6],[9,5,9,6],[10,5,10,6],[11,5,11,6],[12,5,12,6],[13,5,13,6],[14,5,14,6],[15,5,15,6],[16,5,16,6],[17,5,17,6],[18,5,18,6],[19,5,19,6],[20,5,20,6],[21,5,21,6],[22,5,22,6],[23,5,23,6],[24,5,24,6],[25,5,25,6],[26,5,26,6],[27,5,27,6],[28,5,28,6],[29,5,29,6],[30,5,30,6],[31,5,31,6],[32,5,32,6],[33,5,33,6],[34,5,34,6],[35,5,35,6],[36,2,36,11],[36,12,36,16],[38,1,39,5],[38,7,39,21],[40,1,40,2],[40,4,40,5],[40,7,42,7],[40,8,42,8],[40,9,42,9],[40,10,42,10],[40,11,42,11],[40,12,42,12],[40,13,42,13],[40,14,42,14],[40,15,42,15],[40,16,42,16],[40,17,42,17],[40,18,42,18],[40,19,42,19],[40,20,42,20],[40,21,42,21],[41,1,41,2],[41,4,41,5],[42,1,42,2],[42,4,42,5],[43,1,43,2],[43,4,43,5],[46,1,46,5],[47,1,57,5],[58,1,61,8],[58,11,58,16],[59,9,60,9],[59,10,60,10],[59,11,60,11],[59,12,60,12],[59,16,59,17],[62,1,62,2],[62,4,62,5],[62,6,62,7],[63,1,63,2],[63,4,63,5],[63,6,63,7],[64,1,64,2],[64,4,64,5],[64,6,64,7],[65,1,65,2],[65,4,65,5],[65,6,65,7],[66,1,66,2],[66,4,66,5],[66,6,66,7],[66,16,66,18],[67,1,67,2],[67,4,67,5],[67,6,67,7],[68,1,68,2],[68,4,68,5],[68,6,68,7],[68,16,69,21],[69,1,69,2],[69,4,69,5],[69,6,69,7],[70,1,70,2],[70,4,70,5],[70,6,70,7],[70,16,70,21]]}
[]
[null,"DAILY STREET REPORT FOR BITUMINOUS PLANT MIX\nUSE SEPARATE DAILY STREET REPORT FOR EACH MIXTURE TYPE"]
[]
[null,"ENGINEER:",{"$nulls":3},{"$f":"'Data sheet'!E3","v":0},null,"ITEM:",{"$f":"IFERROR(VLOOKUP(L5,'Data sheet'!D8:L20,4,FALSE),\" \")","v":" "},{"$f":"IFERROR(VLOOKUP(I5,'Data sheet'!#REF!,7,FALSE),\" \")","v":" "},"CALCULATED YIELD (LBS. PER SY.IN.):",null,{"$f":"IFERROR((VLOOKUP(L5,'Data sheet'!D8:L20,8,FALSE)*0.75),\" \")","v":" "},"UNIT:",{"$f":"IFERROR(VLOOKUP(L5,'Data sheet'!D8:L20,6,FALSE),\" \")","v":" "},"WEATHER:",{"$nulls":3},"DATE:",{"$f":"'Data sheet'!L3","v":"00:00:00"}]
[null,"CONTRACT:",{"$nulls":3},{"$f":"'Data sheet'!E5","v":0},null,"MIX DESIGN:",null,{"$f":"IFERROR(VLOOKUP(L5,'Data sheet'!D8:L20,3,FALSE),\" \")","v":" "},"‼MDR/REC#:‼",null,null,"PRICE:",{"$f":"IFERROR(VLOOKUP(L5,'Data sheet'!D8:L20,7,FALSE),\" \")","v":" "},"TEMP:",{"$nulls":3},"REP#:",{"$f":"'Data sheet'!L5","v":0}]
[null,"PAVING CONTRACTOR:",{"$nulls":3},{"$f":"'Data sheet'!I3","v":0},null,"MAINLINE, TURNLANES, AND SHOULDERS OVER 6' WIDE\n(COMPACTION BY MAX. DENSITY)"]
[null,"PLANT INDENTIFICATION:",{"$nulls":3},{"$f":"'Data sheet'!I5","v":0}]
[null,"S.P.","ROUTE\nSYSTEM","ROUTE\nNO.","LIFT","LANE TYPE",null,"DIRECTION OF TRAVEL","STANDARD CENTERLINE OFFSET","CUSTOM OFFSET \nLEFT\n BOUNDARY \nEXAMPLE:           11L OR 12R","CUSTOM OFFSET RIGHT \nBOUNDARY\nEXAMPLE:            CL OR 20R","ALIGNMENT NAME\n(IF APPLICABLE)","BEGIN STATION","END\nSTATION","LANE WIDTH","CUSTOM LANE WIDTH","LENGTH\n(FT.)","AREA\n(S.Y.)","MIXTURE\nPLACED\n(TONS)","PLAN\nTHICKNESS\n(INCHES)","YIELD\n(LBS./S.Y.)\n(Ex2000/D)","OVER/\nUNDER\nRUN"]
[{"$nulls":14},{"$f":"IFERROR(VLOOKUP(I9,'Drop Downs'!$D$4:$E$28,2,FALSE),\" \")","v":" "},{"$f":"IFERROR('Data sheet'!Y64,\" \")","v":{"v":0,"d":"0.00"}},{"$f":"ABS(N9-M9)","v":0},{"$f":"IFERROR(IF(O9=\" \",(P9*Q9/9),(O9*Q9/9)),\" \")","v":0},null,null,{"$f":"IFERROR(S9*2000/R9/T9,\" \")","v":" "},{"$f":"IFERROR(S9-($M$4*R9*T9/2000),\" \")","v":" "}]
[{"$nulls":14},{"$f":"IFERROR(VLOOKUP(I10,'Drop Downs'!$D$4:$E$28,2,FALSE),\" \")","v":" "},{"$f":"IFERROR('Data sheet'!Y65,\" \")","v":{"v":0,"d":"0.00"}},{"$f":"ABS(N10-M10)","v":0},{"$f":"IFERROR(IF(O10=\" \",(P10*Q10/9),(O10*Q10/9)),\" \")","v":0},null,null,{"$f":"IFERROR(S10*2000/R10/T10,\" \")","v":" "}," "]
[{"$nulls":14},{"$f":"IFERROR(VLOOKUP(I11,'Drop Downs'!$D$4:$E$28,2,FALSE),\" \")","v":" "},{"$f":"IFERROR('Data sheet'!Y66,\" \")","v":{"v":0,"d":"0.00"}},{"$f":"ABS(N11-M11)","v":0},0,null,null,{"$f":"IFERROR(S11*2000/R11/T11,\" \")","v":" "},{"$f":"IFERROR(S11-($M$4*R11*T11/2000),\" \")","v":" "}]
[{"$nulls":14},{"$f":"IFERROR(VLOOKUP(I12,'Drop Downs'!$D$4:$E$28,2,FALSE),\" \")","v":" "},{"$f":"IFERROR('Data sheet'!Y67,\" \")","v":{"v":0,"d":"0.00"}},0,0,null,null," "," "]
[{"$nulls":14},{"$f":"IFERROR(VLOOKUP(I13,'Drop Downs'!$D$4:$E$28,2,FALSE),\" \")","v":" "},{"$f":"IFERROR('Data sheet'!Y68,\" \")","v":{"v":0,"d":"0.00"}},0,0,null,null," "," "]
[{"$nulls":14},{"$f":"IFERROR(VLOOKUP(I14,'Drop Downs'!$D$4:$E$28,2,FALSE),\" \")","v":" "},{"$f":"IFERROR('Data sheet'!Y69,\" \")","v":{"v":0,"d":"0.00"}},0,0,null,null," "," "]
[{"$nulls":14},{"$f":"IFERROR(VLOOKUP(I15,'Drop Downs'!$D$4:$E$28,2,FALSE),\" \")","v":" "},{"$f":"IFERROR('Data sheet'!Y70,\" \")","v":{"v":0,"d":"0.00"}},0,0,null,null," "," "]
[{"$nulls":14},{"$f":"IFERROR(VLOOKUP(I16,'Drop Downs'!$D$4:$E$28,2,FALSE),\" \")","v":" "},{"$f":"IFERROR('Data sheet'!Y71,\" \")","v":{"v":0,"d":"0.00"}},0,0,null,null," "," "]
[{"$nulls":14},{"$f":"IFERROR(VLOOKUP(I17,'Drop Downs'!$D$4:$E$28,2,FALSE),\" \")","v":" "},{"$f":"IFERROR('Data sheet'!Y72,\" \")","v":{"v":0,"d":"0.00"}},0,0,null,null," "," "]
[{"$nulls":14},{"$f":"IFERROR(VLOOKUP(I18,'Drop Downs'!$D$4:$E$28,2,FALSE),\" \")","v":" "},{"$f":"IFERROR('Data sheet'!Y73,\" \")","v":{"v":0,"d":"0.00"}},0,0,null,null," "," "]
[{"$nulls":14},{"$f":"IFERROR(VLOOKUP(I19,'Drop Downs'!$D$4:$E$28,2,FALSE),\" \")","v":" "},{"$f":"IFERROR('Data sheet'!Y74,\" \")","v":{"v":0,"d":"0.00"}},0,0,null,null," "," "]
[{"$nulls":14},{"$f":"IFERROR(VLOOKUP(I20,'Drop Downs'!$D$4:$E$28,2,FALSE),\" \")","v":" "},{"$f":"IFERROR('Data sheet'!Y75,\" \")","v":{"v":0,"d":"0.00"}},0,0,null,null," "," "]
[{"$nulls":14},{"$f":"IFERROR(VLOOKUP(I21,'Drop Downs'!$D$4:$E$28,2,FALSE),\" \")","v":" "},{"$f":"IFERROR('Data sheet'!Y76,\" \")","v":{"v":0,"d":"0.00"}},0,0,null,null," "," "]
[{"$nulls":14},{"$f":"IFERROR(VLOOKUP(I22,'Drop Downs'!$D$4:$E$28,2,FALSE),\" \")","v":" "},{"$f":"IFERROR('Data sheet'!Y77,\" \")","v":{"v":0,"d":"0.00"}},0,0,null,null," "," "]
[{"$nulls":14},{"$f":"IFERROR(VLOOKUP(I23,'Drop Downs'!$D$4:$E$28,2,FALSE),\" \")","v":" "},{"$f":"IFERROR('Data sheet'!Y78,\" \")","v":{"v":0,"d":"0.00"}},0,0,null,null," "," "]
[{"$nulls":14},{"$f":"IFERROR(VLOOKUP(I24,'Drop Downs'!$D$4:$E$28,2,FALSE),\" \")","v":" "},{"$f":"IFERROR('Data sheet'!Y79,\" \")","v":{"v":0,"d":"0.00"}},0,0,null,null,{"$f":"IFERROR(S24*2000/R24/T24,\" \")","v":" "}," "]
[{"$nulls":14},{"$f":"IFERROR(VLOOKUP(I25,'Drop Downs'!$D$4:$E$28,2,FALSE),\" \")","v":" "},{"$f":"IFERROR('Data sheet'!Y80,\" \")","v":{"v":0,"d":"0.00"}},0,0,null,null," "," "]
[{"$nulls":14},{"$f":"IFERROR(VLOOKUP(I26,'Drop Downs'!$D$4:$E$28,2,FALSE),\" \")","v":" "},{"$f":"IFERROR('Data sheet'!Y81,\" \")","v":{"v":0,"d":"0.00"}},0,0,null,null," "," "]
[{"$nulls":14},{"$f":"IFERROR(VLOOKUP(I27,'Drop Downs'!$D$4:$E$28,2,FALSE),\" \")","v":" "},{"$f":"IFERROR('Data sheet'!Y82,\" \")","v":{"v":0,"d":"0.00"}},0,0,null,null," "," "]
[{"$nulls":14},{"$f":"IFERROR(VLOOKUP(I28,'Drop Downs'!$D$4:$E$28,2,FALSE),\" \")","v":" "},{"$f":"IFERROR('Data sheet'!Y83,\" \")","v":{"v":0,"d":"0.00"}},0,0,null,null," "," "]
[{"$nulls":14},{"$f":"IFERROR(VLOOKUP(I29,'Drop Downs'!$D$4:$E$28,2,FALSE),\" \")","v":" "},{"$f":"IFERROR('Data sheet'!Y84,\" \")","v":{"v":0,"d":"0.00"}},0,0,null,null," "," "]
[{"$nulls":14},{"$f":"IFERROR(VLOOKUP(I30,'Drop Downs'!$D$4:$E$28,2,FALSE),\" \")","v":" "},{"$f":"IFERROR('Data sheet'!Y85,\" \")","v":{"v":0,"d":"0.00"}},0,0,null,null," "," "]
[{"$nulls":14},{"$f":"IFERROR(VLOOKUP(I31,'Drop Downs'!$D$4:$E$28,2,FALSE),\" \")","v":" "},{"$f":"IFERROR('Data sheet'!Y86,\" \")","v":{"v":0,"d":"0.00"}},0,0,null,null," "," "]
[{"$nulls":14},{"$f":"IFERROR(VLOOKUP(I32,'Drop Downs'!$D$4:$E$28,2,FALSE),\" \")","v":" "},{"$f":"IFERROR('Data sheet'!Y87,\" \")","v":{"v":0,"d":"0.00"}},0,0,null,null," "," "]
[{"$nulls":14},{"$f":"IFERROR(VLOOKUP(I33,'Drop Downs'!$D$4:$E$28,2,FALSE),\" \")","v":" "},{"$f":"IFERROR('Data sheet'!Y88,\" \")","v":{"v":0,"d":"0.00"}},0,0,null,null," "," "]
[{"$nulls":14},{"$f":"IFERROR(VLOOKUP(I34,'Drop Downs'!$D$4:$E$28,2,FALSE),\" \")","v":" "},{"$f":"IFERROR('Data sheet'!Y89,\" \")","v":{"v":0,"d":"0.00"}},{"$f":"ABS(N34-M34)","v":0},0,null,null," "," "]
[{"$nulls":14},{"$f":"IFERROR(VLOOKUP(I35,'Drop Downs'!$D$4:$E$28,2,FALSE),\" \")","v":" "},{"$f":"IFERROR('Data sheet'!Y90,\" \")","v":{"v":0,"d":"0.00"}},0,0,null,null," "," "]
[{"$nulls":14},{"$f":"IFERROR(VLOOKUP(I36,'Drop Downs'!$D$4:$E$28,2,FALSE),\" \")","v":" "},{"$f":"IFERROR('Data sheet'!Y91,\" \")","v":{"v":0,"d":"0.00"}},0,0,null,null," ",{"$f":"IFERROR(S36-($M$4*R36*T36/2000),\" \")","v":" "}]
[{"$nulls":12},"MAINLINE & TURNLANE DENSITY TOTALS",{"$nulls":4},{"$f":"SUM(R9:R36)","v":0},{"$f":"SUM(S9:S36)","v":{"v":0,"d":"0.00"}},null,{"$f":"IFERROR(AVERAGE(U9:U36),\" \")","v":" "},{"$f":"SUM(V9:V36)","v":{"v":0,"d":"0.00"}}]
[]
[null,"TACK APPLIED\n(UNADJUSTED FOR TEMPERATURE)",{"$nulls":5},"ROAD CONNECTIONS, ENTRANCES, AND SHOULDERS LESS THAN 6' WIDE\n(ORDINARY COMPACTION)"]
[]
[null,"INVOICE NO.",{"$nulls":5},"S.P.","STATION\nR.P.","AREA TYPE","AVERAGE \nRADIUS\n(ENTRANCES)","LENGTH\n(FT.)\n(ENTRANCES)","WIDTH\n(FT.)\n(ENTRANCES)","BEGIN\nSTATION\n(6FT.>SHLD.)","END\nSTATION\n(6FT.>SHLD.)","WIDTH\n(FT.)","LENGTH\n(FT.)","AREA\n(S.Y.) ","MIXTURE\nPLACED\n(TONS)","PLAN\nTHICKNESS\n(INCHES)","YIELD\n(LBS./S.Y.)\n(EX2000/D)","OVER/\nUNDER\nRUN"]
[null,"GALLONS APPLIED"]
[null,"AREA (S.Y.)",null,null,{"$f":"R37+R59","v":{"v":0,"d":"0.00"}}]
[null,"APPLICATION RATE",null,null,{"$f":"IFERROR(E42/E43,\" \")","v":" "},{"$nulls":11},{"$f":"ABS(N44-O44)","v":0},{"$f":"((P44*Q44)+((L44*M44)+((K44^2*0.2146)*2)))/9","v":0},null,null,{"$f":"IFERROR(S44*2000/R44/T44,\" \")","v":" "},{"$f":"IFERROR(S44-($M$4*R44*T44/2000),\" \")","v":" "}]
[{"$nulls":16},0,{"$f":"((P45*Q45)+((L45*M45)+((K45^2*0.2146)*2)))/9","v":0},null,null,{"$f":"IFERROR(S45*2000/R45/T45,\" \")","v":" "}," "]
[{"$nulls":16},0,{"$f":"((P46*Q46)+((L46*M46)+((K46^2*0.2146)*2)))/9","v":0},null,null," "," "]
[null,"NOTES",{"$nulls":14},0,0,null,null," "," "]
[{"$nulls":16},0,0,null,null," "," "]
[{"$nulls":16},0,0,null,null," "," "]
[{"$nulls":16},0,0,null,null," "," "]
[{"$nulls":16},0,0,null,null," "," "]
[{"$nulls":16},0,0,null,null," "," "]
[{"$nulls":16},0,0,null,null," "," "]
[{"$nulls":16},0,0,null,null," "," "]
[{"$nulls":16},0,0,null,null," "," "]
[{"$nulls":16},{"$f":"ABS(N56-O56)","v":0},0,null,null," "," "]
[{"$nulls":16},0,0,null,null," "," "]
[{"$nulls":16},0,0,null,null," "," "]
[null,"INTELLIGENT COMPACTTION AND THERMAL PROFILING EQUIPMENT REPORT\n(DOCUMENT EQUPIMENT ON PROJECT AND BREAKDOWN TIMES)",{"$nulls":9},"ROAD CONNECTION, ENTRANCE, & <6' SHOULDER TOTALS",{"$nulls":5},{"$f":"SUM(R44:R58)","v":0},{"$f":"'Data sheet'!AE79+'Data sheet'!AF79+'Data sheet'!AG79","v":{"v":0,"d":"0.00"}},null,{"$f":"IFERROR(AVERAGE(U44:U58),\" \")","v":" "},{"$f":"SUM(V44:V58)","v":{"v":0,"d":"0.00"}}]
[{"$nulls":9},"S.P. ","DENSITY TONS","NON-DENSITY TONS","TOTAL TONS",{"$nulls":3},"SHEET TOTAL ",null,{"$f":"$S$59+$S$37","v":{"v":0,"d":"0.00"}}]
[]
[{"$nulls":9},{"$f":"'Data sheet'!C7","v":0},{"$f":"IFERROR(VLOOKUP($J62,'Data sheet'!$Q$98:$S$105,2,FALSE),\" \")","v":{"v":0,"d":"0.00"}},{"$f":"IFERROR(VLOOKUP($J62,'Data sheet'!$Q$98:$S$105,3,FALSE),\" \")","v":{"v":0,"d":"0.00"}},{"$f":"SUM(K62:L62)","v":{"v":0,"d":"0.00"}}]
[null,"EQUIPMENT TYPE",null,"UNIT #","OPERATIONAL (Y/N)",null,"BEGIN TIME",null,"END TIME",{"$f":"'Data sheet'!C8","v":0},{"$f":"IFERROR(VLOOKUP($J63,'Data sheet'!$Q$98:$S$105,2,FALSE),\" \")","v":{"v":0,"d":"0.00"}},{"$f":"IFERROR(VLOOKUP($J63,'Data sheet'!$Q$98:$S$105,3,FALSE),\" \")","v":{"v":0,"d":"0.00"}},{"$f":"SUM(K63:L63)","v":{"v":0,"d":"0.00"}},{"$nulls":5},{"$f":"IF(U63=\"TON\",'Data sheet'!$AA$24,'Data sheet'!$AA$25)","v":"TOTAL SQUARE YARDS PLACED:"},{"$f":"IF(O4=\"sq. yd.\",R37+R59,'Tape '!L4)","v":{"v":1910,"d":"1910.00"}},{"$f":"O4","v":" "}]
[{"$nulls":9},{"$f":"'Data sheet'!C9","v":0},{"$f":"IFERROR(VLOOKUP($J64,'Data sheet'!$Q$98:$S$105,2,FALSE),\" \")","v":{"v":0,"d":"0.00"}},{"$f":"IFERROR(VLOOKUP($J64,'Data sheet'!$Q$98:$S$105,3,FALSE),\" \")","v":{"v":0,"d":"0.00"}},{"$f":"SUM(K64:L64)","v":{"v":0,"d":"0.00"}},{"$nulls":5},{"$f":"IF(U64=\"TON\",'Data sheet'!$AB$24,\" \")","v":" "},{"$f":"IF($U$64=\"TON\",'Tape '!$L$5+'Tape '!$P$5,\" \")","v":" "},{"$f":"IF(O4=\"TON\",\"TON\",\" \")","v":" "}]
[{"$nulls":9},{"$f":"'Data sheet'!C10","v":0},{"$f":"IFERROR(VLOOKUP($J65,'Data sheet'!$Q$98:$S$105,2,FALSE),\" \")","v":{"v":0,"d":"0.00"}},{"$f":"IFERROR(VLOOKUP($J65,'Data sheet'!$Q$98:$S$105,3,FALSE),\" \")","v":{"v":0,"d":"0.00"}},{"v":0,"d":"0.00"},{"$nulls":5},"TOTAL PATCHING TONS (PLACED):",{"$f":"'Data sheet'!AH79","v":{"v":0,"d":"0.00"}},"TON"]
[{"$nulls":9},{"$f":"'Data sheet'!C11","v":0},{"$f":"IFERROR(VLOOKUP($J66,'Data sheet'!$Q$98:$S$105,2,FALSE),\" \")","v":{"v":0,"d":"0.00"}},{"$f":"IFERROR(VLOOKUP($J66,'Data sheet'!$Q$98:$S$105,3,FALSE),\" \")","v":{"v":0,"d":"0.00"}},{"v":0,"d":"0.00"},{"$nulls":5},{"$f":"IF(U66=\"TON\",'Data sheet'!$AC$24,'Data sheet'!$AC$25)","v":"TOTAL SQUARE YARDS PAID FOR (THIS REPORT):"},{"$f":"IF(O4=\"sq. yd.\",'Data sheet'!AJ84,'Tape '!L4-T64-T65)","v":{"$error":"#VALUE!"}},{"$f":"$O$4","v":" "}]
[{"$nulls":9},{"$f":"'Data sheet'!C12","v":0},{"$f":"IFERROR(VLOOKUP($J67,'Data sheet'!$Q$98:$S$105,2,FALSE),\" \")","v":{"v":0,"d":"0.00"}},{"$f":"IFERROR(VLOOKUP($J67,'Data sheet'!$Q$98:$S$105,3,FALSE),\" \")","v":{"v":0,"d":"0.00"}},{"$f":"SUM(K67:L67)","v":{"v":0,"d":"0.00"}},{"$nulls":3},{"$f":"IF(O4=\"sq. yd.\", \"LESS PATCHING SQ. YD.\",\" \")","v":" "}]
[{"$nulls":9},{"$f":"'Data sheet'!C13","v":0},{"$f":"IFERROR(VLOOKUP($J68,'Data sheet'!$Q$98:$S$105,2,FALSE),\" \")","v":{"v":0,"d":"0.00"}},{"$f":"IFERROR(VLOOKUP($J68,'Data sheet'!$Q$98:$S$105,3,FALSE),\" \")","v":{"v":0,"d":"0.00"}},{"v":0,"d":"0.00"}]
[{"$nulls":9},{"$f":"'Data sheet'!C14","v":0},{"$f":"IFERROR(VLOOKUP($J69,'Data sheet'!$Q$98:$S$105,2,FALSE),\" \")","v":{"v":0,"d":"0.00"}},{"$f":"IFERROR(VLOOKUP($J69,'Data sheet'!$Q$98:$S$105,3,FALSE),\" \")","v":{"v":0,"d":"0.00"}},{"v":0,"d":"0.00"}]
[{"$nulls":11},"SHEET TOTAL",{"$f":"SUM(M62:M69)","v":{"v":0,"d":"0.00"}}]
[{"$nulls":16},"STREET INSPECTOR"]

{"sheet":"Tape ","index":2,"n_rows":101,"n_cols":31,"rows_kept":101,"merged":[[2,20,3,24],[3,3,3,6],[3,9,3,10],[4,9,4,10],[4,12,4,14],[4,20,4,24],[77,3,77,5],[77,7,77,9]]}
[]
[]
[null,"  S.P.: ",{"$f":"'Data sheet'!B5","v":0},"T.H.: ",{"$f":"'Data sheet'!B3","v":0},null,"REPORT #:",{"$f":"'Data sheet'!L5","v":0},null,"DATE: ",{"$f":"'Data sheet'!L3","v":"00:00:00"},{"$nulls":9},{"$f":"'Street Report'!Q69","v":0}]
[null,null,"TYPE OF MIXTURE: ",{"$f":"'Street Report'!I4","v":" "},{"$nulls":5},"SHEET TOTAL:",null,{"$f":"X76","v":{"v":1910,"d":"1910.00"}}]
[null,null,"STARTING LOAD # :",1,null,null,0,null,null,"OVERLOAD TOTAL:",null,{"$f":"SUM(E$7:E$76,I$7:I$76,M$7:M$76,Q$7:Q$76,U$7:U$76,Y$7:Y$76)","v":{"v":0,"d":"0.00"}},"STREET/PLANT WASTE:",{"$nulls":7},"STEET INSPECTOR "]
[null,"LOAD NO.","NET TONS","SUB TOTAL","OVERLOAD","LOAD NO.","NET TONS","SUB TOTAL","OVERLOAD","LOAD NO.","NET TONS","SUB TOTAL","OVERLOAD","LOAD NO.","NET TONS","SUB TOTAL","OVERLOAD","LOAD NO.","NET TONS","SUB TOTAL","OVERLOAD","LOAD NO.","NET TONS","SUB TOTAL","OVERLOAD"]
[null,{"$f":"D5","v":1},{"v":1910,"d":"1910.00"},{"$f":"C7","v":{"v":1910,"d":"1910.00"}},null,{"$f":"IF(B76=\" \",\" \",B76+1)","v":71},null,{"$f":"G7+D76","v":{"v":1910,"d":"1910.00"}},null,{"$f":"IF(F76=\" \",\" \",F76+1)","v":141},null,{"$f":"K7+H76","v":{"v":1910,"d":"1910.00"}},null,{"$f":"IF(J76=\" \",\" \",J76+1)","v":211},null,{"$f":"O7+L76","v":{"v":1910,"d":"1910.00"}},null,{"$f":"IF(N76=\" \",\" \",N76+1)","v":281},null,{"$f":"S7+P76","v":{"v":1910,"d":"1910.00"}},null,{"$f":"IF(R76=\" \",\" \",R76+1)","v":351},null,{"$f":"W7+T76","v":{"v":1910,"d":"1910.00"}}]
[null,{"$f":"IF(B7=\" \",\" \",B7+1)","v":2},null,{"$f":"D7+C8","v":{"v":1910,"d":"1910.00"}},null,{"$f":"IF(F7=\" \",\" \",F7+1)","v":72},null,{"$f":"H7+G8","v":{"v":1910,"d":"1910.00"}},null,{"$f":"IF(J7=\" \",\" \",J7+1)","v":142},null,{"$f":"L7+K8","v":{"v":1910,"d":"1910.00"}},null,{"$f":"IF(N7=\" \",\" \",N7+1)","v":212},null,{"$f":"P7+O8","v":{"v":1910,"d":"1910.00"}},null,{"$f":"IF(R7=\" \",\" \",R7+1)","v":282},null,{"$f":"T7+S8","v":{"v":1910,"d":"1910.00"}},null,{"$f":"IF(V7=\" \",\" \",V7+1)","v":352},null,{"$f":"X7+W8","v":{"v":1910,"d":"1910.00"}}]
[null,3,null,{"v":1910,"d":"1910.00"},null,73,null,{"v":1910,"d":"1910.00"},null,143,null,{"v":1910,"d":"1910.00"},null,213,null,{"v":1910,"d":"1910.00"},null,283,null,{"v":1910,"d":"1910.00"},null,353,null,{"v":1910,"d":"1910.00"}]
[null,4,null,{"v":1910,"d":"1910.00"},null,74,null,{"v":1910,"d":"1910.00"},null,144,null,{"v":1910,"d":"1910.00"},null,214,null,{"v":1910,"d":"1910.00"},null,284,null,{"v":1910,"d":"1910.00"},null,354,null,{"v":1910,"d":"1910.00"}]
[null,5,null,{"v":1910,"d":"1910.00"},null,75,null,{"v":1910,"d":"1910.00"},null,145,null,{"v":1910,"d":"1910.00"},null,215,null,{"v":1910,"d":"1910.00"},null,285,null,{"v":1910,"d":"1910.00"},null,355,null,{"v":1910,"d":"1910.00"}]
[null,6,null,{"v":1910,"d":"1910.00"},null,76,null,{"v":1910,"d":"1910.00"},null,146,null,{"v":1910,"d":"1910.00"},null,216,null,{"v":1910,"d":"1910.00"},null,286,null,{"v":1910,"d":"1910.00"},null,356,null,{"v":1910,"d":"1910.00"}]
[null,7,null,{"v":1910,"d":"1910.00"},null,77,null,{"v":1910,"d":"1910.00"},null,147,null,{"v":1910,"d":"1910.00"},null,217,null,{"v":1910,"d":"1910.00"},null,287,null,{"v":1910,"d":"1910.00"},null,357,null,{"v":1910,"d":"1910.00"}]
[null,8,null,{"v":1910,"d":"1910.00"},null,78,null,{"v":1910,"d":"1910.00"},null,148,null,{"v":1910,"d":"1910.00"},null,218,null,{"v":1910,"d":"1910.00"},null,288,null,{"v":1910,"d":"1910.00"},null,358,null,{"v":1910,"d":"1910.00"}]
[null,9,null,{"v":1910,"d":"1910.00"},null,79,null,{"v":1910,"d":"1910.00"},null,149,null,{"v":1910,"d":"1910.00"},null,219,null,{"v":1910,"d":"1910.00"},null,289,null,{"v":1910,"d":"1910.00"},null,359,null,{"v":1910,"d":"1910.00"}]
[null,10,null,{"v":1910,"d":"1910.00"},null,80,null,{"v":1910,"d":"1910.00"},null,150,null,{"v":1910,"d":"1910.00"},null,220,null,{"v":1910,"d":"1910.00"},null,290,null,{"v":1910,"d":"1910.00"},null,360,null,{"v":1910,"d":"1910.00"}]
[null,11,null,{"v":1910,"d":"1910.00"},null,81,null,{"v":1910,"d":"1910.00"},null,151,null,{"v":1910,"d":"1910.00"},null,221,null,{"v":1910,"d":"1910.00"},null,291,null,{"v":1910,"d":"1910.00"},null,361,null,{"v":1910,"d":"1910.00"}]
[null,12,null,{"v":1910,"d":"1910.00"},null,82,null,{"v":1910,"d":"1910.00"},null,152,null,{"v":1910,"d":"1910.00"},null,222,null,{"v":1910,"d":"1910.00"},null,292,null,{"v":1910,"d":"1910.00"},null,362,null,{"v":1910,"d":"1910.00"}]
[null,13,null,{"v":1910,"d":"1910.00"},null,83,null,{"v":1910,"d":"1910.00"},null,153,null,{"v":1910,"d":"1910.00"},null,223,null,{"v":1910,"d":"1910.00"},null,293,null,{"v":1910,"d":"1910.00"},null,363,null,{"v":1910,"d":"1910.00"}]
[null,14,null,{"v":1910,"d":"1910.00"},null,84,null,{"v":1910,"d":"1910.00"},null,154,null,{"v":1910,"d":"1910.00"},null,224,null,{"v":1910,"d":"1910.00"},null,294,null,{"v":1910,"d":"1910.00"},null,364,null,{"v":1910,"d":"1910.00"}]
[null,15,null,{"v":1910,"d":"1910.00"},null,85,null,{"v":1910,"d":"1910.00"},null,155,null,{"v":1910,"d":"1910.00"},null,225,null,{"v":1910,"d":"1910.00"},null,295,null,{"v":1910,"d":"1910.00"},null,365,null,{"v":1910,"d":"1910.00"}]
[null,16,null,{"v":1910,"d":"1910.00"},null,86,null,{"v":1910,"d":"1910.00"},null,156,null,{"v":1910,"d":"1910.00"},null,226,null,{"v":1910,"d":"1910.00"},null,296,null,{"v":1910,"d":"1910.00"},null,366,null,{"v":1910,"d":"1910.00"}]
[null,17,null,{"v":1910,"d":"1910.00"},null,87,null,{"v":1910,"d":"1910.00"},null,157,null,{"v":1910,"d":"1910.00"},null,227,null,{"v":1910,"d":"1910.00"},null,297,null,{"v":1910,"d":"1910.00"},null,367,null,{"v":1910,"d":"1910.00"}]
[null,18,null,{"v":1910,"d":"1910.00"},null,88,null,{"v":1910,"d":"1910.00"},null,158,null,{"v":1910,"d":"1910.00"},null,228,null,{"v":1910,"d":"1910.00"},null,298,null,{"v":1910,"d":"1910.00"},null,368,null,{"v":1910,"d":"1910.00"}]
[null,19,null,{"v":1910,"d":"1910.00"},null,89,null,{"v":1910,"d":"1910.00"},null,159,null,{"v":1910,"d":"1910.00"},null,229,null,{"v":1910,"d":"1910.00"},null,299,null,{"v":1910,"d":"1910.00"},null,369,null,{"v":1910,"d":"1910.00"}]
[null,20,null,{"v":1910,"d":"1910.00"},null,90,null,{"v":1910,"d":"1910.00"},null,160,null,{"v":1910,"d":"1910.00"},null,230,null,{"v":1910,"d":"1910.00"},null,300,null,{"v":1910,"d":"1910.00"},null,370,null,{"v":1910,"d":"1910.00"}]
[null,21,null,{"v":1910,"d":"1910.00"},null,91,null,{"v":1910,"d":"1910.00"},null,161,null,{"v":1910,"d":"1910.00"},null,231,null,{"v":1910,"d":"1910.00"},null,301,null,{"v":1910,"d":"1910.00"},null,371,null,{"v":1910,"d":"1910.00"}]
[null,22,null,{"v":1910,"d":"1910.00"},null,92,null,{"v":1910,"d":"1910.00"},null,162,null,{"v":1910,"d":"1910.00"},null,232,null,{"v":1910,"d":"1910.00"},null,302,null,{"v":1910,"d":"1910.00"},null,372,null,{"v":1910,"d":"1910.00"}]
[null,23,null,{"v":1910,"d":"1910.00"},null,93,null,{"v":1910,"d":"1910.00"},null,163,null,{"v":1910,"d":"1910.00"},null,233,null,{"v":1910,"d":"1910.00"},null,303,null,{"v":1910,"d":"1910.00"},null,373,null,{"v":1910,"d":"1910.00"}]
[null,24,null,{"v":1910,"d":"1910.00"},null,94,null,{"v":1910,"d":"1910.00"},null,164,null,{"v":1910,"d":"1910.00"},null,234,null,{"v":1910,"d":"1910.00"},null,304,null,{"v":1910,"d":"1910.00"},null,374,null,{"v":1910,"d":"1910.00"}]
[null,25,null,{"v":1910,"d":"1910.00"},null,95,null,{"v":1910,"d":"1910.00"},null,165,null,{"v":1910,"d":"1910.00"},null,235,null,{"v":1910,"d":"1910.00"},null,305,null,{"v":1910,"d":"1910.00"},null,375,null,{"v":1910,"d":"1910.00"}]
[null,26,null,{"v":1910,"d":"1910.00"},null,96,null,{"v":1910,"d":"1910.00"},null,166,null,{"v":1910,"d":"1910.00"},null,236,null,{"v":1910,"d":"1910.00"},null,306,null,{"v":1910,"d":"1910.00"},null,376,null,{"v":1910,"d":"1910.00"}]
[null,27,null,{"v":1910,"d":"1910.00"},null,97,null,{"v":1910,"d":"1910.00"},null,167,null,{"v":1910,"d":"1910.00"},null,237,null,{"v":1910,"d":"1910.00"},null,307,null,{"v":1910,"d":"1910.00"},null,377,null,{"v":1910,"d":"1910.00"}]
[null,28,null,{"v":1910,"d":"1910.00"},null,98,null,{"v":1910,"d":"1910.00"},null,168,null,{"v":1910,"d":"1910.00"},null,238,null,{"v":1910,"d":"1910.00"},null,308,null,{"v":1910,"d":"1910.00"},null,378,null,{"v":1910,"d":"1910.00"}]
[null,29,null,{"v":1910,"d":"1910.00"},null,99,null,{"v":1910,"d":"1910.00"},null,169,null,{"v":1910,"d":"1910.00"},null,239,null,{"v":1910,"d":"1910.00"},null,309,null,{"v":1910,"d":"1910.00"},null,379,null,{"v":1910,"d":"1910.00"}]
[null,30,null,{"v":1910,"d":"1910.00"},null,100,null,{"v":1910,"d":"1910.00"},null,170,null,{"v":1910,"d":"1910.00"},null,240,null,{"v":1910,"d":"1910.00"},null,310,null,{"v":1910,"d":"1910.00"},null,380,null,{"v":1910,"d":"1910.00"}]
[null,31,null,{"v":1910,"d":"1910.00"},null,101,null,{"v":1910,"d":"1910.00"},null,171,null,{"v":1910,"d":"1910.00"},null,241,null,{"v":1910,"d":"1910.00"},null,311,null,{"v":1910,"d":"1910.00"},null,381,null,{"v":1910,"d":"1910.00"}]
[null,32,null,{"v":1910,"d":"1910.00"},null,102,null,{"v":1910,"d":"1910.00"},null,172,null,{"v":1910,"d":"1910.00"},null,242,null,{"v":1910,"d":"1910.00"},null,312,null,{"v":1910,"d":"1910.00"},null,382,null,{"v":1910,"d":"1910.00"}]
[null,33,null,{"v":1910,"d":"1910.00"},null,103,null,{"v":1910,"d":"1910.00"},null,173,null,{"v":1910,"d":"1910.00"},null,243,null,{"v":1910,"d":"1910.00"},null,313,null,{"v":1910,"d":"1910.00"},null,383,null,{"v":1910,"d":"1910.00"}]
[null,{"$f":"IF(B39=\" \",\" \",B39+1)","v":34},null,{"$f":"D39+C40","v":{"v":1910,"d":"1910.00"}},null,{"$f":"IF(F39=\" \",\" \",F39+1)","v":104},null,{"$f":"H39+G40","v":{"v":1910,"d":"1910.00"}},null,{"$f":"IF(J39=\" \",\" \",J39+1)","v":174},null,{"$f":"L39+K40","v":{"v":1910,"d":"1910.00"}},null,244,null,{"v":1910,"d":"1910.00"},null,314,null,{"v":1910,"d":"1910.00"},null,384,null,{"v":1910,"d":"1910.00"}]
[null,35,null,{"v":1910,"d":"1910.00"},null,105,null,{"v":1910,"d":"1910.00"},null,175,null,{"v":1910,"d":"1910.00"},null,245,null,{"v":1910,"d":"1910.00"},null,315,null,{"v":1910,"d":"1910.00"},null,385,null,{"v":1910,"d":"1910.00"}]
[null,36,null,{"v":1910,"d":"1910.00"},null,106,null,{"v":1910,"d":"1910.00"},null,176,null,{"v":1910,"d":"1910.00"},null,246,null,{"v":1910,"d":"1910.00"},null,316,null,{"v":1910,"d":"1910.00"},null,386,null,{"v":1910,"d":"1910.00"}]
[null,37,null,{"v":1910,"d":"1910.00"},null,107,null,{"v":1910,"d":"1910.00"},null,177,null,{"v":1910,"d":"1910.00"},null,247,null,{"v":1910,"d":"1910.00"},null,317,null,{"v":1910,"d":"1910.00"},null,387,null,{"v":1910,"d":"1910.00"}]
[null,38,null,{"v":1910,"d":"1910.00"},null,108,null,{"v":1910,"d":"1910.00"},null,178,null,{"v":1910,"d":"1910.00"},null,248,null,{"v":1910,"d":"1910.00"},null,318,null,{"v":1910,"d":"1910.00"},null,388,null,{"v":1910,"d":"1910.00"}]
[null,39,null,{"v":1910,"d":"1910.00"},null,109,null,{"v":1910,"d":"1910.00"},null,179,null,{"v":1910,"d":"1910.00"},null,249,null,{"v":1910,"d":"1910.00"},null,319,null,{"v":1910,"d":"1910.00"},null,389,null,{"v":1910,"d":"1910.00"}]
[null,40,null,{"v":1910,"d":"1910.00"},null,110,null,{"v":1910,"d":"1910.00"},null,180,null,{"v":1910,"d":"1910.00"},null,250,null,{"v":1910,"d":"1910.00"},null,320,null,{"v":1910,"d":"1910.00"},null,390,null,{"v":1910,"d":"1910.00"}]
[null,41,null,{"v":1910,"d":"1910.00"},null,111,null,{"v":1910,"d":"1910.00"},null,181,null,{"v":1910,"d":"1910.00"},null,251,null,{"v":1910,"d":"1910.00"},null,321,null,{"v":1910,"d":"1910.00"},null,391,null,{"v":1910,"d":"1910.00"}]
[null,42,null,{"v":1910,"d":"1910.00"},null,112,null,{"v":1910,"d":"1910.00"},null,182,null,{"v":1910,"d":"1910.00"},null,252,null,{"v":1910,"d":"1910.00"},null,322,null,{"v":1910,"d":"1910.00"},null,392,null,{"v":1910,"d":"1910.00"}]
[null,43,null,{"v":1910,"d":"1910.00"},null,113,null,{"v":1910,"d":"1910.00"},null,183,null,{"v":1910,"d":"1910.00"},null,253,null,{"v":1910,"d":"1910.00"},null,323,null,{"v":1910,"d":"1910.00"},null,393,null,{"v":1910,"d":"1910.00"}]
[null,44,null,{"v":1910,"d":"1910.00"},null,114,null,{"v":1910,"d":"1910.00"},null,184,null,{"v":1910,"d":"1910.00"},null,254,null,{"v":1910,"d":"1910.00"},null,324,null,{"v":1910,"d":"1910.00"},null,394,null,{"v":1910,"d":"1910.00"}]
[null,45,null,{"v":1910,"d":"1910.00"},null,115,null,{"v":1910,"d":"1910.00"},null,185,null,{"v":1910,"d":"1910.00"},null,255,null,{"v":1910,"d":"1910.00"},null,325,null,{"v":1910,"d":"1910.00"},null,395,null,{"v":1910,"d":"1910.00"}]
[null,46,null,{"v":1910,"d":"1910.00"},null,116,null,{"v":1910,"d":"1910.00"},null,186,null,{"v":1910,"d":"1910.00"},null,256,null,{"v":1910,"d":"1910.00"},null,326,null,{"v":1910,"d":"1910.00"},null,396,null,{"v":1910,"d":"1910.00"}]
[null,47,null,{"v":1910,"d":"1910.00"},null,117,null,{"v":1910,"d":"1910.00"},null,187,null,{"v":1910,"d":"1910.00"},null,257,null,{"v":1910,"d":"1910.00"},null,327,null,{"v":1910,"d":"1910.00"},null,397,null,{"v":1910,"d":"1910.00"}]
[null,48,null,{"v":1910,"d":"1910.00"},null,118,null,{"v":1910,"d":"1910.00"},null,188,null,{"v":1910,"d":"1910.00"},null,258,null,{"v":1910,"d":"1910.00"},null,328,null,{"v":1910,"d":"1910.00"},null,398,null,{"v":1910,"d":"1910.00"}]
[null,49,null,{"v":1910,"d":"1910.00"},null,119,null,{"v":1910,"d":"1910.00"},null,189,null,{"v":1910,"d":"1910.00"},null,259,null,{"v":1910,"d":"1910.00"},null,329,null,{"v":1910,"d":"1910.00"},null,399,null,{"v":1910,"d":"1910.00"}]
[null,50,null,{"v":1910,"d":"1910.00"},null,120,null,{"v":1910,"d":"1910.00"},null,190,null,{"v":1910,"d":"1910.00"},null,260,null,{"v":1910,"d":"1910.00"},null,330,null,{"v":1910,"d":"1910.00"},null,400,null,{"v":1910,"d":"1910.00"}]
[null,51,null,{"v":1910,"d":"1910.00"},null,121,null,{"v":1910,"d":"1910.00"},null,191,null,{"v":1910,"d":"1910.00"},null,261,null,{"v":1910,"d":"1910.00"},null,331,null,{"v":1910,"d":"1910.00"},null,401,null,{"v":1910,"d":"1910.00"}]
[null,52,null,{"v":1910,"d":"1910.00"},null,122,null,{"v":1910,"d":"1910.00"},null,192,null,{"v":1910,"d":"1910.00"},null,262,null,{"v":1910,"d":"1910.00"},null,332,null,{"v":1910,"d":"1910.00"},null,402,null,{"v":1910,"d":"1910.00"}]
[null,53,null,{"v":1910,"d":"1910.00"},null,123,null,{"v":1910,"d":"1910.00"},null,193,null,{"v":1910,"d":"1910.00"},null,263,null,{"v":1910,"d":"1910.00"},null,333,null,{"v":1910,"d":"1910.00"},null,403,null,{"v":1910,"d":"1910.00"}]
[null,54,null,{"v":1910,"d":"1910.00"},null,124,null,{"v":1910,"d":"1910.00"},null,194,null,{"v":1910,"d":"1910.00"},null,264,null,{"v":1910,"d":"1910.00"},null,334,null,{"v":1910,"d":"1910.00"},null,404,null,{"v":1910,"d":"1910.00"}]
[null,55,null,{"v":1910,"d":"1910.00"},null,125,null,{"v":1910,"d":"1910.00"},null,195,null,{"v":1910,"d":"1910.00"},null,265,null,{"v":1910,"d":"1910.00"},null,335,null,{"v":1910,"d":"1910.00"},null,405,null,{"v":1910,"d":"1910.00"}]
[null,56,null,{"v":1910,"d":"1910.00"},null,126,null,{"v":1910,"d":"1910.00"},null,196,null,{"v":1910,"d":"1910.00"},null,266,null,{"v":1910,"d":"1910.00"},null,336,null,{"v":1910,"d":"1910.00"},null,406,null,{"v":1910,"d":"1910.00"}]
[null,57,null,{"v":1910,"d":"1910.00"},null,127,null,{"v":1910,"d":"1910.00"},null,197,null,{"v":1910,"d":"1910.00"},null,267,null,{"v":1910,"d":"1910.00"},null,337,null,{"v":1910,"d":"1910.00"},null,407,null,{"v":1910,"d":"1910.00"}]
[null,58,null,{"v":1910,"d":"1910.00"},null,128,null,{"v":1910,"d":"1910.00"},null,198,null,{"v":1910,"d":"1910.00"},null,268,null,{"v":1910,"d":"1910.00"},null,338,null,{"v":1910,"d":"1910.00"},null,408,null,{"v":1910,"d":"1910.00"}]
[null,59,null,{"v":1910,"d":"1910.00"},null,129,null,{"v":1910,"d":"1910.00"},null,199,null,{"v":1910,"d":"1910.00"},null,269,null,{"v":1910,"d":"1910.00"},null,339,null,{"v":1910,"d":"1910.00"},null,409,null,{"v":1910,"d":"1910.00"}]
[null,60,null,{"v":1910,"d":"1910.00"},null,130,null,{"v":1910,"d":"1910.00"},null,200,null,{"v":1910,"d":"1910.00"},null,270,null,{"v":1910,"d":"1910.00"},null,340,null,{"v":1910,"d":"1910.00"},null,410,null,{"v":1910,"d":"1910.00"}]
[null,61,null,{"v":1910,"d":"1910.00"},null,131,null,{"v":1910,"d":"1910.00"},null,201,null,{"v":1910,"d":"1910.00"},null,271,null,{"v":1910,"d":"1910.00"},null,341,null,{"v":1910,"d":"1910.00"},null,411,null,{"v":1910,"d":"1910.00"}]
[null,62,null,{"v":1910,"d":"1910.00"},null,132,null,{"v":1910,"d":"1910.00"},null,202,null,{"v":1910,"d":"1910.00"},null,272,null,{"v":1910,"d":"1910.00"},null,342,null,{"v":1910,"d":"1910.00"},null,412,null,{"v":1910,"d":"1910.00"}]
[null,63,null,{"v":1910,"d":"1910.00"},null,133,null,{"v":1910,"d":"1910.00"},null,203,null,{"v":1910,"d":"1910.00"},null,273,null,{"v":1910,"d":"1910.00"},null,343,null,{"v":1910,"d":"1910.00"},null,413,null,{"v":1910,"d":"1910.00"}]
[null,64,null,{"v":1910,"d":"1910.00"},null,134,null,{"v":1910,"d":"1910.00"},null,204,null,{"v":1910,"d":"1910.00"},null,274,null,{"v":1910,"d":"1910.00"},null,344,null,{"v":1910,"d":"1910.00"},null,414,null,{"v":1910,"d":"1910.00"}]
[null,65,null,{"v":1910,"d":"1910.00"},null,135,null,{"v":1910,"d":"1910.00"},null,205,null,{"v":1910,"d":"1910.00"},null,275,null,{"v":1910,"d":"1910.00"},null,345,null,{"v":1910,"d":"1910.00"},null,415,null,{"v":1910,"d":"1910.00"}]
[null,66,null,{"v":1910,"d":"1910.00"},null,136,null,{"v":1910,"d":"1910.00"},null,206,null,{"v":1910,"d":"1910.00"},null,276,null,{"v":1910,"d":"1910.00"},null,346,null,{"v":1910,"d":"1910.00"},null,416,null,{"v":1910,"d":"1910.00"}]
[null,67,null,{"v":1910,"d":"1910.00"},null,137,null,{"v":1910,"d":"1910.00"},null,207,null,{"v":1910,"d":"1910.00"},null,277,null,{"v":1910,"d":"1910.00"},null,347,null,{"v":1910,"d":"1910.00"},null,417,null,{"v":1910,"d":"1910.00"}]
[null,68,null,{"v":1910,"d":"1910.00"},null,138,null,{"v":1910,"d":"1910.00"},null,208,null,{"v":1910,"d":"1910.00"},null,278,null,{"v":1910,"d":"1910.00"},null,348,null,{"v":1910,"d":"1910.00"},null,418,null,{"v":1910,"d":"1910.00"}]
[null,69,null,{"v":1910,"d":"1910.00"},null,139,null,{"v":1910,"d":"1910.00"},null,209,null,{"v":1910,"d":"1910.00"},null,279,null,{"v":1910,"d":"1910.00"},null,349,null,{"v":1910,"d":"1910.00"},null,419,null,{"v":1910,"d":"1910.00"}]
[null,70,null,{"v":1910,"d":"1910.00"},null,140,null,{"v":1910,"d":"1910.00"},null,210,null,{"v":1910,"d":"1910.00"},{"v":0,"d":"0.00"},280,0,{"v":1910,"d":"1910.00"},{"v":0,"d":"0.00"},350,0,{"v":1910,"d":"1910.00"},{"v":0,"d":"0.00"},420,0,{"v":1910,"d":"1910.00"},{"v":0,"d":"0.00"}]
{"$rows_empty":24}
[{"$nulls":30},{"$f":"'Tape '!L5+'Tape '!$M$5","v":{"$error":"#VALUE!"}}]

{"sheet":"IC-106","index":3,"n_rows":39,"n_cols":26,"rows_kept":39,"merged":[[2,4,7,9],[2,10,7,13],[8,1,10,1],[8,2,10,2],[8,3,8,13],[9,4,10,4],[9,5,10,5],[9,6,10,6],[9,7,10,7],[9,8,9,9],[9,10,10,10],[9,12,9,13],[11,25,13,29],[14,25,16,29]]}
[{"$nulls":3},"Minnesota Department of Transportation (MnDOT)",{"$nulls":12},"Start Row",null,"High Accuracy PMTP?"]
[{"$nulls":16},11]
[{"$nulls":4},"THIS IS NOT AN IC-106 FORM. THIS FORM ALLOWS THE USER TO COPY AND PAST DATA ONTO THE IC-106 FORM.",{"$nulls":5},"COPY CELLS D12 TO N39 AND PASTE \"VALUES\" ONTO PROJECT \nIC-106 FORM",{"$nulls":5},false]
[{"$nulls":16},false]
[]
[]
[]
[]
[null,"Data Lot Number","Filter Group Name","Inspector Input"]
[{"$nulls":3},"For overnight paving enter first day only","Route System","Route No.","Material","Lift","Do not include shoulders",null,"Divided Highway (Yes)","Divided Highways Only","Use ROVER to\ndetermine stations"]
[{"$nulls":3},"Paving Date\n(MM/DD/YY)",{"$nulls":4},"Centerline Offset","Custom Centerline Offset",null,"Direction of Travel","Data Lot\nStart Station","Data Lot\nEnd Station",null,null,"Route System","Material","Lift","Centerline offsets",null,"Region No.","Direction",null,"Divided"]
[null,{"$f":"IF(ISBLANK(D12),\"\",TEXT(1,\"00\"))","v":"01"},{"$f":"IF(COUNTA(D12:J12)<6,\"\",IF(ISBLANK(J12),CONCATENATE(TEXT(D12,\"MMDDYY \"),E12,F12,X12,G12,X12,H12,X12,I12,Y12),CONCATENATE(TEXT(D12,\"MMDDYY \"),E12,F12,X12,G12,X12,H12,X12,J12,Y12)))","v":"010000 00--0-0"},{"$f":"'Data sheet'!$L$3","v":"00:00:00"},{"$f":"'Street Report'!C9","v":0},{"$f":"'Street Report'!D9","v":0},null,{"$f":"'Street Report'!E9","v":0},{"$f":"'Street Report'!I9","v":0},{"$f":"'Data sheet'!AO34","v":0},null,{"$f":"IF(K12=\"yes\",'Street Report'!H9,\" \")","v":" "},{"$f":"'Street Report'!M9","v":{"v":0,"d":"0+00"}},{"$f":"'Street Report'!N9","v":{"v":0,"d":"0+00"}},null,null,"TH","HMA","L1",null,null,1,"NB",{"$f":"IF(ISBLANK(D12),\"\",\"-\")","v":"-"},{"$f":"IF(K12=\"Yes\",CONCATENATE(X12,L12),\"\")","v":""},"IC-106 Form by Advanced Materials & Technology"]
[null,{"$f":"IF(ISBLANK(D13),\"\",TEXT(B12+1,\"00\"))","v":"02"},"010000 00--0-0",{"$f":"'Data sheet'!$L$3","v":"00:00:00"},{"$f":"'Street Report'!C10","v":0},{"$f":"'Street Report'!D10","v":0},null,{"$f":"'Street Report'!E10","v":0},{"$f":"'Street Report'!I10","v":0},{"$f":"'Data sheet'!AO35","v":0},null,{"$f":"IF(K13=\"yes\",'Street Report'!H10,\" \")","v":" "},{"$f":"'Street Report'!M10","v":{"v":0,"d":"0+00"}},{"$f":"'Street Report'!N10","v":{"v":0,"d":"0+00"}},null,null,"CSAH","WMA","L2","12L-CL",null,2,"SB","-",""]
[null,{"$f":"IF(ISBLANK(D14),\"\",TEXT(B13+1,\"00\"))","v":"03"},"010000 00--0-0",{"$f":"'Data sheet'!$L$3","v":"00:00:00"},{"$f":"'Street Report'!C11","v":0},{"$f":"'Street Report'!D11","v":0},null,{"$f":"'Street Report'!E11","v":0},{"$f":"'Street Report'!I11","v":0},{"$f":"'Data sheet'!AO36","v":0},null,{"$f":"IF(K14=\"yes\",'Street Report'!H11,\" \")","v":" "},{"$f":"'Street Report'!M11","v":{"v":0,"d":"0+00"}},{"$f":"'Street Report'!N11","v":{"v":0,"d":"0+00"}},null,null,"CR","CIR","L3","CL-12R",null,3,"EB","-",""]
[null,"04","010000 00--0-0",{"$f":"'Data sheet'!$L$3","v":"00:00:00"},{"$f":"'Street Report'!C12","v":0},{"$f":"'Street Report'!D12","v":0},null,{"$f":"'Street Report'!E12","v":0},{"$f":"'Street Report'!I12","v":0},{"$f":"'Data sheet'!AO37","v":0},null,{"$f":"IF(K15=\"yes\",'Street Report'!H12,\" \")","v":" "},{"$f":"'Street Report'!M12","v":{"v":0,"d":"0+00"}},{"$f":"'Street Report'!N12","v":{"v":0,"d":"0+00"}},null,null,"MS","LVL","L4","18L-CL",null,4,"WB","-","","Click on the link above to open an IC-106 form. Create a project specific IC-106 form. Once created you will continue to update that form. "]
[null,"05","010000 00--0-0",{"$f":"'Data sheet'!$L$3","v":"00:00:00"},{"$f":"'Street Report'!C13","v":0},{"$f":"'Street Report'!D13","v":0},null,{"$f":"'Street Report'!E13","v":0},{"$f":"'Street Report'!I13","v":0},{"$f":"'Data sheet'!AO38","v":0},null,{"$f":"IF(K16=\"yes\",'Street Report'!H13,\" \")","v":" "},{"$f":"'Street Report'!M13","v":{"v":0,"d":"0+00"}},{"$f":"'Street Report'!N13","v":{"v":0,"d":"0+00"}},null,null,"MSAH","UTBWC","L5","CL-18R",null,5,null,"-",""]
[null,"06","010000 00--0-0",{"$f":"'Data sheet'!$L$3","v":"00:00:00"},{"$f":"'Street Report'!C14","v":0},{"$f":"'Street Report'!D14","v":0},null,{"$f":"'Street Report'!E14","v":0},{"$f":"'Street Report'!I14","v":0},{"$f":"'Data sheet'!AO39","v":0},null,{"$f":"IF(K17=\"yes\",'Street Report'!H14,\" \")","v":" "},{"$f":"'Street Report'!M14","v":{"v":0,"d":"0+00"}},{"$f":"'Street Report'!N14","v":{"v":0,"d":"0+00"}},{"$nulls":3},"SFDR-I","L6","6R-18R",null,6,null,"-",""]
[null,"07","010000 00--0-0",{"$f":"'Data sheet'!$L$3","v":"00:00:00"},{"$f":"'Street Report'!C15","v":0},{"$f":"'Street Report'!D15","v":0},null,{"$f":"'Street Report'!E15","v":0},{"$f":"'Street Report'!I15","v":0},{"$f":"'Data sheet'!AO40","v":0},null,{"$f":"IF(K18=\"yes\",'Street Report'!H15,\" \")","v":" "},{"$f":"'Street Report'!M15","v":{"v":0,"d":"0+00"}},{"$f":"'Street Report'!N15","v":{"v":0,"d":"0+00"}},{"$nulls":3},"SFDR-P",null,"18L-6L",null,7,null,"-",""]
[null,"08","010000 00--0-0",{"$f":"'Data sheet'!$L$3","v":"00:00:00"},{"$f":"'Street Report'!C16","v":0},{"$f":"'Street Report'!D16","v":0},null,{"$f":"'Street Report'!E16","v":0},{"$f":"'Street Report'!I16","v":0},{"$f":"'Data sheet'!AO41","v":0},null,{"$f":"IF(K19=\"yes\",'Street Report'!H16,\" \")","v":" "},{"$f":"'Street Report'!M16","v":{"v":0,"d":"0+00"}},{"$f":"'Street Report'!N16","v":{"v":0,"d":"0+00"}},{"$nulls":3},"SMA",null,"24L-12L",null,8,null,"-",""]
[null,"09","010000 00--0-0",{"$f":"'Data sheet'!$L$3","v":"00:00:00"},{"$f":"'Street Report'!C17","v":0},{"$f":"'Street Report'!D17","v":0},null,{"$f":"'Street Report'!E17","v":0},{"$f":"'Street Report'!I17","v":0},{"$f":"'Data sheet'!AO42","v":0},null,{"$f":"IF(K20=\"yes\",'Street Report'!H17,\" \")","v":" "},{"$f":"'Street Report'!M17","v":{"v":0,"d":"0+00"}},{"$f":"'Street Report'!N17","v":{"v":0,"d":"0+00"}},{"$nulls":3},"CCPR",null,"12R-24R",null,9,"Yes/No","-",""]
[null,"10","010000 00--0-0",{"$f":"'Data sheet'!$L$3","v":"00:00:00"},{"$f":"'Street Report'!C18","v":0},{"$f":"'Street Report'!D18","v":0},null,{"$f":"'Street Report'!E18","v":0},{"$f":"'Street Report'!I18","v":0},{"$f":"'Data sheet'!AO43","v":0},null,{"$f":"IF(K21=\"yes\",'Street Report'!H18,\" \")","v":" "},{"$f":"'Street Report'!M18","v":{"v":0,"d":"0+00"}},{"$f":"'Street Report'!N18","v":{"v":0,"d":"0+00"}},{"$nulls":5},"36L-24L",null,10,"Yes","-",""]
[null,"11","010000 00--0-0",{"$f":"'Data sheet'!$L$3","v":"00:00:00"},{"$f":"'Street Report'!C19","v":0},{"$f":"'Street Report'!D19","v":0},null,{"$f":"'Street Report'!E19","v":0},{"$f":"'Street Report'!I19","v":0},{"$f":"'Data sheet'!AO44","v":0},null,{"$f":"IF(K22=\"yes\",'Street Report'!H19,\" \")","v":" "},{"$f":"'Street Report'!M19","v":{"v":0,"d":"0+00"}},{"$f":"'Street Report'!N19","v":{"v":0,"d":"0+00"}},{"$nulls":5},"24R-36R",null,11,null,"-",""]
[null,"12","010000 00--0-0",{"$f":"'Data sheet'!$L$3","v":"00:00:00"},{"$f":"'Street Report'!C20","v":0},{"$f":"'Street Report'!D20","v":0},null,{"$f":"'Street Report'!E20","v":0},{"$f":"'Street Report'!I20","v":0},{"$f":"'Data sheet'!AO45","v":0},null,{"$f":"IF(K23=\"yes\",'Street Report'!H20,\" \")","v":" "},{"$f":"'Street Report'!M20","v":{"v":0,"d":"0+00"}},{"$f":"'Street Report'!N20","v":{"v":0,"d":"0+00"}},{"$nulls":5},"48L-36L",null,12,"Yes","-",""]
[null,"13","010000 00--0-0",{"$f":"'Data sheet'!$L$3","v":"00:00:00"},{"$f":"'Street Report'!C21","v":0},{"$f":"'Street Report'!D21","v":0},null,{"$f":"'Street Report'!E21","v":0},{"$f":"'Street Report'!I21","v":0},{"$f":"'Data sheet'!AO46","v":0},null,{"$f":"IF(K24=\"yes\",'Street Report'!H21,\" \")","v":" "},{"$f":"'Street Report'!M21","v":{"v":0,"d":"0+00"}},{"$f":"'Street Report'!N21","v":{"v":0,"d":"0+00"}},{"$nulls":5},"36R-48R",null,13,"No","-",""]
[null,"14","010000 00--0-0",{"$f":"'Data sheet'!$L$3","v":"00:00:00"},{"$f":"'Street Report'!C22","v":0},{"$f":"'Street Report'!D22","v":0},null,{"$f":"'Street Report'!E22","v":0},{"$f":"'Street Report'!I22","v":0},{"$f":"'Data sheet'!AO47","v":0},null,{"$f":"IF(K25=\"yes\",'Street Report'!H22,\" \")","v":" "},{"$f":"'Street Report'!M22","v":{"v":0,"d":"0+00"}},{"$f":"'Street Report'!N22","v":{"v":0,"d":"0+00"}},{"$nulls":5},"6L-6R",null,14,null,"-",""]
[null,"15","010000 00--0-0",{"$f":"'Data sheet'!$L$3","v":"00:00:00"},{"$f":"'Street Report'!C23","v":0},{"$f":"'Street Report'!D23","v":0},null,{"$f":"'Street Report'!E23","v":0},{"$f":"'Street Report'!I23","v":0},{"$f":"'Data sheet'!AO48","v":0},null,{"$f":"IF(K26=\"yes\",'Street Report'!H23,\" \")","v":" "},{"$f":"'Street Report'!M23","v":{"v":0,"d":"0+00"}},{"$f":"'Street Report'!N23","v":{"v":0,"d":"0+00"}},{"$nulls":5},"12L-12R",null,15,null,"-",""]
[null,"16","010000 00--0-0",{"$f":"'Data sheet'!$L$3","v":"00:00:00"},{"$f":"'Street Report'!C24","v":0},{"$f":"'Street Report'!D24","v":0},null,{"$f":"'Street Report'!E24","v":0},{"$f":"'Street Report'!I24","v":0},{"$f":"'Data sheet'!AO49","v":0},null,{"$f":"IF(K27=\"yes\",'Street Report'!H24,\" \")","v":" "},{"$f":"'Street Report'!M24","v":{"v":0,"d":"0+00"}},{"$f":"'Street Report'!N24","v":{"v":0,"d":"0+00"}},{"$nulls":5},"24L-24R",{"$nulls":3},"-",""]
[null,"17","010000 00--0-0",{"$f":"'Data sheet'!$L$3","v":"00:00:00"},{"$f":"'Street Report'!C25","v":0},{"$f":"'Street Report'!D25","v":0},null,{"$f":"'Street Report'!E25","v":0},{"$f":"'Street Report'!I25","v":0},{"$f":"'Data sheet'!AO50","v":0},null,{"$f":"IF(K28=\"yes\",'Street Report'!H25,\" \")","v":" "},{"$f":"'Street Report'!M25","v":{"v":0,"d":"0+00"}},{"$f":"'Street Report'!N25","v":{"v":0,"d":"0+00"}},{"$nulls":9},"-",""]
[null,"18","010000 00--0-0",{"$f":"'Data sheet'!$L$3","v":"00:00:00"},{"$f":"'Street Report'!C26","v":0},{"$f":"'Street Report'!D26","v":0},null,{"$f":"'Street Report'!E26","v":0},{"$f":"'Street Report'!I26","v":0},{"$f":"'Data sheet'!AO51","v":0},null,{"$f":"IF(K29=\"yes\",'Street Report'!H26,\" \")","v":" "},{"$f":"'Street Report'!M26","v":{"v":0,"d":"0+00"}},{"$f":"'Street Report'!N26","v":{"v":0,"d":"0+00"}},{"$nulls":9},"-",""]
[null,"19","010000 00--0-0",{"$f":"'Data sheet'!$L$3","v":"00:00:00"},{"$f":"'Street Report'!C27","v":0},{"$f":"'Street Report'!D27","v":0},null,{"$f":"'Street Report'!E27","v":0},{"$f":"'Street Report'!I27","v":0},{"$f":"'Data sheet'!AO52","v":0},null,{"$f":"IF(K30=\"yes\",'Street Report'!H27,\" \")","v":" "},{"$f":"'Street Report'!M27","v":{"v":0,"d":"0+00"}},{"$f":"'Street Report'!N27","v":{"v":0,"d":"0+00"}},{"$nulls":9},"-",""]
[null,"20","010000 00--0-0",{"$f":"'Data sheet'!$L$3","v":"00:00:00"},{"$f":"'Street Report'!C28","v":0},{"$f":"'Street Report'!D28","v":0},null,{"$f":"'Street Report'!E28","v":0},{"$f":"'Street Report'!I28","v":0},{"$f":"'Data sheet'!AO53","v":0},null,{"$f":"IF(K31=\"yes\",'Street Report'!H28,\" \")","v":" "},{"$f":"'Street Report'!M28","v":{"v":0,"d":"0+00"}},{"$f":"'Street Report'!N28","v":{"v":0,"d":"0+00"}},{"$nulls":9},"-",""]
[null,"21","010000 00--0-0",{"$f":"'Data sheet'!$L$3","v":"00:00:00"},{"$f":"'Street Report'!C29","v":0},{"$f":"'Street Report'!D29","v":0},null,{"$f":"'Street Report'!E29","v":0},{"$f":"'Street Report'!I29","v":0},{"$f":"'Data sheet'!AO54","v":0},null,{"$f":"IF(K32=\"yes\",'Street Report'!H29,\" \")","v":" "},{"$f":"'Street Report'!M29","v":{"v":0,"d":"0+00"}},{"$f":"'Street Report'!N29","v":{"v":0,"d":"0+00"}},{"$nulls":9},"-",""]
[null,"22","010000 00--0-0",{"$f":"'Data sheet'!$L$3","v":"00:00:00"},{"$f":"'Street Report'!C30","v":0},{"$f":"'Street Report'!D30","v":0},null,{"$f":"'Street Report'!E30","v":0},{"$f":"'Street Report'!I30","v":0},{"$f":"'Data sheet'!AO55","v":0},null,{"$f":"IF(K33=\"yes\",'Street Report'!H30,\" \")","v":" "},{"$f":"'Street Report'!M30","v":{"v":0,"d":"0+00"}},{"$f":"'Street Report'!N30","v":{"v":0,"d":"0+00"}},{"$nulls":9},"-",""]
[null,"23","010000 00--0-0",{"$f":"'Data sheet'!$L$3","v":"00:00:00"},{"$f":"'Street Report'!C31","v":0},{"$f":"'Street Report'!D31","v":0},null,{"$f":"'Street Report'!E31","v":0},{"$f":"'Street Report'!I31","v":0},{"$f":"'Data sheet'!AO56","v":0},null,{"$f":"IF(K34=\"yes\",'Street Report'!H31,\" \")","v":" "},{"$f":"'Street Report'!M31","v":{"v":0,"d":"0+00"}},{"$f":"'Street Report'!N31","v":{"v":0,"d":"0+00"}},{"$nulls":9},"-",""]
[null,"24","010000 00--0-0",{"$f":"'Data sheet'!$L$3","v":"00:00:00"},{"$f":"'Street Report'!C32","v":0},{"$f":"'Street Report'!D32","v":0},null,{"$f":"'Street Report'!E32","v":0},{"$f":"'Street Report'!I32","v":0},{"$f":"'Data sheet'!AO57","v":0},null,{"$f":"IF(K35=\"yes\",'Street Report'!H32,\" \")","v":" "},{"$f":"'Street Report'!M32","v":{"v":0,"d":"0+00"}},{"$f":"'Street Report'!N32","v":{"v":0,"d":"0+00"}},{"$nulls":9},"-",""]
[null,"25","010000 00--0-0",{"$f":"'Data sheet'!$L$3","v":"00:00:00"},{"$f":"'Street Report'!C33","v":0},{"$f":"'Street Report'!D33","v":0},null,{"$f":"'Street Report'!E33","v":0},{"$f":"'Street Report'!I33","v":0},{"$f":"'Data sheet'!AO58","v":0},null,{"$f":"IF(K36=\"yes\",'Street Report'!H33,\" \")","v":" "},{"$f":"'Street Report'!M33","v":{"v":0,"d":"0+00"}},{"$f":"'Street Report'!N33","v":{"v":0,"d":"0+00"}},{"$nulls":9},"-",""]
[null,"26","010000 00--0-0",{"$f":"'Data sheet'!$L$3","v":"00:00:00"},{"$f":"'Street Report'!C34","v":0},{"$f":"'Street Report'!D34","v":0},null,{"$f":"'Street Report'!E34","v":0},{"$f":"'Street Report'!I34","v":0},{"$f":"'Data sheet'!AO59","v":0},null,{"$f":"IF(K37=\"yes\",'Street Report'!H34,\" \")","v":" "},{"$f":"'Street Report'!M34","v":{"v":0,"d":"0+00"}},{"$f":"'Street Report'!N34","v":{"v":0,"d":"0+00"}},{"$nulls":9},"-",""]
[null,"27","010000 00--0-0",{"$f":"'Data sheet'!$L$3","v":"00:00:00"},{"$f":"'Street Report'!C35","v":0},{"$f":"'Street Report'!D35","v":0},null,{"$f":"'Street Report'!E35","v":0},{"$f":"'Street Report'!I35","v":0},{"$f":"'Data sheet'!AO60","v":0},null,{"$f":"IF(K38=\"yes\",'Street Report'!H35,\" \")","v":" "},{"$f":"'Street Report'!M35","v":{"v":0,"d":"0+00"}},{"$f":"'Street Report'!N35","v":{"v":0,"d":"0+00"}},{"$nulls":9},"-",""]
[null,"28","010000 00--0-0",{"$f":"'Data sheet'!$L$3","v":"00:00:00"},{"$f":"'Street Report'!C36","v":0},{"$f":"'Street Report'!D36","v":0},null,{"$f":"'Street Report'!E36","v":0},{"$f":"'Street Report'!I36","v":0},{"$f":"'Data sheet'!AO61","v":0},null,{"$f":"IF(K39=\"yes\",'Street Report'!H36,\" \")","v":" "},{"$f":"'Street Report'!M36","v":{"v":0,"d":"0+00"}},{"$f":"'Street Report'!N36","v":{"v":0,"d":"0+00"}},{"$nulls":9},"-",""]

{"sheet":"Core Stationing","index":4,"n_rows":281,"n_cols":40,"rows_kept":281,"merged":[[0,7,0,13],[1,7,1,13],[4,6,4,8],[4,9,4,10],[4,11,4,12],[4,14,4,15],[5,6,5,8],[5,9,5,10],[5,11,5,13],[18,19,18,20],[23,14,24,14],[23,15,24,15],[23,16,24,16],[23,17,24,17],[33,15,33,16],[34,15,34,16],[35,15,35,16],[36,15,36,16],[41,1,42,1],[41,3,41,5],[42,3,42,5],[43,1,44,1],[43,3,43,5],[44,3,44,5],[45,1,46,1],[45,3,45,5],[46,3,46,5],[47,1,48,1],[47,3,47,5],[48,3,48,5],[49,1,50,1],[49,3,49,5],[50,3,50,5],[51,1,52,1],[51,3,51,5],[52,3,52,5],[53,1,54,1],[53,3,53,5],[54,3,54,5],[55,1,56,1],[55,3,55,5],[56,3,56,5],[57,1,58,1],[59,1,60,1],[62,1,62,3],[62,4,62,8],[62,10,68,14],[63,1,63,2],[63,4,66,9],[64,1,64,2],[65,1,65,2],[66,1,66,2],[67,1,67,2],[67,4,68,5],[67,6,68,9],[68,1,68,2],[69,1,69,2],[69,10,71,14],[69,15,71,18],[70,1,71,3],[72,9,75,18],[73,4,73,5],[74,4,74,5],[75,4,75,5],[76,4,76,5],[77,4,77,5],[78,4,78,5],[79,4,79,5],[80,4,80,5],[269,10,269,13]]}
["MN_DOT_AASHTOWare Project Support <AASHTOWareProjectSupport.DOT@state.mn.us>",{"$nulls":6},"Bituminous Core Stationing with Formatted Locations",{"$nulls":27},"Asphalt"]
[{"$nulls":7},{"$f":"IF(R8=\"Yes\",\"including Longitudinal Joint Density\",\"\")","v":"including Longitudinal Joint Density"},{"$nulls":16},"Drop Down Box Lists",null,null,"County ",{"$nulls":4},"Show","Type","Mix","Binder",null,null,"Lane","Density"]
[{"$nulls":5},"2019-09-20",{"$nulls":18},"Project","Road Type","LJD?","Number","County","Tons","Lots","Direction","Companion Cores?","of","Type","Grade","L","Direction","Type","Determination"]
[{"$nulls":24},"SP","TH","Yes",null,null,0.1,0,{"$f":"IF(J10<K10,1,IF(J10=K10,0,IF(J10>K10,-1,\"NOT\")))","v":0},"All","Joint",null,"A= PG 52-34","L1"]
[{"$nulls":5},{"$f":"'Data sheet'!A5","v":"SP"},{"$f":"'Data sheet'!B5","v":0},null,null,{"$f":"'Data sheet'!A3","v":"TH"},null,{"$f":"'Data sheet'!B3","v":0},null,"Engineer",{"$f":"'Data sheet'!E3","v":0},{"$nulls":9},"SAP","CSAH","No",1,"Aitkin",1,1,0,"1 per Lot",null,"SPWEA230","B= PG 58-28","L2","NB","Traffic Lane","No"]
[{"$nulls":5},"Contractor",{"$f":"'Data sheet'!I3","v":0},null,null,"Plant",null,{"$f":"'Data sheet'!I5","v":0},{"$nulls":12},"CP","CR",null,2,"Anoka",601,2,0,"No","Confined","SPWEA240","C= PG 58-34","L3","SB","Lt Shoulder","Yes"]
[{"$nulls":24},"MP","MSAH",null,3,"Becker",1001,3,0,null,"Unconfined","SPWEA330","E= PG 64-28","L4","EB","Lt Turn Lane 2"]
[null,"Route","Lift","Lane Type","Direction of Travel","Standard Centerline Offset","Custom Offset Left Boundary (Example: 11L, 12R)","Custom Offset Right Boundary (Example: CL, 20R)","Alignment Name\n(If Applicable)","Begin Station","End Station","Lane Width","Custom Lane Width",{"$nulls":3},"Longitudinal Joint Density Project?","Yes","Date Paved",{"$f":"'Data sheet'!L3","v":"00:00:00"},{"$nulls":5},"MS ",null,4,"Beltrami",1601,4,0,null,null,"SPWEA340","F= PG 64-34","L5","WB","Lt Turn Lane  "]
[{"$nulls":9},"(ft)","(ft)","(ft)",{"$nulls":4},"1% Density Reduction?","No","REPORT #",{"$f":"'Data sheet'!L5","v":0},{"$nulls":7},5,"Benton",2601,5,0,null,null,"SPWEA430","H= PG 70-28","L6",null,"Lt Lane"]
[null,{"$f":"'Street Report'!C9","v":0},{"$f":"'Street Report'!E9","v":0},{"$f":"'Street Report'!F9","v":0},{"$f":"'Street Report'!H9","v":0},{"$f":"'Street Report'!I9","v":0},{"$f":"'Street Report'!J9","v":0},{"$f":"IFERROR('Street Report'!K9,\" \")","v":0},{"$f":"'Street Report'!L9","v":0},{"$f":"'Street Report'!M9","v":{"v":0,"d":"0+00"}},{"$f":"'Street Report'!N9","v":{"v":0,"d":"0+00"}},{"$f":"'Street Report'!O9","v":" "},{"$f":"'Street Report'!P9","v":{"v":0,"d":"0.00"}},{"$nulls":5},"Date Cored",{"$nulls":8},6,"Big Stone",4601,6,0,null,null,"SPWEA440","I= PG 70-34","L7",null,"Lt Center"]
[null,{"$f":"'Street Report'!C10","v":0},{"$f":"'Street Report'!E10","v":0},{"$f":"'Street Report'!F10","v":0},{"$f":"'Street Report'!H10","v":0},{"$f":"'Street Report'!I10","v":0},{"$f":"'Street Report'!J10","v":0},{"$f":"'Street Report'!K10","v":0},{"$f":"'Street Report'!L10","v":0},{"$f":"'Street Report'!M10","v":{"v":0,"d":"0+00"}},{"$f":"'Street Report'!N10","v":{"v":0,"d":"0+00"}},{"$f":"'Street Report'!O10","v":" "},{"$f":"'Street Report'!P10","v":{"v":0,"d":"0.00"}},null,"Total Density Tons Paved",null,{"$f":"'Street Report'!S37","v":{"v":0,"d":"0.00"}},{"$nulls":10},7,"Blue Earth",5501,7,0,null,null,"SPWEA530","L= PG 64-22",null,null,"Center Lane"]
[null,{"$f":"'Street Report'!C11","v":0},{"$f":"'Street Report'!E11","v":0},{"$f":"'Street Report'!F11","v":0},{"$f":"'Street Report'!H11","v":0},{"$f":"'Street Report'!I11","v":0},{"$f":"'Street Report'!J11","v":0},{"$f":"'Street Report'!K11","v":0},{"$f":"'Street Report'!L11","v":0},{"$f":"'Street Report'!M11","v":{"v":0,"d":"0+00"}},{"$f":"'Street Report'!N11","v":{"v":0,"d":"0+00"}},{"$f":"'Street Report'!O11","v":" "},{"$f":"'Street Report'!P11","v":{"v":0,"d":"0.00"}},null,"Tons Per Lot",null,{"$f":"IFERROR(Q11/Q14,\"\")","v":""},null,"MDR/Rec#",{"$f":"'Street Report'!L5","v":0},{"$nulls":7},8,"Brown",6401,8,0,null,null,"SPWEA540","M= PG 49-34",null,null,"Rt Center"]
[null,{"$f":"'Street Report'!C12","v":0},{"$f":"'Street Report'!E12","v":0},{"$f":"'Street Report'!F12","v":0},{"$f":"'Street Report'!H12","v":0},{"$f":"'Street Report'!I12","v":0},{"$f":"'Street Report'!J12","v":0},{"$f":"'Street Report'!K12","v":0},{"$f":"'Street Report'!L12","v":0},{"$f":"'Street Report'!M12","v":{"v":0,"d":"0+00"}},{"$f":"'Street Report'!N12","v":{"v":0,"d":"0+00"}},{"$f":"'Street Report'!O12","v":" "},{"$f":"'Street Report'!P12","v":{"v":0,"d":"0.00"}},null,"Lots Used for Calcuations",null,{"$f":"IFERROR(IF(ISNUMBER(Q15)=TRUE,Q15,IF(ISNUMBER(Q11)=TRUE,IF($Q$11>0,VLOOKUP(Q11,AD5:AE14,2),0),0)),\"\")","v":0},null,"Bid Price/Ton",{"$f":"'Street Report'!O5","v":" "},{"$nulls":7},9,"Carlton",7301,9,0,null,null,"SPWEB230","C= PG 58-34 (PMB)",null,null,"RT Lane"]
[null,{"$f":"'Street Report'!C13","v":0},{"$f":"'Street Report'!E13","v":0},{"$f":"'Street Report'!F13","v":0},{"$f":"'Street Report'!H13","v":0},{"$f":"'Street Report'!I13","v":0},{"$f":"'Street Report'!J13","v":0},{"$f":"'Street Report'!K13","v":0},{"$f":"'Street Report'!L13","v":0},{"$f":"'Street Report'!M13","v":{"v":0,"d":"0+00"}},{"$f":"'Street Report'!N13","v":{"v":0,"d":"0+00"}},{"$f":"'Street Report'!O13","v":" "},{"$f":"'Street Report'!P13","v":{"v":0,"d":"0.00"}},null,"Lots Required",null,{"$f":"IFERROR(VLOOKUP(Q11,AD4:AE14,2),\"\")","v":""},{"$nulls":10},10,"Carver",8201,10,{"$nulls":3},"SPWEB240","E= PG 64-28 (PMB)",null,null,"Rt Turn Lane"]
[null,{"$f":"'Street Report'!C14","v":0},{"$f":"'Street Report'!E14","v":0},{"$f":"'Street Report'!F14","v":0},{"$f":"'Street Report'!H14","v":0},{"$f":"'Street Report'!I14","v":0},{"$f":"'Street Report'!J14","v":0},{"$f":"'Street Report'!K14","v":0},{"$f":"'Street Report'!L14","v":0},{"$f":"'Street Report'!M14","v":{"v":0,"d":"0+00"}},{"$f":"'Street Report'!N14","v":{"v":0,"d":"0+00"}},{"$f":"'Street Report'!O14","v":" "},{"$f":"'Street Report'!P14","v":{"v":0,"d":"0.00"}},null,"Over-ride # Lots",{"$nulls":12},11,"Cass",{"$nulls":5},"SPWEB330","F= PG 64-34 (PMB)",null,null,"Rt Turn Lane 2"]
[null,{"$f":"'Street Report'!C15","v":0},{"$f":"'Street Report'!E15","v":0},{"$f":"'Street Report'!F15","v":0},{"$f":"'Street Report'!H15","v":0},{"$f":"'Street Report'!I15","v":0},{"$f":"'Street Report'!J15","v":0},{"$f":"'Street Report'!K15","v":0},{"$f":"'Street Report'!L15","v":0},{"$f":"'Street Report'!M15","v":{"v":0,"d":"0+00"}},{"$f":"'Street Report'!N15","v":{"v":0,"d":"0+00"}},{"$f":"'Street Report'!O15","v":" "},{"$f":"'Street Report'!P15","v":{"v":0,"d":"0.00"}},{"$nulls":14},12,"Chippewa",{"$nulls":5},"SPWEB340","H= PG 70-28 (PMB)",null,null,"Rt Shoulder"]
[null,{"$f":"'Street Report'!C16","v":0},{"$f":"'Street Report'!E16","v":0},{"$f":"'Street Report'!F16","v":0},{"$f":"'Street Report'!H16","v":0},{"$f":"'Street Report'!I16","v":0},{"$f":"'Street Report'!J16","v":0},{"$f":"'Street Report'!K16","v":0},{"$f":"'Street Report'!L16","v":0},{"$f":"'Street Report'!M16","v":{"v":0,"d":"0+00"}},{"$f":"'Street Report'!N16","v":{"v":0,"d":"0+00"}},{"$f":"'Street Report'!O16","v":" "},{"$f":"'Street Report'!P16","v":{"v":0,"d":"0.00"}},{"$nulls":4},"Mix Spec",null,2360,{"$nulls":7},13,"Chisago",{"$nulls":5},"SPWEB430","A= PG 52S-34 (MSCR)",null,null,"Ramp"]
[null,{"$f":"'Street Report'!C17","v":0},{"$f":"'Street Report'!E17","v":0},{"$f":"'Street Report'!F17","v":0},{"$f":"'Street Report'!H17","v":0},{"$f":"'Street Report'!I17","v":0},{"$f":"'Street Report'!J17","v":0},{"$f":"'Street Report'!K17","v":0},{"$f":"'Street Report'!L17","v":0},{"$f":"'Street Report'!M17","v":{"v":0,"d":"0+00"}},{"$f":"'Street Report'!N17","v":{"v":0,"d":"0+00"}},{"$f":"'Street Report'!O17","v":" "},{"$f":"'Street Report'!P17","v":{"v":0,"d":"0.00"}},null,"Test Companion",null,null,"Mix Type",null,{"$f":"VLOOKUP('Street Report'!L5,'Data sheet'!D8:L19,3,FALSE)","v":{"$error":"#N/A"}},{"$nulls":7},14,"Clay",{"$nulls":5},"SPWEB440","B= PG 58S-28 (MSCR)",null,null,"Loop"]
[null,{"$f":"'Street Report'!C18","v":0},{"$f":"'Street Report'!E18","v":0},{"$f":"'Street Report'!F18","v":0},{"$f":"'Street Report'!H18","v":0},{"$f":"'Street Report'!I18","v":0},{"$f":"'Street Report'!J18","v":0},{"$f":"'Street Report'!K18","v":0},{"$f":"'Street Report'!L18","v":0},{"$f":"'Street Report'!M18","v":{"v":0,"d":"0+00"}},{"$f":"'Street Report'!N18","v":{"v":0,"d":"0+00"}},{"$f":"'Street Report'!O18","v":" "},{"$f":"'Street Report'!P18","v":{"v":0,"d":"0.00"}},null,"Cores Shown?","1 per Lot",null,"Asphalt Binder Grade",null,"C= PG 58H-34 (MSCR)",{"$nulls":7},15,"Clearwater",{"$nulls":5},"SPWEB530","C= PG 58H-34 (MSCR)",null,null,"Shoulder Bypass"]
[null,{"$f":"'Street Report'!C19","v":0},{"$f":"'Street Report'!E19","v":0},{"$f":"'Street Report'!F19","v":0},{"$f":"'Street Report'!H19","v":0},{"$f":"'Street Report'!I19","v":0},{"$f":"'Street Report'!J19","v":0},{"$f":"'Street Report'!K19","v":0},{"$f":"'Street Report'!L19","v":0},{"$f":"'Street Report'!M19","v":{"v":0,"d":"0+00"}},{"$f":"'Street Report'!N19","v":{"v":0,"d":"0+00"}},{"$f":"'Street Report'!O19","v":" "},{"$f":"'Street Report'!P19","v":{"v":0,"d":"0.00"}},{"$nulls":4},"Total Area Paved (yd2)",null,{"$f":"IFERROR($L$129/9,\"\")","v":0},{"$nulls":7},16,"Cook",{"$nulls":5},"SPWEB540","E= PG 58H-28 (MSCR)",null,null,"HOV Lane"]
[null,{"$f":"'Street Report'!C20","v":0},{"$f":"'Street Report'!E20","v":0},{"$f":"'Street Report'!F20","v":0},{"$f":"'Street Report'!H20","v":0},{"$f":"'Street Report'!I20","v":0},{"$f":"'Street Report'!J20","v":0},{"$f":"'Street Report'!K20","v":0},{"$f":"'Street Report'!L20","v":0},{"$f":"'Street Report'!M20","v":{"v":0,"d":"0+00"}},{"$f":"'Street Report'!N20","v":{"v":0,"d":"0+00"}},{"$f":"'Street Report'!O20","v":" "},{"$f":"'Street Report'!P20","v":{"v":0,"d":"0.00"}},{"$nulls":14},17,"Cottonwood",{"$nulls":5},"SPWEC230","F= PG 58V-34 (MSCR)",null,null,"Crossover"]
[null,{"$f":"'Street Report'!C21","v":0},{"$f":"'Street Report'!E21","v":0},{"$f":"'Street Report'!F21","v":0},{"$f":"'Street Report'!H21","v":0},{"$f":"'Street Report'!I21","v":0},{"$f":"'Street Report'!J21","v":0},{"$f":"'Street Report'!K21","v":0},{"$f":"'Street Report'!L21","v":0},{"$f":"'Street Report'!M21","v":{"v":0,"d":"0+00"}},{"$f":"'Street Report'!N21","v":{"v":0,"d":"0+00"}},{"$f":"'Street Report'!O21","v":" "},{"$f":"'Street Report'!P21","v":{"v":0,"d":"0.00"}},{"$nulls":14},18,"Crow Wing",{"$nulls":5},"SPWEC240","H= PG 58V-28 (MSCR)"]
[null,{"$f":"'Street Report'!C22","v":0},{"$f":"'Street Report'!E22","v":0},{"$f":"'Street Report'!F22","v":0},{"$f":"'Street Report'!H22","v":0},{"$f":"'Street Report'!I22","v":0},{"$f":"'Street Report'!J22","v":0},{"$f":"'Street Report'!K22","v":0},{"$f":"'Street Report'!L22","v":0},{"$f":"'Street Report'!M22","v":{"v":0,"d":"0+00"}},{"$f":"'Street Report'!N22","v":{"v":0,"d":"0+00"}},{"$f":"'Street Report'!O22","v":" "},{"$f":"'Street Report'!P22","v":{"v":0,"d":"0.00"}},{"$nulls":14},19,"Dakota",{"$nulls":5},"SPWEC330","I= PG 58E-34 (MSCR)"]
[null,{"$f":"'Street Report'!C23","v":0},{"$f":"'Street Report'!E23","v":0},{"$f":"'Street Report'!F23","v":0},{"$f":"'Street Report'!H23","v":0},{"$f":"'Street Report'!I23","v":0},{"$f":"'Street Report'!J23","v":0},{"$f":"'Street Report'!K23","v":0},{"$f":"'Street Report'!L23","v":0},{"$f":"'Street Report'!M23","v":{"v":0,"d":"0+00"}},{"$f":"'Street Report'!N23","v":{"v":0,"d":"0+00"}},{"$f":"'Street Report'!O23","v":" "},{"$f":"'Street Report'!P23","v":{"v":0,"d":"0.00"}},null,{"$f":"'Street Report'!J60","v":"S.P. "},{"$f":"'Street Report'!K60","v":"DENSITY TONS"},{"$f":"'Street Report'!L60","v":"NON-DENSITY TONS"},{"$f":"'Street Report'!M60","v":"TOTAL TONS"},{"$nulls":9},20,"Dodge",{"$nulls":5},"SPWEC340","L= PG 64S-22 (MSCR)"]
[null,{"$f":"'Street Report'!C24","v":0},{"$f":"'Street Report'!E24","v":0},{"$f":"'Street Report'!F24","v":0},{"$f":"'Street Report'!H24","v":0},{"$f":"'Street Report'!I24","v":0},{"$f":"'Street Report'!J24","v":0},{"$f":"'Street Report'!K24","v":0},{"$f":"'Street Report'!L24","v":0},{"$f":"'Street Report'!M24","v":{"v":0,"d":"0+00"}},{"$f":"'Street Report'!N24","v":{"v":0,"d":"0+00"}},{"$f":"'Street Report'!O24","v":" "},{"$f":"'Street Report'!P24","v":{"v":0,"d":"0.00"}},{"$nulls":14},21,"Douglas",{"$nulls":5},"SPWEC430","M= PG 49S-34 (MSCR)"]
[null,{"$f":"'Street Report'!C25","v":0},{"$f":"'Street Report'!E25","v":0},{"$f":"'Street Report'!F25","v":0},{"$f":"'Street Report'!H25","v":0},{"$f":"'Street Report'!I25","v":0},{"$f":"'Street Report'!J25","v":0},{"$f":"'Street Report'!K25","v":0},{"$f":"'Street Report'!L25","v":0},{"$f":"'Street Report'!M25","v":{"v":0,"d":"0+00"}},{"$f":"'Street Report'!N25","v":{"v":0,"d":"0+00"}},{"$f":"'Street Report'!O25","v":" "},{"$f":"'Street Report'!P25","v":{"v":0,"d":"0.00"}},null,{"$f":"'Data sheet'!C7","v":0},{"$f":"'Street Report'!K62","v":{"v":0,"d":"0.00"}},{"$f":"'Street Report'!L62","v":{"v":0,"d":"0.00"}},{"$f":"'Street Report'!M62","v":{"v":0,"d":"0.00"}},{"$nulls":9},22,"Faribault",{"$nulls":5},"SPWEC440","I= PG 64E-34 (MSCR)"]
[null,{"$f":"'Street Report'!C26","v":0},{"$f":"'Street Report'!E26","v":0},{"$f":"'Street Report'!F26","v":0},{"$f":"'Street Report'!H26","v":0},{"$f":"'Street Report'!I26","v":0},{"$f":"'Street Report'!J26","v":0},{"$f":"'Street Report'!K26","v":0},{"$f":"'Street Report'!L26","v":0},{"$f":"'Street Report'!M26","v":{"v":0,"d":"0+00"}},{"$f":"'Street Report'!N26","v":{"v":0,"d":"0+00"}},{"$f":"'Street Report'!O26","v":" "},{"$f":"'Street Report'!P26","v":{"v":0,"d":"0.00"}},null,{"$f":"'Data sheet'!C8","v":0},{"$f":"'Street Report'!K63","v":{"v":0,"d":"0.00"}},{"$f":"'Street Report'!L63","v":{"v":0,"d":"0.00"}},{"$f":"'Street Report'!M63","v":{"v":0,"d":"0.00"}},{"$nulls":9},23,"Fillmore",{"$nulls":5},"SPWEC530"]
[null,{"$f":"'Street Report'!C27","v":0},{"$f":"'Street Report'!E27","v":0},{"$f":"'Street Report'!F27","v":0},{"$f":"'Street Report'!H27","v":0},{"$f":"'Street Report'!I27","v":0},{"$f":"'Street Report'!J27","v":0},{"$f":"'Street Report'!K27","v":0},{"$f":"'Street Report'!L27","v":0},{"$f":"'Street Report'!M27","v":{"v":0,"d":"0+00"}},{"$f":"'Street Report'!N27","v":{"v":0,"d":"0+00"}},{"$f":"'Street Report'!O27","v":" "},{"$f":"'Street Report'!P27","v":{"v":0,"d":"0.00"}},null,{"$f":"'Data sheet'!C9","v":0},{"$f":"'Street Report'!K64","v":{"v":0,"d":"0.00"}},{"$f":"'Street Report'!L64","v":{"v":0,"d":"0.00"}},{"$f":"'Street Report'!M64","v":{"v":0,"d":"0.00"}},{"$nulls":9},24,"Freeborn",{"$nulls":5},"SPWEC540"]
[null,{"$f":"'Street Report'!C28","v":0},{"$f":"'Street Report'!E28","v":0},{"$f":"'Street Report'!F28","v":0},{"$f":"'Street Report'!H28","v":0},{"$f":"'Street Report'!I28","v":0},{"$f":"'Street Report'!J28","v":0},{"$f":"'Street Report'!K28","v":0},{"$f":"'Street Report'!L28","v":0},{"$f":"'Street Report'!M28","v":{"v":0,"d":"0+00"}},{"$f":"'Street Report'!N28","v":{"v":0,"d":"0+00"}},{"$f":"'Street Report'!O28","v":" "},{"$f":"'Street Report'!P28","v":{"v":0,"d":"0.00"}},null,{"$f":"'Data sheet'!C10","v":0},{"$f":"'Street Report'!K65","v":{"v":0,"d":"0.00"}},{"$f":"'Street Report'!L65","v":{"v":0,"d":"0.00"}},{"$f":"'Street Report'!M65","v":{"v":0,"d":"0.00"}},{"$nulls":9},25,"Goodhue",{"$nulls":5},"SPWED230"]
[null,{"$f":"'Street Report'!C29","v":0},{"$f":"'Street Report'!E29","v":0},{"$f":"'Street Report'!F29","v":0},{"$f":"'Street Report'!H29","v":0},{"$f":"'Street Report'!I29","v":0},{"$f":"'Street Report'!J29","v":0},{"$f":"'Street Report'!K29","v":0},{"$f":"'Street Report'!L29","v":0},{"$f":"'Street Report'!M29","v":{"v":0,"d":"0+00"}},{"$f":"'Street Report'!N29","v":{"v":0,"d":"0+00"}},{"$f":"'Street Report'!O29","v":" "},{"$f":"'Street Report'!P29","v":{"v":0,"d":"0.00"}},null,{"$f":"'Data sheet'!C11","v":0},{"$f":"'Street Report'!K66","v":{"v":0,"d":"0.00"}},{"$f":"'Street Report'!L66","v":{"v":0,"d":"0.00"}},{"$f":"'Street Report'!M66","v":{"v":0,"d":"0.00"}},{"$nulls":9},26,"Grant",{"$nulls":5},"SPWED240"]
[null,{"$f":"'Street Report'!C30","v":0},{"$f":"'Street Report'!E30","v":0},{"$f":"'Street Report'!F30","v":0},{"$f":"'Street Report'!H30","v":0},{"$f":"'Street Report'!I30","v":0},{"$f":"'Street Report'!J30","v":0},{"$f":"'Street Report'!K30","v":0},{"$f":"'Street Report'!L30","v":0},{"$f":"'Street Report'!M30","v":{"v":0,"d":"0+00"}},{"$f":"'Street Report'!N30","v":{"v":0,"d":"0+00"}},{"$f":"'Street Report'!O30","v":" "},{"$f":"'Street Report'!P30","v":{"v":0,"d":"0.00"}},null,{"$f":"'Data sheet'!C12","v":0},{"$f":"'Street Report'!K67","v":{"v":0,"d":"0.00"}},{"$f":"'Street Report'!L67","v":{"v":0,"d":"0.00"}},{"$f":"'Street Report'!M67","v":{"v":0,"d":"0.00"}},{"$nulls":9},27,"Hennepin",{"$nulls":5},"SPWED330"]
[null,{"$f":"'Street Report'!C31","v":0},{"$f":"'Street Report'!E31","v":0},{"$f":"'Street Report'!F31","v":0},{"$f":"'Street Report'!H31","v":0},{"$f":"'Street Report'!I31","v":0},{"$f":"'Street Report'!J31","v":0},{"$f":"'Street Report'!K31","v":0},{"$f":"'Street Report'!L31","v":0},{"$f":"'Street Report'!M31","v":{"v":0,"d":"0+00"}},{"$f":"'Street Report'!N31","v":{"v":0,"d":"0+00"}},{"$f":"'Street Report'!O31","v":" "},{"$f":"'Street Report'!P31","v":{"v":0,"d":"0.00"}},null,{"$f":"'Data sheet'!C13","v":0},{"$f":"'Street Report'!K68","v":{"v":0,"d":"0.00"}},{"$f":"'Street Report'!L68","v":{"v":0,"d":"0.00"}},{"$f":"'Street Report'!M68","v":{"v":0,"d":"0.00"}},{"$nulls":9},28,"Houston",{"$nulls":5},"SPWED340"]
[null,{"$f":"'Street Report'!C32","v":0},{"$f":"'Street Report'!E32","v":0},{"$f":"'Street Report'!F32","v":0},{"$f":"'Street Report'!H32","v":0},{"$f":"'Street Report'!I32","v":0},{"$f":"'Street Report'!J32","v":0},{"$f":"'Street Report'!K32","v":0},{"$f":"'Street Report'!L32","v":0},{"$f":"'Street Report'!M32","v":{"v":0,"d":"0+00"}},{"$f":"'Street Report'!N32","v":{"v":0,"d":"0+00"}},{"$f":"'Street Report'!O32","v":" "},{"$f":"'Street Report'!P32","v":{"v":0,"d":"0.00"}},null,{"$f":"'Data sheet'!C14","v":0},{"$f":"'Street Report'!K69","v":{"v":0,"d":"0.00"}},{"$f":"'Street Report'!L69","v":{"v":0,"d":"0.00"}},{"$f":"'Street Report'!M69","v":{"v":0,"d":"0.00"}},{"$nulls":9},29,"Hubbard",{"$nulls":5},"SPWED430"]
[null,{"$f":"'Street Report'!C33","v":0},{"$f":"'Street Report'!E33","v":0},{"$f":"'Street Report'!F33","v":0},{"$f":"'Street Report'!H33","v":0},{"$f":"'Street Report'!I33","v":0},{"$f":"'Street Report'!J33","v":0},{"$f":"'Street Report'!K33","v":0},{"$f":"'Street Report'!L33","v":0},{"$f":"'Street Report'!M33","v":{"v":0,"d":"0+00"}},{"$f":"'Street Report'!N33","v":{"v":0,"d":"0+00"}},{"$f":"'Street Report'!O33","v":" "},{"$f":"'Street Report'!P33","v":{"v":0,"d":"0.00"}},null,null,"TOTAL TONS PRODUCED",null,{"$f":"'Tape '!L4","v":{"v":1910,"d":"1910.00"}},{"$nulls":9},30,"Isanti",{"$nulls":5},"SPWED440"]
[null,{"$f":"'Street Report'!C34","v":0},{"$f":"'Street Report'!E34","v":0},{"$f":"'Street Report'!F34","v":0},{"$f":"'Street Report'!H34","v":0},{"$f":"'Street Report'!I34","v":0},{"$f":"'Street Report'!J34","v":0},{"$f":"'Street Report'!K34","v":0},{"$f":"'Street Report'!L34","v":0},{"$f":"'Street Report'!M34","v":{"v":0,"d":"0+00"}},{"$f":"'Street Report'!N34","v":{"v":0,"d":"0+00"}},{"$f":"'Street Report'!O34","v":" "},{"$f":"'Street Report'!P34","v":{"v":0,"d":"0.00"}},null,null,"WASTE/OVERLOAD",null,{"$f":"'Tape '!P5","v":{"v":0,"d":"0.00"}},{"$nulls":9},31,"Itasca",{"$nulls":5},"SPWED530"]
[null,{"$f":"'Street Report'!C35","v":0},{"$f":"'Street Report'!E35","v":0},{"$f":"'Street Report'!F35","v":0},{"$f":"'Street Report'!H35","v":0},{"$f":"'Street Report'!I35","v":0},{"$f":"'Street Report'!J35","v":0},{"$f":"'Street Report'!K35","v":0},{"$f":"'Street Report'!L35","v":0},{"$f":"'Street Report'!M35","v":{"v":0,"d":"0+00"}},{"$f":"'Street Report'!N35","v":{"v":0,"d":"0+00"}},{"$f":"'Street Report'!O35","v":" "},{"$f":"'Street Report'!P35","v":{"v":0,"d":"0.00"}},null,null,"PATCHING",null,{"$f":"'Street Report'!T65","v":{"v":0,"d":"0.00"}},{"$nulls":9},32,"Jackson",{"$nulls":5},"SPWED540"]
[null,{"$f":"'Street Report'!C36","v":0},{"$f":"'Street Report'!E36","v":0},{"$f":"'Street Report'!F36","v":0},{"$f":"'Street Report'!H36","v":0},{"$f":"'Street Report'!I36","v":0},{"$f":"'Street Report'!J36","v":0},{"$f":"'Street Report'!K36","v":0},{"$f":"'Street Report'!L36","v":0},{"$f":"'Street Report'!M36","v":{"v":0,"d":"0+00"}},{"$f":"'Street Report'!N36","v":{"v":0,"d":"0+00"}},{"$f":"'Street Report'!O36","v":" "},{"$f":"'Street Report'!P36","v":{"v":0,"d":"0.00"}},null,null,"TOTAL TONS PAID FOR",null,{"$f":"R34-R35-R36","v":{"v":1910,"d":"1910.00"}},{"$nulls":9},33,"Kanabec",{"$nulls":5},"SPNWA230"]
[{"$nulls":7},"Calculated","Actual Mat",{"$nulls":18},34,"Kanndiyohi",{"$nulls":5},"SPNWA240"]
[null,null,"Mat",{"$nulls":3},"Alignment","Mat","Core Station (If","Mat ","Mat","Mat","Test","LJD",{"$f":"IF($R$8=\"Yes\",\"LJD\",\"\")","v":"LJD"},{"$f":"IF($R$8=\"Yes\",\"LJD\",\"\")","v":"LJD"},"LJD",{"$f":"IF($R$8=\"Yes\",\"LJD\",\"\")","v":"LJD"},{"$f":"IF($R$8=\"Yes\",\"LJD\",\"\")","v":"LJD"},{"$nulls":8},35,"Kittson",{"$nulls":5},"SPNWA330"]
[null,null,"Core",null,null,"Name","Name","Core","different from","Station","Offset","Offset","Companion","Joint",{"$f":"IF($R$8=\"Yes\",\"Core\",\"\")","v":"Core"},{"$f":"IF($R$8=\"Yes\",\"Offset\",\"\")","v":"Offset"},"Joint",{"$f":"IF($R$8=\"Yes\",\"Core\",\"\")","v":"Core"},{"$f":"IF($R$8=\"Yes\",\"Offset\",\"\")","v":"Offset"},{"$nulls":8},36,"Koochiching",{"$nulls":5},"SPNWA340"]
[null,"Lot","ID",{"$nulls":4},"Station","Calculated Sta.)","Random #","(ft.)","Random #","Core","Type",{"$f":"IF($R$8=\"Yes\",\"ID\",\"\")","v":"ID"},{"$f":"IF($R$8=\"Yes\",\"(ft.)\",\"\")","v":"(ft.)"},"Type",{"$f":"IF($R$8=\"Yes\",\"ID\",\"\")","v":"ID"},{"$f":"IF($R$8=\"Yes\",\"(ft.)\",\"\")","v":"(ft.)"},{"$nulls":8},37,"Lac qui Parle",{"$nulls":5},"SPNWA430"]
[null,1,{"$f":"IF(B42=\"\",\"\",B42+0.1)","v":1.1},{"$f":"IF($Q$13>=1,$G$144,\"\")","v":""},null,null,{"$f":"IF($Q$13>=1,$G$145,\"\")","v":""},{"$f":"IF($Q$13>=1, $G$143,\"\")","v":""},null,{"$f":"IF(C42=\"\",\"\",$G$134)","v":{"v":0.41030627489089966,"d":"0.41"}},{"$f":"$R242","v":""},{"$f":"IF(C42=\"\",\"\",I220)","v":{"v":0.4094862937927246,"d":"0.41"}},{"$f":"IF(ISNUMBER($B42),(IF($P$19=\"All\",\"Y\",IF(AND($P$19=\"1 per Lot\",$H157=\"Y\"),$H157,\"\"))),\"\")","v":""},null,{"$f":"U220","v":1.3},{"$error":"#VALUE!"},null,{"$f":"W220","v":1.4000000000000001},{"$error":"#VALUE!"},{"$nulls":8},38,"Lake",{"$nulls":5},"SPNWA440"]
[null,null,{"$f":"IF(B42=\"\",\"\",B42+0.2)","v":1.2},{"$f":"IF($Q$13>=1,$H$144,\"\")","v":""},null,null,{"$f":"IF($Q$13>=1,$H$145,\"\")","v":""},{"$f":"IF($Q$13>=1, $H$143,\"\")","v":""},null,{"$f":"IF(C43=\"\",\"\",$H$134)","v":{"v":0.8055155277252197,"d":"0.81"}},{"$f":"$R243","v":""},{"v":0.7619702219963074,"d":"0.76"},{"$f":"IF(ISNUMBER($B42),(IF($P$19=\"All\",\"Y\",IF(AND($P$19=\"1 per Lot\",$H158=\"Y\"),$H158,\"\"))),\"\")","v":"Y"},null,"",{"$f":"V221","v":""},null,"","",{"$nulls":8},39,"Lake of the Woods",{"$nulls":5},"SPNWA530"]
[null,{"$f":"IF($Q$13>=2,B42+1,\"\")","v":""},{"$f":"IF(B44=\"\",\"\",B44+0.1)","v":""},{"$f":"IF($Q$13>=2,$I$144,\"\")","v":""},null,null,{"$f":"IF($Q$13>=2,$I$145,\"\")","v":""},{"$f":"IF($Q$13>=2, $I$143,\"\")","v":""},null,{"$f":"IF(C44=\"\",\"\",$I$134)","v":""},"","",{"$f":"IF(ISNUMBER($B44),(IF($P$19=\"All\",\"Y\",IF(AND($P$19=\"1 per Lot\",$H159=\"Y\"),$H159,\"\"))),\"\")","v":""},null,"","",null,"","",{"$nulls":8},40,"Le Sueur",{"$nulls":5},"SPNWA540"]
[null,null,{"$f":"IF(B44=\"\",\"\",B44+0.2)","v":""},{"$f":"IF($Q$13>=2,$J$144,\"\")","v":""},null,null,{"$f":"IF($Q$13>=2,$J$145,\"\")","v":""},{"$f":"IF($Q$13>=2, $J$143,\"\")","v":""},null,{"$f":"IF(C45=\"\",\"\",$J$134)","v":""},"","",{"$f":"IF(ISNUMBER($B44),(IF($P$19=\"All\",\"Y\",IF(AND($P$19=\"1 per Lot\",$H160=\"Y\"),$H160,\"\"))),\"\")","v":""},null,"","",null,"","",{"$nulls":8},41,"Lincoln",{"$nulls":5},"SPNWB230"]
[null,{"$f":"IF($Q$13>=3,B44+1,\"\")","v":""},{"$f":"IF(B46=\"\",\"\",B46+0.1)","v":""},{"$f":"IF($Q$13>=3,$K$144,\"\")","v":""},null,null,{"$f":"IF($Q$13>=3,$K$145,\"\")","v":""},{"$f":"IF($Q$13>=3, $K$143,\"\")","v":""},null,{"$f":"IF(C46=\"\",\"\",$K$134)","v":""},"","",{"$f":"IF(ISNUMBER($B46),(IF($P$19=\"All\",\"Y\",IF(AND($P$19=\"1 per Lot\",$H161=\"Y\"),$H161,\"\"))),\"\")","v":""},null,"","",null,"","",{"$nulls":8},42,"Lyon",{"$nulls":5},"SPNWB240"]
[null,null,{"$f":"IF(B46=\"\",\"\",B46+0.2)","v":""},{"$f":"IF($Q$13>=3,$L$144,\"\")","v":""},null,null,{"$f":"IF($Q$13>=3,$L$145,\"\")","v":""},{"$f":"IF($Q$13>=3, $L$143,\"\")","v":""},null,{"$f":"IF(C47=\"\",\"\",$L$134)","v":""},"","",{"$f":"IF(ISNUMBER($B46),(IF($P$19=\"All\",\"Y\",IF(AND($P$19=\"1 per Lot\",$H162=\"Y\"),$H162,\"\"))),\"\")","v":""},null,"",{"$f":"V225","v":""},null,"","",{"$nulls":8},43,"Mahnomen",{"$nulls":5},"SPNWB330"]
[null,{"$f":"IF($Q$13>=4,B46+1,\"\")","v":""},{"$f":"IF(B48=\"\",\"\",B48+0.1)","v":""},{"$f":"IF($Q$13>=4,$M$144,\"\")","v":""},null,null,{"$f":"IF($Q$13>=4,$M$145,\"\")","v":""},{"$f":"IF($Q$13>=4, $M$143,\"\")","v":""},null,{"$f":"IF(C48=\"\",\"\",$M$134)","v":""},"","",{"$f":"IF(ISNUMBER($B48),(IF($P$19=\"All\",\"Y\",IF(AND($P$19=\"1 per Lot\",$H163=\"Y\"),$H163,\"\"))),\"\")","v":""},null,"","",null,"","",{"$nulls":8},44,"Marshall",{"$nulls":5},"SPNWB340"]
[null,null,{"$f":"IF(B48=\"\",\"\",B48+0.2)","v":""},{"$f":"IF($Q$13>=4,$N$144,\"\")","v":""},null,null,{"$f":"IF($Q$13>=4,$N$145,\"\")","v":""},{"$f":"IF($Q$13>=4, $N$143,\"\")","v":""},null,{"$f":"IF(C49=\"\",\"\",$N$134)","v":""},"","",{"$f":"IF(ISNUMBER($B48),(IF($P$19=\"All\",\"Y\",IF(AND($P$19=\"1 per Lot\",$H164=\"Y\"),$H164,\"\"))),\"\")","v":""},null,"","",null,"","",{"$nulls":8},45,"Martin",{"$nulls":5},"SPNWB430"]
[null,{"$f":"IF($Q$13>=5,B48+1,\"\")","v":""},{"$f":"IF(B50=\"\",\"\",B50+0.1)","v":""},{"$f":"IF($Q$13>=5,$O$144,\"\")","v":""},null,null,{"$f":"IF($Q$13>=5,$O$145,\"\")","v":""},{"$f":"IF($Q$13>=5, $O$143,\"\")","v":""},null,{"$f":"IF(C50=\"\",\"\",$O$134)","v":""},"","",{"$f":"IF(ISNUMBER($B50),(IF($P$19=\"All\",\"Y\",IF(AND($P$19=\"1 per Lot\",$H165=\"Y\"),$H165,\"\"))),\"\")","v":""},null,"","",null,"","",{"$nulls":8},46,"McLeod",{"$nulls":5},"SPNWB440"]
[null,null,{"$f":"IF(B50=\"\",\"\",B50+0.2)","v":""},{"$f":"IF($Q$13>=5,$P$144,\"\")","v":""},null,null,{"$f":"IF($Q$13>=5,$P$145,\"\")","v":""},{"$f":"IF($Q$13>=5, $P$143,\"\")","v":""},null,{"$f":"IF(C51=\"\",\"\",$P$134)","v":""},"","",{"$f":"IF(ISNUMBER($B50),(IF($P$19=\"All\",\"Y\",IF(AND($P$19=\"1 per Lot\",$H166=\"Y\"),$H166,\"\"))),\"\")","v":""},null,"","",null,"","",{"$nulls":8},47,"Meeker",{"$nulls":5},"SPNWB530"]
[null,{"$f":"IF($Q$13>=6,B50+1,\"\")","v":""},{"$f":"IF(B52=\"\",\"\",B52+0.1)","v":""},{"$f":"IF($Q$13>=6,$Q$144,\"\")","v":""},null,null,{"$f":"IF($Q$13>=6,$Q$145,\"\")","v":""},{"$f":"IF($Q$13>=6, $Q$143,\"\")","v":""},null,{"$f":"IF(C52=\"\",\"\",$Q$134)","v":""},"","",{"$f":"IF(ISNUMBER($B52),(IF($P$19=\"All\",\"Y\",IF(AND($P$19=\"1 per Lot\",$H167=\"Y\"),$H167,\"\"))),\"\")","v":""},null,"","",null,"","",{"$nulls":8},48,"Mille Lacs",{"$nulls":5},"SPNWB540"]
[null,null,{"$f":"IF(B52=\"\",\"\",B52+0.2)","v":""},{"$f":"IF($Q$13>=6,$R$144,\"\")","v":""},null,null,{"$f":"IF($Q$13>=6,$R$145,\"\")","v":""},{"$f":"IF($Q$13>=6, $R$143,\"\")","v":""},null,{"$f":"IF(C53=\"\",\"\",$R$134)","v":""},"","",{"$f":"IF(ISNUMBER($B52),(IF($P$19=\"All\",\"Y\",IF(AND($P$19=\"1 per Lot\",$H168=\"Y\"),$H168,\"\"))),\"\")","v":""},null,"","",null,"","",{"$nulls":8},49,"Morrison",{"$nulls":5},"SPNWC230"]
[null,{"$f":"IF($Q$13>=7,B52+1,\"\")","v":""},{"$f":"IF(B54=\"\",\"\",B54+0.1)","v":""},{"$f":"IF($Q$13>=7,$S$144,\"\")","v":""},null,null,{"$f":"IF($Q$13>=7,$S$145,\"\")","v":""},{"$f":"IF($Q$13>=7, $S$143,\"\")","v":""},null,{"$f":"IF(C54=\"\",\"\",$S$134)","v":""},"","",{"$f":"IF(ISNUMBER($B54),(IF($P$19=\"All\",\"Y\",IF(AND($P$19=\"1 per Lot\",$H169=\"Y\"),$H169,\"\"))),\"\")","v":""},null,"","",null,"","",{"$nulls":8},50,"Mower",{"$nulls":5},"SPNWC240"]
[null,null,{"$f":"IF(B54=\"\",\"\",B54+0.2)","v":""},{"$f":"IF($Q$13>=7,$T$144,\"\")","v":""},null,null,{"$f":"IF($Q$13>=7,$T$145,\"\")","v":""},{"$f":"IF($Q$13>=7, $T$143,\"\")","v":""},null,{"$f":"IF(C55=\"\",\"\",$T$134)","v":""},"","",{"$f":"IF(ISNUMBER($B54),(IF($P$19=\"All\",\"Y\",IF(AND($P$19=\"1 per Lot\",$H170=\"Y\"),$H170,\"\"))),\"\")","v":""},null,"","",null,"","",{"$nulls":8},51,"Murray",{"$nulls":5},"SPNWC330"]
[null,{"$f":"IF($Q$13>=8,B54+1,\"\")","v":""},{"$f":"IF(B56=\"\",\"\",B56+0.1)","v":""},{"$f":"IF($Q$13>=8,$U$144,\"\")","v":""},null,null,{"$f":"IF($Q$13>=8,$U$145,\"\")","v":""},{"$f":"IF($Q$13>=8, $U$143,\"\")","v":""},null,{"$f":"IF(C56=\"\",\"\",$U$134)","v":""},"","",{"$f":"IF(ISNUMBER($B56),(IF($P$19=\"All\",\"Y\",IF(AND($P$19=\"1 per Lot\",$H171=\"Y\"),$H171,\"\"))),\"\")","v":""},null,"","",null,"","",{"$nulls":8},52,"Nicollet",{"$nulls":5},"SPNWC340"]
[null,null,{"$f":"IF(B56=\"\",\"\",B56+0.2)","v":""},{"$f":"IF($Q$13>=8,$V$144,\"\")","v":""},null,null,{"$f":"IF($Q$13>=8,$V$145,\"\")","v":""},{"$f":"IF($Q$13>=8, $V$143,\"\")","v":""},null,{"$f":"IF(C57=\"\",\"\",$V$134)","v":""},"","",{"$f":"IF(ISNUMBER($B56),(IF($P$19=\"All\",\"Y\",IF(AND($P$19=\"1 per Lot\",$H172=\"Y\"),$H172,\"\"))),\"\")","v":""},null,"","",null,"","",{"$nulls":8},53,"Nobles",{"$nulls":5},"SPNWC430"]
[null,{"$f":"IF($Q$13>=9,B56+1,\"\")","v":""},null,null,{"$f":"IF(B58=\"\",\"\",B58+0.1)","v":""},{"$f":"IF($Q$13>=9,$Q$144,\"\")","v":""},{"$f":"IF($Q$13>=9,$W$143,\"\")","v":""},{"$f":"IF(E58=\"\",\"\",$W$134)","v":""},{"$f":"$R$236","v":""},{"$f":"IF(E58=\"\",\"\",I236)","v":""},{"$f":"IF(ISNUMBER($B58),(IF($P$19=\"All\",\"Y\",IF(AND($P$19=\"1 per Lot\",$H173=\"Y\"),$H173,\"\"))),\"\")","v":""},null,{"$f":"U236","v":""},"",null,{"$f":"W236","v":""},"",{"$nulls":10},54,"Norman",{"$nulls":5},"SPNWC440"]
[{"$nulls":4},{"$f":"IF(B58=\"\",\"\",B58+0.2)","v":""},{"$f":"IF($Q$13>=9,$R$144,\"\")","v":""},{"$f":"IF($Q$13>=9,$X$143,\"\")","v":""},{"$f":"IF(E59=\"\",\"\",$X$134)","v":""},{"$f":"$R$237","v":""},{"$f":"IF(E59=\"\",\"\",I237)","v":""},{"$f":"IF(ISNUMBER($B58),(IF($P$19=\"All\",\"Y\",IF(AND($P$19=\"1 per Lot\",$H174=\"Y\"),$H174,\"\"))),\"\")","v":""},null,"","",null,"","",{"$nulls":10},55,"Olmsted",{"$nulls":5},"SPNWC530"]
[null,{"$f":"IF($Q$13>=10,B58+1,\"\")","v":""},null,null,{"$f":"IF(B60=\"\",\"\",B60+0.1)","v":""},{"$f":"IF($Q$13>=10,$Q$144,\"\")","v":""},{"$f":"IF($Q$13>=10,$Y$143,\"\")","v":""},{"$f":"IF(E60=\"\",\"\",$Y$134)","v":""},{"$f":"$R$238","v":""},{"$f":"IF(E60=\"\",\"\",I238)","v":""},{"$f":"IF(ISNUMBER($B60),(IF($P$19=\"All\",\"Y\",IF(AND($P$19=\"1 per Lot\",$H175=\"Y\"),$H175,\"\"))),\"\")","v":""},null,"","",null,"","",{"$nulls":10},56,"Otter Tail",{"$nulls":5},"SPNWC540"]
[{"$nulls":4},{"$f":"IF(B60=\"\",\"\",B60+0.2)","v":""},{"$f":"IF($Q$13>=10,$R$144,\"\")","v":""},{"$f":"IF($Q$13>=10,$Z$143,\"\")","v":""},{"$f":"IF(E61=\"\",\"\",$Z$134)","v":""},{"$f":"$R$239","v":""},{"$f":"IF(E61=\"\",\"\",I239)","v":""},{"$f":"IF(ISNUMBER($B60),(IF($P$19=\"All\",\"Y\",IF(AND($P$19=\"1 per Lot\",$H176=\"Y\"),$H176,\"\"))),\"\")","v":""},null,"","",null,"","",{"$nulls":10},57,"Pennington"]
[{"$nulls":27},58,"Pine",{"$nulls":5},"SPNWC440"]
[null,"Daily Production",null,null,"Remarks",{"$nulls":22},59,"Pipestone",{"$nulls":5},"SPNWC530"]
[null,"English Tons",null,"Lot",{"$nulls":23},60,"Polk",{"$nulls":5},"SPNWD230"]
[null,"0-600",null,1,{"$nulls":23},61,"Pope",{"$nulls":5},"SPNWD330"]
[null,"601-1000",null,2,{"$nulls":23},62,"Ramsey",{"$nulls":5},"SPNWD430"]
[null,"1001-1600",null,3,{"$nulls":23},63,"Red Lake",{"$nulls":5},"SPNWD530"]
[null,"1601-2600",null,4,"Street Inspector",null,{"$f":"'Street Report'!Q69","v":0},{"$nulls":20},64,"Redwood"]
[null,"2601-4600",null,5,{"$nulls":23},65,"Renville",{"$nulls":5},"SPWEA250"]
[null,">4601*",null,6,{"$nulls":6},"VERIFY CORRECT STARTING LOT NUMBER",{"$nulls":4},"VERIFY ALL INFORMATION IS CORRECT BEFORE LOCKING CORE LOCATIONS",{"$nulls":11},66,"Rice",{"$nulls":5},"SPWEA350"]
[null,"* Add one additional lot each additional 900 tons",{"$nulls":25},67,"Rock",{"$nulls":5},"SPWEA450"]
[{"$nulls":27},68,"Roseau",{"$nulls":5},"SPWEA550"]
[{"$nulls":9},"*If core locations have been locked, the user can make edits to the Street Report wtihout affecting the core locaitons. \n** Unlock core locations by selecting the \"UNLOCK CORE LOCATIONS button. \n***User must unlock core locations before reseting random core locations if core locations are locked. ",{"$nulls":17},69,"Scott",{"$nulls":5},"SPWEB250"]
[{"$nulls":27},70,"Sherburne",{"$nulls":5},"SPWEB350"]
[{"$nulls":27},71,"Sibley",{"$nulls":5},"SPWEB450"]
[{"$nulls":27},72,"St. Louis",{"$nulls":5},"SPWEB550"]
[{"$nulls":27},73,"Stearns",{"$nulls":5},"SPWEC250"]
[{"$nulls":27},74,"Steele",{"$nulls":5},"SPWEC350"]
[{"$nulls":27},75,"Stevens",{"$nulls":5},"SPWEC450"]
[{"$nulls":27},76,"Swift",{"$nulls":5},"SPWEC550"]
[{"$nulls":27},77,"Todd",{"$nulls":5},"SPWED250"]
[{"$nulls":27},78,"Traverse",{"$nulls":5},"SPWED350"]
[{"$nulls":27},79,"Wabasha",{"$nulls":5},"SPWED450"]
[{"$nulls":27},80,"Wadena",{"$nulls":5},"SPWED550"]
[{"$nulls":27},81,"Waseca",{"$nulls":5},"SPNWA250"]
[{"$nulls":27},82,"Washington",{"$nulls":5},"SPNWA350"]
[{"$nulls":27},83,"Watonwan",{"$nulls":5},"SPNWA450"]
[{"$nulls":27},84,"Wilkin",{"$nulls":5},"SPNWA550"]
[{"$nulls":27},85,"Winona",{"$nulls":5},"SPNWB250"]
[{"$nulls":27},86,"Wright",{"$nulls":5},"SPNWB350"]
[{"$nulls":27},87,"Yellow Medicine",{"$nulls":5},"SPNWB450"]
[{"$nulls":34},"SPNWB550"]
[{"$nulls":34},"SPNWC250"]
[{"$nulls":4},"Given information from User:",{"$nulls":29},"SPNWC350"]
[{"$nulls":15},"Sum",{"$nulls":18},"SPNWC450"]
[{"$nulls":10},"Lane","Lane",null,"Area",null,"Lane",{"$nulls":18},"SPNWC550"]
[{"$nulls":10},"Length","Area","Station","to test","Direction","Area",{"$nulls":18},"SPNWD250"]
[{"$nulls":5},"Lane Name","Lane Letter for Calcs.","Begin Station","End Station","Lane Width","(ft)","(ft2)","Random #","(ft2)",null,"(ft2)","Lane Name","Lane Name","Alignment Name","Add to Offset",{"$nulls":14},"SPNWD350"]
[{"$nulls":5},{"$f":"CONCATENATE($F10,\", \",$B10,\" Lift\",\", \",$E10)","v":"0, 0 Lift, 0"},"A",{"$f":"J10","v":{"v":0,"d":"+.00"}},{"v":0,"d":"+.00"},{"$f":"IF(M10>0.1,M10,IF(ISNUMBER(L10),L10,0))","v":{"v":0,"d":"+.00"}},{"$f":"ABS(I99-H99)","v":{"v":0,"d":"0.00"}},{"$f":"K99*J99","v":0},{"$f":"'random numbers'!B200","v":{"v":0.6392934322357178,"d":"0.6393"}},{"$f":"L99*M99","v":0},{"$f":"IF(J10<K10,1,IF(J10=K10,0,IF(J10>K10,-1,\"NOT\")))","v":0},{"v":0,"d":"0.0"},{"$f":"G99","v":"A"},{"$f":"IF(M10<0.1,CONCATENATE(B10,\", Lift \",C10,\",\",D10,\",\",F10,\",\",E10),CONCATENATE(B10,\", Lift \",C10,\",\",D10,\",\",G10,\"-\",H10,\",\",E10))","v":"0, Lift 0,0,0,0"},{"$f":"IF(ISBLANK(I10),\" \",I10)","v":0},{"$f":"IFERROR(IF(M10>0.1, $N242,INDEX('Drop Downs'!$F$4:$F$28, MATCH('Core Stationing'!$F10, 'Drop Downs'!$D$4:$D$28, 0))),\"\")","v":""},{"$nulls":14},"SPNWD450"]
[{"$nulls":5},"0, 0 Lift, 0","B",{"v":0,"d":"+.00"},{"v":0,"d":"+.00"},{"$f":"IF(M11>0.1,M11,IF(ISNUMBER(L11),L11,0))","v":{"v":0,"d":"+.00"}},{"v":0,"d":"0.00"},{"$f":"K100*J100","v":0},{"$f":"'random numbers'!B201","v":{"v":0.4790734648704529,"d":"0.4791"}},{"$f":"L100*M100","v":0},0,{"$f":"L99","v":{"v":0,"d":"0.0"}},"B",{"$f":"IF(M11<0.1,CONCATENATE(B11,\", Lift \",C11,\",\",D11,\",\",F11,\",\",E11),CONCATENATE(B11,\", Lift \",C11,\",\",D11,\",\",G11,\"-\",H11,\",\",E11))","v":"0, Lift 0,0,0,0"},0,{"$f":"IFERROR(IF(M11>0.1, $N243,INDEX('Drop Downs'!$F$4:$F$28, MATCH('Core Stationing'!$F11, 'Drop Downs'!$D$4:$D$28, 0))),\"\")","v":""},{"$nulls":14},"SPNWD550"]
[{"$nulls":5},"0, 0 Lift, 0","C",{"v":0,"d":"+.00"},{"v":0,"d":"+.00"},{"v":0,"d":"+.00"},{"v":0,"d":"0.00"},0,{"$f":"'random numbers'!B202","v":{"v":0.9597333669662476,"d":"0.9597"}},0,0,{"$f":"SUM($L$99:L100)","v":{"v":0,"d":"0.0"}},"C","0, Lift 0,0,0,0",0,{"$f":"IFERROR(IF(M12>0.1, $N244,INDEX('Drop Downs'!$F$4:$F$28, MATCH('Core Stationing'!$F12, 'Drop Downs'!$D$4:$D$28, 0))),\"\")","v":""}]
[{"$nulls":5},"0, 0 Lift, 0","D",{"v":0,"d":"+.00"},{"v":0,"d":"+.00"},{"v":0,"d":"+.00"},{"v":0,"d":"0.00"},0,{"$f":"'random numbers'!B203","v":{"v":0.7373276352882385,"d":"0.7373"}},0,0,{"$f":"SUM($L$99:L101)","v":{"v":0,"d":"0.0"}},"D","0, Lift 0,0,0,0",0,{"$f":"IFERROR(IF(M13>0.1, $N245,INDEX('Drop Downs'!$F$4:$F$28, MATCH('Core Stationing'!$F13, 'Drop Downs'!$D$4:$D$28, 0))),\"\")","v":""}]
[{"$nulls":5},"0, 0 Lift, 0","E",{"v":0,"d":"+.00"},{"v":0,"d":"+.00"},{"v":0,"d":"+.00"},{"v":0,"d":"0.00"},0,{"$f":"'random numbers'!B204","v":{"v":0.5944252014160156,"d":"0.5944"}},0,0,{"$f":"SUM($L$99:L102)","v":{"v":0,"d":"0.0"}},"E","0, Lift 0,0,0,0",0,{"$f":"IFERROR(IF(M14>0.1, $N246,INDEX('Drop Downs'!$F$4:$F$28, MATCH('Core Stationing'!$F14, 'Drop Downs'!$D$4:$D$28, 0))),\"\")","v":""}]
[{"$nulls":5},"0, 0 Lift, 0","F",{"v":0,"d":"+.00"},{"v":0,"d":"+.00"},{"v":0,"d":"+.00"},{"v":0,"d":"0.00"},0,{"$f":"'random numbers'!B205","v":{"v":0.2887117266654968,"d":"0.2887"}},0,0,{"$f":"SUM($L$99:L103)","v":{"v":0,"d":"0.0"}},"F","0, Lift 0,0,0,0",0,{"$f":"IFERROR(IF(M15>0.1, $N247,INDEX('Drop Downs'!$F$4:$F$28, MATCH('Core Stationing'!$F15, 'Drop Downs'!$D$4:$D$28, 0))),\"\")","v":""}]
[{"$nulls":5},"0, 0 Lift, 0","G",{"v":0,"d":"+.00"},{"v":0,"d":"+.00"},{"v":0,"d":"+.00"},{"v":0,"d":"0.00"},0,{"$f":"'random numbers'!B206","v":{"v":0.9402729272842407,"d":"0.9403"}},0,0,{"$f":"SUM($L$99:L104)","v":{"v":0,"d":"0.0"}},"G","0, Lift 0,0,0,0",0,{"$f":"IFERROR(IF(M16>0.1, $N248,INDEX('Drop Downs'!$F$4:$F$28, MATCH('Core Stationing'!$F16, 'Drop Downs'!$D$4:$D$28, 0))),\"\")","v":""}]
[{"$nulls":5},"0, 0 Lift, 0","H",{"v":0,"d":"+.00"},{"v":0,"d":"+.00"},{"v":0,"d":"+.00"},{"v":0,"d":"0.00"},0,{"$f":"'random numbers'!B207","v":{"v":0.7200101017951965,"d":"0.7200"}},0,0,{"$f":"SUM($L$99:L105)","v":{"v":0,"d":"0.0"}},"H","0, Lift 0,0,0,0",0,{"$f":"IFERROR(IF(M17>0.1, $N249,INDEX('Drop Downs'!$F$4:$F$28, MATCH('Core Stationing'!$F17, 'Drop Downs'!$D$4:$D$28, 0))),\"\")","v":""}]
[{"$nulls":5},"0, 0 Lift, 0","I",{"v":0,"d":"+.00"},{"v":0,"d":"+.00"},{"v":0,"d":"+.00"},{"v":0,"d":"0.00"},0,{"$f":"'random numbers'!B208","v":{"v":0.1152193546295166,"d":"0.1152"}},0,0,{"$f":"SUM($L$99:L106)","v":{"v":0,"d":"0.0"}},"I","0, Lift 0,0,0,0",0,{"$f":"IFERROR(IF(M18>0.1, $N250,INDEX('Drop Downs'!$F$4:$F$28, MATCH('Core Stationing'!$F18, 'Drop Downs'!$D$4:$D$28, 0))),\"\")","v":""}]
[{"$nulls":5},"0, 0 Lift, 0","J",{"v":0,"d":"+.00"},{"v":0,"d":"+.00"},{"v":0,"d":"+.00"},{"v":0,"d":"0.00"},0,{"$f":"'random numbers'!B209","v":{"v":0.6640123724937439,"d":"0.6640"}},0,0,{"$f":"SUM($L$99:L107)","v":{"v":0,"d":"0.0"}},"J","0, Lift 0,0,0,0",0,{"$f":"IFERROR(IF(M19>0.1, $N251,INDEX('Drop Downs'!$F$4:$F$28, MATCH('Core Stationing'!$F19, 'Drop Downs'!$D$4:$D$28, 0))),\"\")","v":""}]
[{"$nulls":5},"0, 0 Lift, 0","K",{"v":0,"d":"+.00"},{"v":0,"d":"+.00"},{"v":0,"d":"+.00"},{"v":0,"d":"0.00"},0,{"$f":"'random numbers'!B210","v":{"v":0.7520540952682495,"d":"0.7521"}},0,0,{"$f":"SUM($L$99:L108)","v":{"v":0,"d":"0.0"}},"K","0, Lift 0,0,0,0",0,{"$f":"IFERROR(IF(M20>0.1, $N252,INDEX('Drop Downs'!$F$4:$F$28, MATCH('Core Stationing'!$F20, 'Drop Downs'!$D$4:$D$28, 0))),\"\")","v":""}]
[{"$nulls":5},"0, 0 Lift, 0","L",{"v":0,"d":"+.00"},{"v":0,"d":"+.00"},{"v":0,"d":"+.00"},{"v":0,"d":"0.00"},0,{"$f":"'random numbers'!B211","v":{"v":0.019087374210357666,"d":"0.0191"}},0,0,{"$f":"SUM($L$99:L109)","v":{"v":0,"d":"0.0"}},"L","0, Lift 0,0,0,0",0,{"$f":"IFERROR(IF(M21>0.1, $N253,INDEX('Drop Downs'!$F$4:$F$28, MATCH('Core Stationing'!$F21, 'Drop Downs'!$D$4:$D$28, 0))),\"\")","v":""}]
[{"$nulls":5},"0, 0 Lift, 0","M",{"v":0,"d":"+.00"},{"v":0,"d":"+.00"},{"v":0,"d":"+.00"},{"v":0,"d":"0.00"},0,{"$f":"'random numbers'!B212","v":{"v":0.2179875373840332,"d":"0.2180"}},0,0,{"$f":"SUM($L$99:L110)","v":{"v":0,"d":"0.0"}},"M","0, Lift 0,0,0,0",0,{"$f":"IFERROR(IF(M22>0.1, $N254,INDEX('Drop Downs'!$F$4:$F$28, MATCH('Core Stationing'!$F22, 'Drop Downs'!$D$4:$D$28, 0))),\"\")","v":""}]
[{"$nulls":5},"0, 0 Lift, 0","N",{"v":0,"d":"+.00"},{"v":0,"d":"+.00"},{"v":0,"d":"+.00"},{"v":0,"d":"0.00"},0,{"$f":"'random numbers'!B213","v":{"v":0.6212870478630066,"d":"0.6213"}},0,0,{"$f":"SUM($L$99:L111)","v":{"v":0,"d":"0.0"}},"N","0, Lift 0,0,0,0",0,{"$f":"IFERROR(IF(M23>0.1, $N255,INDEX('Drop Downs'!$F$4:$F$28, MATCH('Core Stationing'!$F23, 'Drop Downs'!$D$4:$D$28, 0))),\"\")","v":""}]
[{"$nulls":5},"0, 0 Lift, 0","O",{"v":0,"d":"+.00"},{"v":0,"d":"+.00"},{"v":0,"d":"+.00"},{"v":0,"d":"0.00"},0,{"$f":"'random numbers'!B214","v":{"v":0.8802300691604614,"d":"0.8802"}},0,0,{"$f":"SUM($L$99:L112)","v":{"v":0,"d":"0.0"}},"O","0, Lift 0,0,0,0",0,{"$f":"IFERROR(IF(M24>0.1, $N256,INDEX('Drop Downs'!$F$4:$F$28, MATCH('Core Stationing'!$F24, 'Drop Downs'!$D$4:$D$28, 0))),\"\")","v":""}]
[{"$nulls":5},"0, 0 Lift, 0","P",{"v":0,"d":"+.00"},{"v":0,"d":"+.00"},{"v":0,"d":"+.00"},{"v":0,"d":"0.00"},0,{"$f":"'random numbers'!B215","v":{"v":0.6345594525337219,"d":"0.6346"}},0,0,{"$f":"SUM($L$99:L113)","v":{"v":0,"d":"0.0"}},"P","0, Lift 0,0,0,0",0,{"$f":"IFERROR(IF(M25>0.1, $N257,INDEX('Drop Downs'!$F$4:$F$28, MATCH('Core Stationing'!$F25, 'Drop Downs'!$D$4:$D$28, 0))),\"\")","v":""}]
[{"$nulls":5},"0, 0 Lift, 0","Q",{"$f":"J26","v":{"v":0,"d":"+.00"}},{"v":0,"d":"+.00"},{"v":0,"d":"+.00"},{"v":0,"d":"0.00"},0,{"$f":"'random numbers'!B216","v":{"v":0.37157130241394043,"d":"0.3716"}},0,0,{"$f":"SUM($L$99:L114)","v":{"v":0,"d":"0.0"}},"Q","0, Lift 0,0,0,0",0,{"$f":"IFERROR(IF(M26>0.1, $N258,INDEX('Drop Downs'!$F$4:$F$28, MATCH('Core Stationing'!$F26, 'Drop Downs'!$D$4:$D$28, 0))),\"\")","v":""}]
[{"$nulls":5},"0, 0 Lift, 0","R",{"v":0,"d":"+.00"},{"v":0,"d":"+.00"},{"v":0,"d":"+.00"},{"v":0,"d":"0.00"},0,{"$f":"'random numbers'!B217","v":{"v":0.6293773055076599,"d":"0.6294"}},0,0,{"$f":"SUM($L$99:L115)","v":{"v":0,"d":"0.0"}},"R","0, Lift 0,0,0,0",0,{"$f":"IFERROR(IF(M27>0.1, $N259,INDEX('Drop Downs'!$F$4:$F$28, MATCH('Core Stationing'!$F27, 'Drop Downs'!$D$4:$D$28, 0))),\"\")","v":""}]
[{"$nulls":5},"0, 0 Lift, 0","S",{"v":0,"d":"+.00"},{"v":0,"d":"+.00"},{"v":0,"d":"+.00"},{"v":0,"d":"0.00"},0,{"$f":"'random numbers'!B218","v":{"v":0.059221625328063965,"d":"0.0592"}},0,0,{"$f":"SUM($L$99:L116)","v":{"v":0,"d":"0.0"}},"S","0, Lift 0,0,0,0",0,{"$f":"IFERROR(IF(M28>0.1, $N260,INDEX('Drop Downs'!$F$4:$F$28, MATCH('Core Stationing'!$F28, 'Drop Downs'!$D$4:$D$28, 0))),\"\")","v":""}]
[{"$nulls":5},"0, 0 Lift, 0","T",{"v":0,"d":"+.00"},{"v":0,"d":"+.00"},{"v":0,"d":"+.00"},{"v":0,"d":"0.00"},0,{"$f":"'random numbers'!B219","v":{"v":0.03526788949966431,"d":"0.0353"}},0,0,{"$f":"SUM($L$99:L117)","v":{"v":0,"d":"0.0"}},"T","0, Lift 0,0,0,0",0,{"$f":"IFERROR(IF(M29>0.1, $N261,INDEX('Drop Downs'!$F$4:$F$28, MATCH('Core Stationing'!$F29, 'Drop Downs'!$D$4:$D$28, 0))),\"\")","v":""}]
[{"$nulls":5},"0, 0 Lift, 0","U",{"v":0,"d":"+.00"},{"v":0,"d":"+.00"},{"v":0,"d":"+.00"},{"v":0,"d":"0.00"},0,{"$f":"'random numbers'!B220","v":{"v":0.5759706497192383,"d":"0.5760"}},0,0,{"$f":"SUM($L$99:L118)","v":{"v":0,"d":"0.0"}},"U","0, Lift 0,0,0,0",0,{"$f":"IFERROR(IF(M30>0.1, $N262,INDEX('Drop Downs'!$F$4:$F$28, MATCH('Core Stationing'!$F30, 'Drop Downs'!$D$4:$D$28, 0))),\"\")","v":""}]
[{"$nulls":5},"0, 0 Lift, 0","V",{"v":0,"d":"+.00"},{"v":0,"d":"+.00"},{"v":0,"d":"+.00"},{"v":0,"d":"0.00"},0,{"$f":"'random numbers'!B221","v":{"v":0,"d":"0.0000"}},0,0,{"$f":"SUM($L$99:L119)","v":{"v":0,"d":"0.0"}},"V","0, Lift 0,0,0,0",0,{"$f":"IFERROR(IF(M31>0.1, $N263,INDEX('Drop Downs'!$F$4:$F$28, MATCH('Core Stationing'!$F31, 'Drop Downs'!$D$4:$D$28, 0))),\"\")","v":""}]
[{"$nulls":5},"0, 0 Lift, 0","W",{"v":0,"d":"+.00"},{"v":0,"d":"+.00"},{"v":0,"d":"+.00"},{"v":0,"d":"0.00"},0,{"$f":"'random numbers'!B222","v":{"v":0,"d":"0.0000"}},0,0,{"$f":"SUM($L$99:L120)","v":{"v":0,"d":"0.0"}},"W","0, Lift 0,0,0,0",0,{"$f":"IFERROR(IF(M32>0.1, $N264,INDEX('Drop Downs'!$F$4:$F$28, MATCH('Core Stationing'!$F32, 'Drop Downs'!$D$4:$D$28, 0))),\"\")","v":""}]
[{"$nulls":5},"0, 0 Lift, 0","X",{"v":0,"d":"+.00"},{"v":0,"d":"+.00"},{"v":0,"d":"+.00"},{"v":0,"d":"0.00"},0,{"$f":"'random numbers'!B223","v":{"v":0,"d":"0.0000"}},0,0,{"$f":"SUM($L$99:L121)","v":{"v":0,"d":"0.0"}},"X","0, Lift 0,0,0,0",0,{"$f":"IFERROR(IF(M33>0.1, $N265,INDEX('Drop Downs'!$F$4:$F$28, MATCH('Core Stationing'!$F33, 'Drop Downs'!$D$4:$D$28, 0))),\"\")","v":""}]
[{"$nulls":5},"0, 0 Lift, 0","Y",{"v":0,"d":"+.00"},{"v":0,"d":"+.00"},{"v":0,"d":"+.00"},{"v":0,"d":"0.00"},0,{"$f":"'random numbers'!B224","v":{"v":0,"d":"0.0000"}},0,0,{"$f":"SUM($L$99:L122)","v":{"v":0,"d":"0.0"}},"Y","0, Lift 0,0,0,0",0,{"$f":"IFERROR(IF(M34>0.1, $N266,INDEX('Drop Downs'!$F$4:$F$28, MATCH('Core Stationing'!$F34, 'Drop Downs'!$D$4:$D$28, 0))),\"\")","v":""}]
[{"$nulls":5},"0, 0 Lift, 0","Z",{"v":0,"d":"+.00"},{"v":0,"d":"+.00"},{"v":0,"d":"+.00"},{"v":0,"d":"0.00"},0,{"$f":"'random numbers'!B225","v":{"v":0,"d":"0.0000"}},0,0,{"$f":"SUM($L$99:L123)","v":{"v":0,"d":"0.0"}},"Z","0, Lift 0,0,0,0",0,{"$f":"IFERROR(IF(M35>0.1, $N267,INDEX('Drop Downs'!$F$4:$F$28, MATCH('Core Stationing'!$F35, 'Drop Downs'!$D$4:$D$28, 0))),\"\")","v":""}]
[{"$nulls":5},"0, 0 Lift, 0",1,{"v":0,"d":"+.00"},{"v":0,"d":"+.00"},{"v":0,"d":"+.00"},{"v":0,"d":"0.00"},0,{"$f":"'random numbers'!B226","v":{"v":0,"d":"0.0000"}},0,0,{"$f":"SUM($L$99:L124)","v":{"v":0,"d":"0.0"}},1,"0, Lift 0,0,0,0",0,{"$f":"IFERROR(IF(M36>0.1, $N268,INDEX('Drop Downs'!$F$4:$F$28, MATCH('Core Stationing'!$F36, 'Drop Downs'!$D$4:$D$28, 0))),\"\")","v":""}]
[{"$nulls":5},"0, 0 Lift, 0",2,{"v":0,"d":"+.00"},{"v":0,"d":"+.00"},{"v":0,"d":"+.00"},{"v":0,"d":"0.00"},0,{"$f":"'random numbers'!B227","v":{"v":0,"d":"0.0000"}},0,0,{"$f":"SUM($L$99:L125)","v":{"v":0,"d":"0.0"}},2,"0, Lift 0,0,0,0",0,{"$f":"IFERROR(IF(M37>0.1, $N269,INDEX('Drop Downs'!$F$4:$F$28, MATCH('Core Stationing'!$F37, 'Drop Downs'!$D$4:$D$28, 0))),\"\")","v":""}]
[]
[{"$nulls":11},"Total Area","# of Lots","Area/Lot"]
[{"$nulls":11},{"$f":"SUM(L99:L126)","v":0},{"$f":"IF(Q13=\"\",\"\",Q13)","v":0},{"$f":"L129/M129","v":{"$error":"#DIV/0!"}}]
[]
[{"$nulls":4},"Determination of Mat Core Stationing:"]
[{"$nulls":5},"Lot #",{"$f":"$B$42","v":1},{"$f":"$B$42","v":1},{"$f":"$B$42+1","v":2},{"$f":"$B$42+1","v":2},{"$f":"$B$42+2","v":3},{"$f":"$B$42+2","v":3},{"$f":"$B$42+3","v":4},{"$f":"$B$42+3","v":4},{"$f":"$B$42+4","v":5},{"$f":"$B$42+4","v":5},{"$f":"$B$42+5","v":6},{"$f":"$B$42+5","v":6},{"$f":"$B$42+6","v":7},{"$f":"$B$42+6","v":7},{"$f":"$B$42+7","v":8},{"$f":"$B$42+7","v":8},{"$f":"$B$42+8","v":9},{"$f":"$B$42+8","v":9},{"$f":"$B$42+9","v":10},{"$f":"$B$42+9","v":10}]
[{"$nulls":6},"1st Core","2nd Core","1st Core","2nd Core","1st Core","2nd Core","1st Core","2nd Core","1st Core","2nd Core","1st Core","2nd Core","2nd Core","2nd Core","2nd Core","2nd Core","2nd Core","2nd Core","2nd Core","2nd Core"]
[{"$nulls":5},"Lot Random # A",{"$f":"IF($G$148<$H$148, $G$148, $H$148)","v":{"v":0.41030627489089966,"d":"0.4103"}},{"$f":"IF($G$148<$H$148, $H$148, $G$148)","v":{"v":0.8055155277252197,"d":"0.8055"}},{"$f":"IF($I$148<$J$148, $I$148, $J$148)","v":{"v":0.354308545589447,"d":"0.3543"}},{"$f":"IF($I$148<$J$148, $J$148, $I$148)","v":{"v":0.44235026836395264,"d":"0.4424"}},{"$f":"IF($K$148<$L$148, $K$148, $L$148)","v":{"v":0.6427044868469238,"d":"0.6427"}},{"$f":"IF($K$148<$L$148, $L$148, $K$148)","v":{"v":0.7093835473060608,"d":"0.7094"}},{"$f":"IF($M$148<$N$148, $M$148, $N$148)","v":{"v":0.3115832209587097,"d":"0.3116"}},{"$f":"IF($M$148<$N$148, $N$148, $M$148)","v":{"v":0.5705262422561646,"d":"0.5705"}},{"$f":"IF($O$148<$P$148, $O$148, $P$148)","v":{"v":0.7936971783638,"d":"0.7937"}},{"$f":"IF($O$148<$P$148, $P$148, $O$148)","v":{"v":0.796288251876831,"d":"0.7963"}},{"$f":"IF($Q$148<$R$148, $Q$148, $R$148)","v":{"v":0.31967347860336304,"d":"0.3197"}},{"$f":"IF($Q$148<$R$148, $R$148, $Q$148)","v":{"v":0.4839385747909546,"d":"0.4839"}},{"$f":"IF($S$148<$T$148, $S$148, $T$148)","v":{"v":0.2662668228149414,"d":"0.2663"}},{"$f":"IF($S$148<$T$148, $T$148, $S$148)","v":{"v":0.7255640625953674,"d":"0.7256"}},{"$f":"IF($U$148<$V$148, $U$148, $V$148)","v":{"v":0.24490416049957275,"d":"0.2449"}},{"$f":"IF($U$148<$V$148, $V$148, $U$148)","v":{"v":0.6441585421562195,"d":"0.6442"}},{"$f":"IF($W$148<$X$148, $W$148, $X$148)","v":{"v":0.05264019966125488,"d":"0.0526"}},{"$f":"IF($W$148<$X$148, $X$148, $W$148)","v":{"v":0.7082465291023254,"d":"0.7082"}},{"$f":"IF($Y$148<$Z$148, $Y$148, $Z$148)","v":{"v":0.05668532848358154,"d":"0.0567"}},{"$f":"IF($Y$148<$Z$148, $Z$148, $Y$148)","v":{"v":0.5506176352500916,"d":"0.5506"}}]
[{"$nulls":5},"Random Area",{"$f":"$N129*G134","v":{"$error":"#DIV/0!"}},{"$f":"$N129*H134","v":{"$error":"#DIV/0!"}},{"$f":"$N129+($N129*I134)","v":{"$error":"#DIV/0!"}},{"$f":"$N129+($N129*J134)","v":{"$error":"#DIV/0!"}},{"$f":"($N129*2)+($N129*K134)","v":{"$error":"#DIV/0!"}},{"$f":"($N129*2)+($N129*L134)","v":{"$error":"#DIV/0!"}},{"$f":"($N129*3)+($N129*M134)","v":{"$error":"#DIV/0!"}},{"$f":"($N129*3)+($N129*N134)","v":{"$error":"#DIV/0!"}},{"$f":"($N129*4)+($N129*O134)","v":{"$error":"#DIV/0!"}},{"$f":"($N129*4)+($N129*P134)","v":{"$error":"#DIV/0!"}},{"$f":"($N129*5)+($N129*Q134)","v":{"$error":"#DIV/0!"}},{"$f":"($N129*5)+($N129*R134)","v":{"$error":"#DIV/0!"}},{"$f":"($N129*6)+($N129*S134)","v":{"$error":"#DIV/0!"}},{"$f":"($N129*6)+($N129*T134)","v":{"$error":"#DIV/0!"}},{"$f":"($N129*7)+($N129*U134)","v":{"$error":"#DIV/0!"}},{"$f":"($N129*7)+($N129*V134)","v":{"$error":"#DIV/0!"}},{"$f":"($N129*8)+($N129*W134)","v":{"$error":"#DIV/0!"}},{"$f":"($N129*8)+($N129*X134)","v":{"$error":"#DIV/0!"}},{"$f":"($N129*9)+($N129*Y134)","v":{"$error":"#DIV/0!"}},{"$f":"($N129*9)+($N129*Z134)","v":{"$error":"#DIV/0!"}}]
[{"$nulls":5},"Lane Letter to take core",{"$f":"VLOOKUP(G135,$P$99:$Q$126,2)","v":{"$error":"#DIV/0!"}},{"$f":"VLOOKUP(H135,$P$99:$Q$126,2)","v":{"$error":"#DIV/0!"}},{"$error":"#DIV/0!"},{"$error":"#DIV/0!"},{"$error":"#DIV/0!"},{"$error":"#DIV/0!"},{"$error":"#DIV/0!"},{"$error":"#DIV/0!"},{"$error":"#DIV/0!"},{"$error":"#DIV/0!"},{"$error":"#DIV/0!"},{"$error":"#DIV/0!"},{"$error":"#DIV/0!"},{"$error":"#DIV/0!"},{"$error":"#DIV/0!"},{"$error":"#DIV/0!"},{"$error":"#DIV/0!"},{"$error":"#DIV/0!"},{"$error":"#DIV/0!"},{"$error":"#DIV/0!"}]
[{"$nulls":5},"Total Lane Area",{"$f":"VLOOKUP(G136,$G99:$L126,6,FALSE)","v":{"$error":"#DIV/0!"}},{"$f":"VLOOKUP(H136,$G99:$L126,6,FALSE)","v":{"$error":"#DIV/0!"}},{"$error":"#DIV/0!"},{"$error":"#DIV/0!"},{"$error":"#DIV/0!"},{"$error":"#DIV/0!"},{"$error":"#DIV/0!"},{"$error":"#DIV/0!"},{"$error":"#DIV/0!"},{"$error":"#DIV/0!"},{"$error":"#DIV/0!"},{"$error":"#DIV/0!"},{"$error":"#DIV/0!"},{"$error":"#DIV/0!"},{"$error":"#DIV/0!"},{"$error":"#DIV/0!"},{"$error":"#DIV/0!"},{"$error":"#DIV/0!"},{"$error":"#DIV/0!"},{"$error":"#DIV/0!"}]
[{"$nulls":5},"Sum Lane Area",{"$f":"(VLOOKUP(G136,$G99:$P126,10,FALSE))+G137","v":{"$error":"#DIV/0!"}},{"$f":"(VLOOKUP(H136,$G99:$P126,10,FALSE))+H137","v":{"$error":"#DIV/0!"}},{"$f":"(VLOOKUP(I136,$G99:$P126,10,FALSE))+I137","v":{"$error":"#DIV/0!"}},{"$error":"#DIV/0!"},{"$error":"#DIV/0!"},{"$error":"#DIV/0!"},{"$error":"#DIV/0!"},{"$error":"#DIV/0!"},{"$error":"#DIV/0!"},{"$error":"#DIV/0!"},{"$error":"#DIV/0!"},{"$error":"#DIV/0!"},{"$error":"#DIV/0!"},{"$error":"#DIV/0!"},{"$error":"#DIV/0!"},{"$error":"#DIV/0!"},{"$error":"#DIV/0!"},{"$error":"#DIV/0!"},{"$error":"#DIV/0!"},{"$error":"#DIV/0!"}]
[{"$nulls":5},"Lane Width",{"$f":"VLOOKUP(G136,$G99:$J126,4,FALSE)","v":{"$error":"#DIV/0!"}},{"$f":"VLOOKUP(H136,$G99:$J126,4,FALSE)","v":{"$error":"#DIV/0!"}},{"$error":"#DIV/0!"},{"$error":"#DIV/0!"},{"$error":"#DIV/0!"},{"$error":"#DIV/0!"},{"$error":"#DIV/0!"},{"$error":"#DIV/0!"},{"$error":"#DIV/0!"},{"$error":"#DIV/0!"},{"$error":"#DIV/0!"},{"$error":"#DIV/0!"},{"$error":"#DIV/0!"},{"$error":"#DIV/0!"},{"$error":"#DIV/0!"},{"$error":"#DIV/0!"},{"$error":"#DIV/0!"},{"$error":"#DIV/0!"},{"$error":"#DIV/0!"},{"$error":"#DIV/0!"}]
[{"$nulls":5},"Lane End Station",{"$f":"VLOOKUP(G136,$G99:$I126,3,FALSE)","v":{"$error":"#DIV/0!"}},{"$error":"#DIV/0!"},{"$error":"#DIV/0!"},{"$error":"#DIV/0!"},{"$error":"#DIV/0!"},{"$error":"#DIV/0!"},{"$error":"#DIV/0!"},{"$error":"#DIV/0!"},{"$error":"#DIV/0!"},{"$error":"#DIV/0!"},{"$error":"#DIV/0!"},{"$error":"#DIV/0!"},{"$error":"#DIV/0!"},{"$error":"#DIV/0!"},{"$error":"#DIV/0!"},{"$error":"#DIV/0!"},{"$error":"#DIV/0!"},{"$error":"#DIV/0!"},{"$error":"#DIV/0!"},{"$error":"#DIV/0!"}]
[{"$nulls":5},"Direction",{"$f":"VLOOKUP(G136,$G$99:$O$126,9,FALSE)","v":{"$error":"#DIV/0!"}},{"$f":"VLOOKUP(H136,$G$99:$O$126,9,FALSE)","v":{"$error":"#DIV/0!"}},{"$error":"#DIV/0!"},{"$error":"#DIV/0!"},{"$error":"#DIV/0!"},{"$error":"#DIV/0!"},{"$error":"#DIV/0!"},{"$error":"#DIV/0!"},{"$error":"#DIV/0!"},{"$error":"#DIV/0!"},{"$error":"#DIV/0!"},{"$error":"#DIV/0!"},{"$error":"#DIV/0!"},{"$error":"#DIV/0!"},{"$error":"#DIV/0!"},{"$error":"#DIV/0!"},{"$error":"#DIV/0!"},{"$error":"#DIV/0!"},{"$error":"#DIV/0!"},{"$error":"#DIV/0!"}]
[{"$nulls":5},"Distance from end of Station to core",{"$f":"(G138-G135)/G139","v":{"$error":"#DIV/0!"}},{"$f":"(H138-H135)/H139","v":{"$error":"#DIV/0!"}},{"$error":"#DIV/0!"},{"$error":"#DIV/0!"},{"$error":"#DIV/0!"},{"$error":"#DIV/0!"},{"$error":"#DIV/0!"},{"$error":"#DIV/0!"},{"$error":"#DIV/0!"},{"$error":"#DIV/0!"},{"$error":"#DIV/0!"},{"$error":"#DIV/0!"},{"$error":"#DIV/0!"},{"$error":"#DIV/0!"},{"$error":"#DIV/0!"},{"$error":"#DIV/0!"},{"$error":"#DIV/0!"},{"$error":"#DIV/0!"},{"$error":"#DIV/0!"},{"$error":"#DIV/0!"}]
[{"$nulls":5},"Lane Station to Core",{"$f":"IFERROR(G140-(G141*(G142)),\"\")","v":""},{"$f":"IFERROR(H140-(H141*(H142)),\"\")","v":""},"","","","","","","","","","","","","","","","","",""]
[{"$nulls":5},"Lane Name",{"$f":"IFERROR(VLOOKUP(G136,$Q99:$R126,2),\"\")","v":""},{"$f":"IFERROR(VLOOKUP(H136,$Q99:$R126,2),\"\")","v":""},"","","","","","","","","","","","","","","","","",""]
[{"$nulls":5},"Alignment Name",{"$f":"IFERROR(VLOOKUP(G136,$Q99:$S126,3),\"\")","v":""},{"$f":"IFERROR(VLOOKUP(H136,$Q99:$S126,3),\" \")","v":" "},{"$f":"IFERROR(VLOOKUP(I136,$Q99:$S126,3),\"\")","v":""},"","","","","","","","","","","","","","","","",""]
[{"$nulls":4},"Determine Random Numbers"]
[{"$nulls":6},"1A","1B","2A","2B","3A","3B","4A","4B","5A","5B","6A","6B","7A","7B","8A","8B","9A","9B","10A","10B"]
[{"$nulls":6},{"$f":"'random numbers'!$B$15","v":{"v":0.41030627489089966,"d":"0.4103"}},{"$f":"'random numbers'!$B$16","v":{"v":0.8055155277252197,"d":"0.8055"}},{"$f":"'random numbers'!$B$17","v":{"v":0.354308545589447,"d":"0.3543"}},{"$f":"'random numbers'!$B$18","v":{"v":0.44235026836395264,"d":"0.4424"}},{"$f":"'random numbers'!$B$19","v":{"v":0.7093835473060608,"d":"0.7094"}},{"$f":"'random numbers'!$B$20","v":{"v":0.6427044868469238,"d":"0.6427"}},{"$f":"'random numbers'!$B$21","v":{"v":0.3115832209587097,"d":"0.3116"}},{"$f":"'random numbers'!$B$22","v":{"v":0.5705262422561646,"d":"0.5705"}},{"$f":"'random numbers'!$B$23","v":{"v":0.7936971783638,"d":"0.7937"}},{"$f":"'random numbers'!$B$24","v":{"v":0.796288251876831,"d":"0.7963"}},{"$f":"'random numbers'!$B$25","v":{"v":0.31967347860336304,"d":"0.3197"}},{"$f":"'random numbers'!$B$26","v":{"v":0.4839385747909546,"d":"0.4839"}},{"$f":"'random numbers'!$B$27","v":{"v":0.7255640625953674,"d":"0.7256"}},{"$f":"'random numbers'!$B$28","v":{"v":0.2662668228149414,"d":"0.2663"}},{"$f":"'random numbers'!$B$29","v":{"v":0.6441585421562195,"d":"0.6442"}},{"$f":"'random numbers'!$B$30","v":{"v":0.24490416049957275,"d":"0.2449"}},{"$f":"'random numbers'!$B$31","v":{"v":0.7082465291023254,"d":"0.7082"}},{"$f":"'random numbers'!$B$32","v":{"v":0.05264019966125488,"d":"0.0526"}},{"$f":"'random numbers'!$B$33","v":{"v":0.5506176352500916,"d":"0.5506"}},{"$f":"'random numbers'!$B$34","v":{"v":0.05668532848358154,"d":"0.0567"}}]
[]
[]
[{"$nulls":4},"Determination of which core the agency will test:"]
[]
[{"$nulls":6},"Test","Which"]
[{"$nulls":5},{"$f":"C39","v":"Mat"},"Companion","Core to"]
[{"$nulls":5},"Core","Random #","Test"]
[{"$nulls":4},{"$f":"B41","v":"Lot"},"ID"]
[{"$nulls":4},{"$f":"B42","v":1},1.1,{"$f":"'random numbers'!$B$150","v":0.6098405122756958},{"$f":"IF(G157<0.5,\"Y\",\"N\")","v":"N"}]
[{"$nulls":5},1.2,null,{"$f":"IF(G157>0.5,\"Y\",\"N\")","v":"Y"}]
[{"$nulls":4},{"$f":"B44","v":""},"",{"$f":"'random numbers'!$B$151","v":0.3641698956489563},{"$f":"IF(G159<0.5,\"Y\",\"N\")","v":"Y"}]
[{"$nulls":5},"",null,{"$f":"IF(G159>0.5,\"Y\",\"N\")","v":"N"}]
[{"$nulls":4},{"$f":"B46","v":""},"",{"$f":"'random numbers'!$B$152","v":0.1011817455291748},{"$f":"IF(G161<0.5,\"Y\",\"N\")","v":"Y"}]
[{"$nulls":5},"",null,{"$f":"IF(G161>0.5,\"Y\",\"N\")","v":"N"}]
[{"$nulls":4},{"$f":"B48","v":""},"",{"$f":"'random numbers'!$B$153","v":0.6245669722557068},{"$f":"IF(G163<0.5,\"Y\",\"N\")","v":"N"}]
[{"$nulls":5},"",null,{"$f":"IF(G163>0.5,\"Y\",\"N\")","v":"Y"}]
[{"$nulls":4},{"$f":"B50","v":""},"",{"$f":"'random numbers'!$B$154","v":0.05441129207611084},{"$f":"IF(G165<0.5,\"Y\",\"N\")","v":"Y"}]
[{"$nulls":5},"",null,{"$f":"IF(G165>0.5,\"Y\",\"N\")","v":"N"}]
[{"$nulls":4},{"$f":"B52","v":""},"",{"$f":"'random numbers'!$B$155","v":0.2960367798805237},{"$f":"IF(G167<0.5,\"Y\",\"N\")","v":"Y"}]
[{"$nulls":5},"",null,{"$f":"IF(G167>0.5,\"Y\",\"N\")","v":"N"}]
[{"$nulls":4},{"$f":"B54","v":""},"",{"$f":"'random numbers'!$B$156","v":0.5711603164672852},{"$f":"IF(G169<0.5,\"Y\",\"N\")","v":"N"}]
[{"$nulls":5},"",null,{"$f":"IF(G169>0.5,\"Y\",\"N\")","v":"Y"}]
[{"$nulls":4},{"$f":"B56","v":""},"",{"$f":"'random numbers'!$B$157","v":0.21463125944137573},{"$f":"IF(G171<0.5,\"Y\",\"N\")","v":"Y"}]
[{"$nulls":5},"",null,{"$f":"IF(G171>0.5,\"Y\",\"N\")","v":"N"}]
[{"$nulls":4},{"$f":"B58","v":""},{"$f":"E58","v":""},{"$f":"'random numbers'!$B$158","v":0.5497976541519165},{"$f":"IF(G173<0.5,\"Y\",\"N\")","v":"N"}]
[{"$nulls":5},{"$f":"E59","v":""},null,{"$f":"IF(G173>0.5,\"Y\",\"N\")","v":"Y"}]
[{"$nulls":4},{"$f":"B60","v":""},{"$f":"E60","v":""},{"$f":"'random numbers'!$B$159","v":0.2787192463874817},{"$f":"IF(G175<0.5,\"Y\",\"N\")","v":"Y"}]
[{"$nulls":5},{"$f":"E61","v":""},null,{"$f":"IF(G175>0.5,\"Y\",\"N\")","v":"N"}]
[]
[]
[]
[]
[{"$nulls":4},"Determine LJD cores to Test:",{"$nulls":9},"Determine 2nd LJD Core"]
[{"$nulls":4},"1st LJD Core"]
[{"$nulls":5},"1ST","1ST",{"$nulls":7},"2nd","2nd","overlap of values"]
[{"$nulls":5},"LJD","LJD","Is Mat","(For","Sub","Decision Tree for",null,"Associated",null,"LJD","LJD","and determine","Sub","Decision Tree for",null,"Associated"]
[{"$nulls":4},"Number of","Lot","Which","Core","Calculations)","Core","Mat Core ID",{"$f":"E217","v":"Mat"},"Mat",null,"Lot","Which","which 2nd","Core","Mat Core ID",{"$f":"L185","v":"Mat"},"Mat"]
[{"$nulls":4},"LJD","Random","Core","a Value (\"v\")","Core","Random","that will be",{"$f":"E218","v":"Core"},"Core with",null,"Random","Core","LJD core to ","Random","that will be","Core","Core with"]
[{"$nulls":4},"Lots","Number","to Test","or Blank (\"l\")","#","Numbers","tested",{"$f":"E219","v":"ID"},"LJD Cores",null,"Number","to Test","use","Numbers","tested","ID","LJD Cores"]
[{"$nulls":10},"(1=Yes, 2=No)",{"$nulls":7},"(1=Yes, 2=No)"]
[{"$nulls":4},{"$f":"IF($Q$11<=5000,1,2)","v":1},{"$f":"'random numbers'!$B$90","v":0.2691749334335327},{"$f":"ROUND((($Q$13)*F189),0)","v":0},{"$f":"IF(E220=\"\",\"l\",\"v\")","v":"v"},{"$f":"IF(H189=\"v\",1,\"\")","v":1},{"$f":"'random numbers'!$B$160","v":0.35753369331359863},{"$f":"IF(AND(($G$194=$I189),(J189<0.5)),1,2)","v":1},{"$f":"E220","v":1.1},{"$f":"VLOOKUP(1,K189:L208,2,FALSE)","v":1.1},null,{"$f":"'random numbers'!$B$115","v":0.356079638004303},{"$f":"IF($E$189>1,ROUND((($Q$13)*O189),0),\"\")","v":""},{"$f":"IF(P189=\"\",\"\",IF(P199<>$G$194,P199,IF(P200<>$G$194,P200,P201)))","v":""},{"$f":"'random numbers'!$B$166","v":0.7553340196609497},{"$f":"IF(AND(($Q$189=$I189),(R189<0.5)),1,2)","v":2},1.1,{"$f":"VLOOKUP(1,S189:T208,2,FALSE)","v":""}]
[{"$nulls":5},{"$f":"'random numbers'!$B$91","v":0.5108004212379456},{"$f":"ROUND((($Q$13)*F190),0)","v":0},"v",null,null,{"$f":"IF(AND(($G$194=$I$189),($J189>=0.5)),1,2)","v":2},1.2,{"$nulls":6},{"$f":"IF(AND(($Q$189=$I$189),(R189>=0.5)),1,2)","v":2},1.2]
[{"$nulls":5},{"$f":"'random numbers'!$B$92","v":0.05150318145751953},{"$f":"ROUND((($Q$13)*F191),0)","v":0},"l",{"$f":"IF(H191=\"v\",2,\"\")","v":""},{"$f":"'random numbers'!$B$161","v":0.8555111289024353},{"$f":"IF(AND(($G$194=$I191),(J191<0.5)),1,2)","v":2},"",null,null,{"$f":"'random numbers'!$B$116","v":0.9221901893615723},{"$f":"IF($E$189>1,ROUND((($Q$13)*O191),0),\"\")","v":""},null,{"$f":"'random numbers'!$B$167","v":0.19326859712600708},{"$f":"IF(AND(($Q$189=$I191),(R191<0.5)),1,2)","v":1},""]
[{"$nulls":5},{"$f":"'random numbers'!$B$93","v":0.4293949007987976},{"$f":"ROUND((($Q$13)*F192),0)","v":0},"l",null,null,{"$f":"IF(AND(($G$194=$I$191),($J191>=0.5)),1,2)","v":2},"",{"$nulls":6},{"$f":"IF(AND(($Q$189=$I$191),(R191>=0.5)),1,2)","v":2},""]
[{"$nulls":7},"l",{"$f":"IF(H193=\"v\",3,\"\")","v":""},{"$f":"'random numbers'!$B$162","v":0.6271580457687378},{"$f":"IF(AND(($G$194=$I193),(J193<0.5)),1,2)","v":2},"",null,null,{"$f":"'random numbers'!$B$117","v":0.2238585352897644},{"$f":"IF($E$189>1,ROUND((($Q$13)*O193),0),\"\")","v":""},null,{"$f":"'random numbers'!$B$168","v":0.6138856410980225},{"$f":"IF(AND(($Q$189=$I193),(R193<0.5)),1,2)","v":2},""]
[{"$nulls":6},{"$f":"IF(AND((G189>0),(G189<=$Q$13)),G189,IF(AND((G190>0),(G190<=$Q$13)),G190,IF(AND((G191>0),(G191<=$Q$13)),G191,IF(AND((G192>0),(G192<=$Q$13)),G192,1))))","v":1},"l",null,null,{"$f":"IF(AND(($G$194=$I$193),($J193>=0.5)),1,2)","v":2},"",{"$nulls":6},{"$f":"IF(AND(($Q$189=$I$193),(R193>=0.5)),1,2)","v":1},""]
[{"$nulls":7},"l",{"$f":"IF(H195=\"v\",4,\"\")","v":""},{"$f":"'random numbers'!$B$163","v":0.5777965188026428},{"$f":"IF(AND(($G$194=$I195),(J195<0.5)),1,2)","v":2},"",null,null,{"$f":"'random numbers'!$B$118","v":0.850011944770813},{"$f":"IF($E$189>1,ROUND((($Q$13)*O195),0),\"\")","v":""},null,{"$f":"'random numbers'!$B$169","v":0.08645528554916382},{"$f":"IF(AND(($Q$189=$I195),(R195<0.5)),1,2)","v":1},""]
[{"$nulls":7},"l",null,null,{"$f":"IF(AND(($G$194=$I$195),($J195>=0.5)),1,2)","v":2},"",{"$nulls":6},{"$f":"IF(AND(($Q$189=$I$195),(R195>=0.5)),1,2)","v":2},""]
[{"$nulls":7},"l",{"$f":"IF(H197=\"v\",5,\"\")","v":""},{"$f":"'random numbers'!$B$164","v":0.46030187606811523},{"$f":"IF(AND(($G$194=$I197),(J197<0.5)),1,2)","v":2},"",null,null,{"$f":"'random numbers'!$B$119","v":0.9715517163276672},{"$f":"IF($E$189>1,ROUND((($Q$13)*O197),0),\"\")","v":""},null,{"$f":"'random numbers'!$B$170","v":0.9343255758285522},{"$f":"IF(AND(($Q$189=$I197),(R197<0.5)),1,2)","v":2},""]
[{"$nulls":7},"l",null,null,{"$f":"IF(AND(($G$194=$I$197),($J197>=0.5)),1,2)","v":2},"",{"$nulls":6},{"$f":"IF(AND(($Q$189=$I$197),(R197>=0.5)),1,2)","v":1},""]
[{"$nulls":7},"l",{"$f":"IF(H199=\"v\",6,\"\")","v":""},{"$f":"'random numbers'!$B$165","v":0.812785804271698},{"$f":"IF(AND(($G$194=$I199),(J199<0.5)),1,2)","v":2},"",null,null,"1st Choice",{"$f":"IF(AND(($P$189>0),($P$189<=$Q$13)),$P$189,IF(AND(($P$191>0),($P$191<=$Q$13)),$P$191,IF(AND(($P$193>0),($P$193<=$Q$13)),$P$193,1)))","v":1},null,{"$f":"'random numbers'!$B$171","v":0.859556257724762},{"$f":"IF(AND(($Q$189=$I199),(R199<0.5)),1,2)","v":2},""]
[{"$nulls":7},"l",null,null,{"$f":"IF(AND(($G$194=$I$199),($J199>=0.5)),1,2)","v":2},"",null,null,"2nd Choice",{"$f":"IF(AND(($P$191>0),($P$191<=$Q$13)),$P$191,IF(AND(($P$193>0),($P$193<=$Q$13)),$P$193,1))","v":1},null,null,{"$f":"IF(AND(($Q$189=$I$199),(R199>=0.5)),1,2)","v":1},""]
[{"$nulls":7},"l",{"$f":"IF(H201=\"v\",7,\"\")","v":""},{"$f":"'random numbers'!$B$166","v":0.7553340196609497},{"$f":"IF(AND(($G$194=$I201),(J201<0.5)),1,2)","v":2},"",null,null,"3rd Choice",{"$f":"IF(AND(($P$193>0),($P$193<=$Q$13)),$P$193,1)","v":1},null,{"$f":"'random numbers'!$B$172","v":0.08386421203613281},{"$f":"IF(AND(($Q$189=$I201),(R201<0.5)),1,2)","v":1},""]
[{"$nulls":7},"l",null,null,{"$f":"IF(AND(($G$194=$I$201),($J201>=0.5)),1,2)","v":2},"",{"$nulls":6},{"$f":"IF(AND(($Q$189=$I$201),(R201>=0.5)),1,2)","v":2},""]
[{"$nulls":7},"l",{"$f":"IF(H203=\"v\",8,\"\")","v":""},{"$f":"'random numbers'!$B$167","v":0.19326859712600708},{"$f":"IF(AND(($G$194=$I203),(J203<0.5)),1,2)","v":2},"",{"$nulls":5},{"$f":"'random numbers'!$B$173","v":0.14536112546920776},{"$f":"IF(AND(($Q$189=$I203),(R203<0.5)),1,2)","v":1},""]
[{"$nulls":7},"l",null,null,{"$f":"IF(AND(($G$194=$I$203),($J203>=0.5)),1,2)","v":2},"",{"$nulls":6},{"$f":"IF(AND(($Q$189=$I$203),(R203>=0.5)),1,2)","v":2},""]
[{"$nulls":7},"l",{"$f":"IF(H205=\"v\",9,\"\")","v":""},{"$f":"'random numbers'!$B$168","v":0.6138856410980225},{"$f":"IF(AND(($G$194=$I205),(J205<0.5)),1,2)","v":2},"",{"$nulls":5},{"$f":"'random numbers'!$B$174","v":0.4297119379043579},{"$f":"IF(AND(($Q$189=$I205),(R205<0.5)),1,2)","v":1},""]
[{"$nulls":7},"l",null,null,{"$f":"IF(AND(($G$194=$I$205),($J205>=0.5)),1,2)","v":2},"",{"$nulls":6},{"$f":"IF(AND(($Q$189=$I$205),(R205>=0.5)),1,2)","v":2},""]
[{"$nulls":7},"l",{"$f":"IF(H207=\"v\",10,\"\")","v":""},{"$f":"'random numbers'!$B$169","v":0.08645528554916382},{"$f":"IF(AND(($G$194=$I207),(J207<0.5)),1,2)","v":2},"",{"$nulls":5},{"$f":"'random numbers'!$B$175","v":0.84223872423172},{"$f":"IF(AND(($Q$189=$I207),(R207<0.5)),1,2)","v":2},""]
[{"$nulls":7},"l",null,null,{"$f":"IF(AND(($G$194=$I$207),($J207>=0.5)),1,2)","v":2},"",{"$nulls":6},{"$f":"IF(AND(($Q$189=$I$207),(R207>=0.5)),1,2)","v":1},""]
[]
[]
[]
[{"$nulls":4},"Mat Core Offset Determination:",{"$nulls":14},"LJD Cores","LJD Core Labels:"]
[{"$nulls":10},"Before ","Confined","Unconfined","Non LJD",{"$nulls":5},"Tested?"]
[{"$nulls":10},"Checking for","Mat","Mat","Mat","Decision Tree for","Gearbox","Right or"]
[{"$nulls":10},"LJD changes","Offset","Offset","Core","Mat Offset","Offset","Left of",null,null,{"$f":"IF(AND(($R$8=\"Yes\"),($R$9=\"No\")),\"Yes\",\"No\")","v":"Yes"},"Left LJD","LJD Core","Right LJD","LJD Core",null,"Calculations for LJC locations"]
[{"$nulls":8},"Mat","Lane","Mat",null,null,"Offset","that will be","Random","Gearbox","Calculated",null,null,"Core ID","Offset Label for Table","Core ID","Offset Label for Table"]
[{"$nulls":4},{"$f":"C39","v":"Mat"},{"$f":"M39","v":"Test"},{"$f":"H39","v":"Mat"},{"$f":"F39","v":0},"Offset","Width","Offset",{"$nulls":3},"tested for LJD","Numbers","that will be ","Mat Offset",null,null,"Label",null,"Label",null,null,"Longitudinal Joint","Longitudinal Joint","Longitudinal Joint","Longitudinal Joint"]
[{"$nulls":4},"Core","Companion","Core",{"$f":"F40","v":"Name"},"Random#","(ft.)","(ft.)","(ft.)","(ft.)","(ft.)","(1=Yes, 2=No)",null,"tested","(ft.)",{"$nulls":7},"Core Location","Displayed Location","Core Location","Displayed Location"]
[{"$nulls":4},"ID","Core","Station",{"$nulls":9},"(Left = -2ft, Right= +2ft)"]
[{"$nulls":4},1.1,"","",{"$f":"G136","v":{"$error":"#DIV/0!"}},{"$f":"'random numbers'!$B100","v":0.4094862937927246},{"$f":"VLOOKUP(H220,$G$99:$J$126,4,FALSE)","v":{"$error":"#DIV/0!"}},{"$f":"IF(E220=\"\",\"\",IF(((J220*I220)<1),1,IF(((J220*I220)>(J220-1)),J220-1,J220*I220)))","v":{"$error":"#DIV/0!"}},{"$f":"IF(E220=\"\",\"\",IF(Q42=\"confined\",IF((I220*J220)<0.5,0.5,IF(((I220*J220)>(J220-0.5)),(J220-0.5),(I220*J220))),\"unconf/blank\"))","v":"unconf/blank"},{"$f":"IF(E220=\"\",\"\",IF(OR((Q42=\"unconfined\"),(Q42=\"\")),IF((I220*J220)<1,1,IF((I220*J220)>(J220-1),(J220-1),(I220*J220))),\"confined\"))","v":{"$error":"#DIV/0!"}},{"$f":"IF(L220=\"unconf/blank\",M220,L220)","v":{"$error":"#DIV/0!"}},{"$f":"IF(OR(($M$189=E220),($U$189=E220)),1,2)","v":1},{"$f":"'random numbers'!B180","v":0.7074265480041504},{"$f":"IF(P220<0.5,-2,2)","v":2},{"$f":"IF(E220=\"\",\"\",IF($T$215=\"No\",N220,IF(O220=1,(((J220)/2)+Q220),K220)))","v":{"$error":"#DIV/0!"}},null,null,{"$f":"IF(E220=\"\",\"\",IF($T$215=\"No\",\"\",IF(O220=1,E220+0.2,\"\")))","v":1.3},{"$f":"IF(E219=\"\",\"\",IF($T$215=\"No\",\"\",IF(O220=1,AA220,\"\")))","v":{"$error":"#VALUE!"}},{"$f":"IF(E220=\"\",\"\",IF($T$215=\"No\",\"\",IF(O220=1,E220+0.3,\"\")))","v":1.4000000000000001},{"$f":"IF(E220=\"\",\"\",IF($T$215=\"No\",\"\",IF(O220=1,AC220,\"\")))","v":{"$error":"#VALUE!"}},null,{"$f":"IF(AND(O220=1,ISNUMBER(E220)),P242+0.5,\"\")","v":{"$error":"#VALUE!"}},{"$f":"IF(AND((O220=1),ISNUMBER(E220)),IF(Z220<0,CONCATENATE((ABS(Z220)),\"' L\"),CONCATENATE(Z220,\"' R\")),\"\")","v":{"$error":"#VALUE!"}},{"$f":"IF(AND((O220=1),ISNUMBER(E220)),(P242+J220)-0.5,\"\")","v":{"$error":"#VALUE!"}},{"$f":"IF(AND((O220=1),ISNUMBER(E220)),IF(AB220<0,CONCATENATE((ABS(AB220)),\"' L\"),CONCATENATE(AB220,\"' R\")),\"\")","v":{"$error":"#VALUE!"}}]
[{"$nulls":4},1.2,"Y","",{"$f":"H136","v":{"$error":"#DIV/0!"}},{"$f":"'random numbers'!$B101","v":0.7619702219963074},{"$error":"#DIV/0!"},{"$error":"#DIV/0!"},"unconf/blank",{"$error":"#DIV/0!"},{"$f":"IF(L221=\"unconf/blank\",M221,L221)","v":{"$error":"#DIV/0!"}},2,{"$f":"'random numbers'!B181","v":0.00909489393234253},-2,{"$error":"#DIV/0!"},null,null,{"$f":"IF(E220=\"\",\"\",IF($T$215=\"No\",\"\",IF(O221=1,E221+0.1,\"\")))","v":""},{"$f":"IF(E220=\"\",\"\",IF($T$215=\"No\",\"\",IF(O221=1,AA221,\"\")))","v":""},{"$f":"IF(E220=\"\",\"\",IF($T$215=\"No\",\"\",IF(O221=1,E221+0.2,\"\")))","v":""},{"$f":"IF(E221=\"\",\"\",IF($T$215=\"No\",\"\",IF(O221=1,AC221,\"\")))","v":""},null,{"$f":"IF(AND(O221=1,ISNUMBER(E221)),P243+0.5,\"\")","v":""},{"$f":"IF(AND((O221=1),ISNUMBER(E221)),IF(Z221<0,CONCATENATE((ABS(Z221)),\"' L\"),CONCATENATE(Z221,\"' R\")),\"\")","v":""},{"$f":"IF(AND((O221=1),ISNUMBER(E221)),(P243+J221)-0.5,\"\")","v":""},{"$f":"IF(AND((O221=1),ISNUMBER(E221)),IF(AB221<0,CONCATENATE((ABS(AB221)),\"' L\"),CONCATENATE(AB221,\"' R\")),\"\")","v":""}]
[{"$nulls":4},"","","",{"$f":"I136","v":{"$error":"#DIV/0!"}},{"$f":"'random numbers'!$B102","v":0.7045184373855591},{"$error":"#DIV/0!"},"","","","",1,{"$f":"'random numbers'!B182","v":0.3696690797805786},-2,"",null,null,{"$f":"IF(E222=\"\",\"\",IF($T$215=\"No\",\"\",IF(O222=1,E222+0.2,\"\")))","v":""},{"$f":"IF(E221=\"\",\"\",IF($T$215=\"No\",\"\",IF(O222=1,AA222,\"\")))","v":""},{"$f":"IF(E222=\"\",\"\",IF($T$215=\"No\",\"\",IF(O222=1,E222+0.3,\"\")))","v":""},{"$f":"IF(E222=\"\",\"\",IF($T$215=\"No\",\"\",IF(O222=1,AC222,\"\")))","v":""},null,{"$f":"IF(AND(O222=1,ISNUMBER(E222)),P244+0.5,\"\")","v":""},{"$f":"IF(AND((O222=1),ISNUMBER(E222)),IF(Z222<0,CONCATENATE((ABS(Z222)),\"' L\"),CONCATENATE(Z222,\"' R\")),\"\")","v":""},"",""]
[{"$nulls":4},"","","",{"$f":"J136","v":{"$error":"#DIV/0!"}},{"$f":"'random numbers'!$B103","v":0.14245301485061646},{"$error":"#DIV/0!"},"","","","",1,{"$f":"'random numbers'!B183","v":0.7567880749702454},2,"",null,null,{"$f":"IF(E222=\"\",\"\",IF($T$215=\"No\",\"\",IF(O223=1,E223+0.1,\"\")))","v":""},{"$f":"IF(E222=\"\",\"\",IF($T$215=\"No\",\"\",IF(O223=1,AA223,\"\")))","v":""},{"$f":"IF(E222=\"\",\"\",IF($T$215=\"No\",\"\",IF(O223=1,E223+0.2,\"\")))","v":""},"",null,{"$f":"IF(AND(O223=1,ISNUMBER(E223)),P245+0.5,\"\")","v":""},"","",""]
[{"$nulls":4},"","","",{"$f":"K136","v":{"$error":"#DIV/0!"}},{"$f":"'random numbers'!$B104","v":0.8286492824554443},{"$error":"#DIV/0!"},"","","","",1,{"$f":"'random numbers'!B184","v":0.12658953666687012},-2,"",null,null,{"$f":"IF(E224=\"\",\"\",IF($T$215=\"No\",\"\",IF(O224=1,E224+0.2,\"\")))","v":""},"",{"$f":"IF(E224=\"\",\"\",IF($T$215=\"No\",\"\",IF(O224=1,E224+0.3,\"\")))","v":""},"",null,"","","",""]
[{"$nulls":4},"","","",{"$f":"L136","v":{"$error":"#DIV/0!"}},{"$f":"'random numbers'!$B105","v":0.03563970327377319},{"$error":"#DIV/0!"},"","","","",1,{"$f":"'random numbers'!B185","v":0.01718515157699585},-2,"",null,null,{"$f":"IF(E224=\"\",\"\",IF($T$215=\"No\",\"\",IF(O225=1,E225+0.1,\"\")))","v":""},{"$f":"IF(E224=\"\",\"\",IF($T$215=\"No\",\"\",IF(O225=1,AA225,\"\")))","v":""},{"$f":"IF(E224=\"\",\"\",IF($T$215=\"No\",\"\",IF(O225=1,E225+0.2,\"\")))","v":""},"",null,{"$f":"IF(AND(O225=1,ISNUMBER(E225)),P247+0.5,\"\")","v":""},{"$f":"IF(AND((O225=1),ISNUMBER(E225)),IF(Z225<0,CONCATENATE((ABS(Z225)),\"' L\"),CONCATENATE(Z225,\"' R\")),\"\")","v":""},"",""]
[{"$nulls":4},"","","",{"$f":"M136","v":{"$error":"#DIV/0!"}},{"$f":"'random numbers'!$B106","v":0.14908921718597412},{"$error":"#DIV/0!"},"","","","",1,{"$f":"'random numbers'!B186","v":0.8142398595809937},2,"",null,null,{"$f":"IF(E226=\"\",\"\",IF($T$215=\"No\",\"\",IF(O226=1,E226+0.2,\"\")))","v":""},"",{"$f":"IF(E226=\"\",\"\",IF($T$215=\"No\",\"\",IF(O226=1,E226+0.3,\"\")))","v":""},"",null,"","","",""]
[{"$nulls":4},"","","",{"$f":"N136","v":{"$error":"#DIV/0!"}},{"$f":"'random numbers'!$B107","v":0.07431989908218384},{"$error":"#DIV/0!"},"","","","",1,{"$f":"'random numbers'!B187","v":0.42307573556900024},-2,"",null,null,{"$f":"IF(E226=\"\",\"\",IF($T$215=\"No\",\"\",IF(O227=1,E227+0.1,\"\")))","v":""},{"$f":"IF(E226=\"\",\"\",IF($T$215=\"No\",\"\",IF(O227=1,AA227,\"\")))","v":""},{"$f":"IF(E226=\"\",\"\",IF($T$215=\"No\",\"\",IF(O227=1,E227+0.2,\"\")))","v":""},{"$f":"IF(E227=\"\",\"\",IF($T$215=\"No\",\"\",IF(O227=1,AC227,\"\")))","v":""},null,{"$f":"IF(AND(O227=1,ISNUMBER(E227)),P249+0.5,\"\")","v":""},"",{"$f":"IF(AND((O227=1),ISNUMBER(E227)),(P249+J227)-0.5,\"\")","v":""},""]
[{"$nulls":4},"","","",{"$f":"O136","v":{"$error":"#DIV/0!"}},{"$f":"'random numbers'!$B108","v":0.2986278533935547},{"$error":"#DIV/0!"},"","","","",1,{"$f":"'random numbers'!B188","v":0.5965681076049805},2,"",null,null,{"$f":"IF(E228=\"\",\"\",IF($T$215=\"No\",\"\",IF(O228=1,E228+0.2,\"\")))","v":""},"",{"$f":"IF(E228=\"\",\"\",IF($T$215=\"No\",\"\",IF(O228=1,E228+0.3,\"\")))","v":""},"",null,"","","",""]
[{"$nulls":4},"","","",{"$f":"P136","v":{"$error":"#DIV/0!"}},{"$f":"'random numbers'!$B109","v":0.6257039904594421},{"$error":"#DIV/0!"},"","","","",1,{"$f":"'random numbers'!B189","v":0.6072494387626648},2,"",null,null,{"$f":"IF(E228=\"\",\"\",IF($T$215=\"No\",\"\",IF(O229=1,E229+0.1,\"\")))","v":""},"",{"$f":"IF(E228=\"\",\"\",IF($T$215=\"No\",\"\",IF(O229=1,E229+0.2,\"\")))","v":""},"",null,"","","",""]
[{"$nulls":4},"","","",{"$f":"Q136","v":{"$error":"#DIV/0!"}},{"$f":"'random numbers'!$B110","v":0.6444755792617798},{"$error":"#DIV/0!"},"","","","",1,{"$f":"'random numbers'!B190","v":0.5752054452896118},2,"",null,null,{"$f":"IF(E230=\"\",\"\",IF($T$215=\"No\",\"\",IF(O230=1,E230+0.2,\"\")))","v":""},"",{"$f":"IF(E230=\"\",\"\",IF($T$215=\"No\",\"\",IF(O230=1,E230+0.3,\"\")))","v":""},"",null,"","","",""]
[{"$nulls":4},"","","",{"$f":"R136","v":{"$error":"#DIV/0!"}},{"$f":"'random numbers'!$B111","v":0.057002365589141846},{"$error":"#DIV/0!"},"","","","",1,{"$f":"'random numbers'!B191","v":0.6713374257087708},2,"",null,null,{"$f":"IF(E230=\"\",\"\",IF($T$215=\"No\",\"\",IF(O231=1,E231+0.1,\"\")))","v":""},"",{"$f":"IF(E230=\"\",\"\",IF($T$215=\"No\",\"\",IF(O231=1,E231+0.2,\"\")))","v":""},"",null,"","","",""]
[{"$nulls":4},"","","",{"$f":"S136","v":{"$error":"#DIV/0!"}},{"$f":"'random numbers'!$B112","v":0.08500123023986816},{"$error":"#DIV/0!"},"","","","",1,{"$f":"'random numbers'!B192","v":0.38294148445129395},-2,"",null,null,{"$f":"IF(E232=\"\",\"\",IF($T$215=\"No\",\"\",IF(O232=1,E232+0.1,\"\")))","v":""},"",{"$f":"IF(E232=\"\",\"\",IF($T$215=\"No\",\"\",IF(O232=1,E232+0.2,\"\")))","v":""},"",null,"","","",""]
[{"$nulls":4},"","","",{"$f":"T136","v":{"$error":"#DIV/0!"}},{"$f":"'random numbers'!$B113","v":0.2665838599205017},{"$error":"#DIV/0!"},"","","","",1,{"$f":"'random numbers'!B193","v":0.24812930822372437},-2,"",null,null,{"$f":"IF(E232=\"\",\"\",IF($T$215=\"No\",\"\",IF(O233=1,E233+0.1,\"\")))","v":""},"",{"$f":"IF(E232=\"\",\"\",IF($T$215=\"No\",\"\",IF(O233=1,E233+0.2,\"\")))","v":""},"",null,"","","",""]
[{"$nulls":4},"","","",{"$f":"U136","v":{"$error":"#DIV/0!"}},{"$f":"'random numbers'!$B114","v":0.7218359708786011},{"$error":"#DIV/0!"},"","","","",1,{"$f":"'random numbers'!B194","v":0.3869866132736206},-2,"",null,null,{"$f":"IF(E234=\"\",\"\",IF($T$215=\"No\",\"\",IF(O234=1,E234+0.1,\"\")))","v":""},"",{"$f":"IF(E234=\"\",\"\",IF($T$215=\"No\",\"\",IF(O234=1,E234+0.2,\"\")))","v":""},"",null,"","","",""]
[{"$nulls":4},"","","",{"$f":"V136","v":{"$error":"#DIV/0!"}},{"$f":"'random numbers'!$B115","v":0.356079638004303},{"$error":"#DIV/0!"},"","","","",1,{"$f":"'random numbers'!B195","v":0.9704146981239319},2,"",null,null,{"$f":"IF(E234=\"\",\"\",IF($T$215=\"No\",\"\",IF(O235=1,E235+0.1,\"\")))","v":""},"",{"$f":"IF(E234=\"\",\"\",IF($T$215=\"No\",\"\",IF(O235=1,E235+0.2,\"\")))","v":""},"",null,"","","",""]
[{"$nulls":4},{"$f":"E58","v":""},{"$f":"K58","v":""},{"$f":"G58","v":""},{"$f":"W136","v":{"$error":"#DIV/0!"}},{"$f":"'random numbers'!$B116","v":0.9221901893615723},{"$error":"#DIV/0!"},"",{"$f":"IF(E236=\"\",\"\",IF(O58=\"confined\",IF((I236*J236)<0.5,0.5,IF(((I236*J236)>(J236-0.5)),(J236-0.5),(I236*J236))),\"unconf/blank\"))","v":""},{"$f":"IF(E236=\"\",\"\",IF(OR((O58=\"unconfined\"),(O58=\"\")),IF((I236*J236)<1,1,IF((I236*J236)>(J236-1),(J236-1),(I236*J236))),\"confined\"))","v":""},"",1,{"$f":"'random numbers'!B196","v":0.22013044357299805},-2,"",null,null,{"$f":"IF(E236=\"\",\"\",IF($T$215=\"No\",\"\",IF(O236=1,E236+0.1,\"\")))","v":""},"",{"$f":"IF(E236=\"\",\"\",IF($T$215=\"No\",\"\",IF(O236=1,E236+0.2,\"\")))","v":""},"",null,"","","",""]
[{"$nulls":4},{"$f":"E59","v":""},{"$f":"K59","v":""},{"$f":"G59","v":""},{"$f":"X136","v":{"$error":"#DIV/0!"}},{"$f":"'random numbers'!$B117","v":0.2238585352897644},{"$error":"#DIV/0!"},"",{"$f":"IF(E237=\"\",\"\",IF(O59=\"confined\",IF((I237*J237)<0.5,0.5,IF(((I237*J237)>(J237-0.5)),(J237-0.5),(I237*J237))),\"unconf/blank\"))","v":""},{"$f":"IF(E237=\"\",\"\",IF(OR((O59=\"unconfined\"),(O59=\"\")),IF((I237*J237)<1,1,IF((I237*J237)>(J237-1),(J237-1),(I237*J237))),\"confined\"))","v":""},"",1,{"$f":"'random numbers'!B197","v":0.20540398359298706},-2,"",null,null,{"$f":"IF(E236=\"\",\"\",IF($T$215=\"No\",\"\",IF(O237=1,E237+0.1,\"\")))","v":""},"",{"$f":"IF(E236=\"\",\"\",IF($T$215=\"No\",\"\",IF(O237=1,E237+0.2,\"\")))","v":""},"",null,"","","",""]
[{"$nulls":4},{"$f":"E60","v":""},{"$f":"K60","v":""},{"$f":"G60","v":""},{"$f":"Y136","v":{"$error":"#DIV/0!"}},{"$f":"'random numbers'!$B118","v":0.850011944770813},{"$error":"#DIV/0!"},"",{"$f":"IF(E238=\"\",\"\",IF(O60=\"confined\",IF((I238*J238)<0.5,0.5,IF(((I238*J238)>(J238-0.5)),(J238-0.5),(I238*J238))),\"unconf/blank\"))","v":""},{"$f":"IF(E238=\"\",\"\",IF(OR((O60=\"unconfined\"),(O60=\"\")),IF((I238*J238)<1,1,IF((I238*J238)>(J238-1),(J238-1),(I238*J238))),\"confined\"))","v":""},"",1,{"$f":"'random numbers'!B198","v":0.5151625871658325},2,"",null,null,{"$f":"IF(E238=\"\",\"\",IF($T$215=\"No\",\"\",IF(O238=1,E238+0.1,\"\")))","v":""},{"$f":"IF(E238=\"\",\"\",IF($T$215=\"No\",\"\",IF(O238=1,\"Core 0.5 ft. from Left Edge\",\"\")))","v":""},{"$f":"IF(E237=\"\",\"\",IF($T$215=\"No\",\"\",IF(O238=1,E238+0.2,\"\")))","v":""},{"$f":"IF(E238=\"\",\"\",IF($T$215=\"No\",\"\",IF(O238=1,\"Core 0.5 ft. from Right Edge\",\"\")))","v":""}]
[{"$nulls":4},{"$f":"E61","v":""},{"$f":"K61","v":""},{"$f":"G61","v":""},{"$f":"Z136","v":{"$error":"#DIV/0!"}},{"$f":"'random numbers'!$B119","v":0.9715517163276672},{"$error":"#DIV/0!"},"",{"$f":"IF(E239=\"\",\"\",IF(O61=\"confined\",IF((I239*J239)<0.5,0.5,IF(((I239*J239)>(J239-0.5)),(J239-0.5),(I239*J239))),\"unconf/blank\"))","v":""},{"$f":"IF(E239=\"\",\"\",IF(OR((O61=\"unconfined\"),(O61=\"\")),IF((I239*J239)<1,1,IF((I239*J239)>(J239-1),(J239-1),(I239*J239))),\"confined\"))","v":""},"",1,{"$f":"'random numbers'!B199","v":0.5858867764472961},2,"",null,null,{"$f":"IF(E238=\"\",\"\",IF($T$215=\"No\",\"\",IF(O239=1,E239+0.1,\"\")))","v":""},{"$f":"IF(E238=\"\",\"\",IF($T$215=\"No\",\"\",IF(O239=1,\"Core 0.5 ft. from Left Edge\",\"\")))","v":""},{"$f":"IF(E238=\"\",\"\",IF($T$215=\"No\",\"\",IF(O239=1,E239+0.2,\"\")))","v":""},{"$f":"IF(E238=\"\",\"\",IF($T$215=\"No\",\"\",IF(O239=1,\"Core 0.5 ft. from Right Edge\",\"\")))","v":""}]
[]
[{"$nulls":10},"Name","Left Boundary","Right Boundary","Add to Offset","Name","Add to Offset","Calculated Offset","Displayed Offset"]
[{"$nulls":10},"A",{"$f":"IFERROR(VALUE(IF(G10=\"CL\",0,\nIF(RIGHT(G10,1)=\"L\",-1*LEFT(G10,LEN(G10)-1),\nLEFT(G10,LEN(G10)-1)))),\"N/A\")","v":"N/A"},"N/A",{"$f":"$L242","v":"N/A"},{"$f":"IFERROR(VLOOKUP($H220,$Q$99:$T$126,1),\"\")","v":""},{"$f":"IFERROR(VLOOKUP($H220,$Q$99:$T$126,4),\"\")","v":""},{"$f":"IFERROR(ROUND($R220+$P242,2),\"\")","v":""},{"$f":"IF(ISNUMBER(Q242)=TRUE,IF(Q242<0, ABS(Q242)&\"' L\",IF(Q242>0,Q242&\"' R\",\"\")),\"\")","v":""}]
[{"$nulls":10},"B","N/A","N/A","N/A","",{"$f":"IFERROR(VLOOKUP($H221,$Q$99:$T$126,4),\"\")","v":""},{"$f":"IFERROR(ROUND($R221+$P243,2),\"\")","v":""},{"$f":"IF(ISNUMBER(Q243)=TRUE,IF(Q243<0, ABS(Q243)&\"' L\",IF(Q243>0,Q243&\"' R\",\"\")),\"\")","v":""}]
[{"$nulls":10},"C","N/A","N/A","N/A","",{"$f":"IFERROR(VLOOKUP($H222,$Q$99:$T$126,4),\"\")","v":""},"",""]
[{"$nulls":10},"D","N/A","N/A","N/A",{"$f":"IFERROR(VLOOKUP($H223,$Q$99:$T$126,1),\"\")","v":""},{"$f":"IFERROR(VLOOKUP($H223,$Q$99:$T$126,4),\"\")","v":""},"",""]
[{"$nulls":10},"E","N/A","N/A","N/A","","","",""]
[{"$nulls":10},"F","N/A","N/A","N/A","",{"$f":"IFERROR(VLOOKUP($H225,$Q$99:$T$126,4),\"\")","v":""},"",""]
[{"$nulls":10},"G","N/A","N/A","N/A","","","",""]
[{"$nulls":10},"H","N/A","N/A","N/A","",{"$f":"IFERROR(VLOOKUP($H227,$Q$99:$T$126,4),\"\")","v":""},"",""]
[{"$nulls":10},"I","N/A","N/A","N/A","","","",""]
[{"$nulls":10},"J","N/A","N/A","N/A","","","",""]
[{"$nulls":10},"K","N/A","N/A","N/A","","","",""]
[{"$nulls":10},"L","N/A","N/A","N/A","","","",""]
[{"$nulls":10},"M","N/A","N/A","N/A","","","",""]
[{"$nulls":10},"N","N/A","N/A","N/A","","","",""]
[{"$nulls":10},"O","N/A","N/A","N/A","","","",""]
[{"$nulls":10},"P","N/A","N/A","N/A","","","",""]
[{"$nulls":10},"Q","N/A","N/A","N/A","","","",""]
[{"$nulls":10},"R","N/A","N/A","N/A","","","",""]
[{"$nulls":10},"S","N/A","N/A","N/A","","","",""]
[{"$nulls":10},"T","N/A","N/A","N/A","","","",""]
[{"$nulls":10},"U","N/A","N/A","N/A"]
[{"$nulls":10},"V","N/A","N/A","N/A"]
[{"$nulls":10},"W","N/A","N/A","N/A"]
[{"$nulls":10},"X","N/A","N/A","N/A"]
[{"$nulls":10},"Y","N/A","N/A","N/A"]
[{"$nulls":10},"Z","N/A","N/A","N/A"]
[{"$nulls":10},1,"N/A","N/A","N/A"]
[{"$nulls":10},2,"N/A","N/A","N/A"]
[{"$nulls":10},"IF CUSTOM OFFSET"]
{"$rows_empty":10}
[{"$nulls":4},"Reset Random Numbers= CTRL m"]

{"sheet":"random numbers","index":5,"n_rows":220,"n_cols":2,"rows_kept":220,"hidden":true}
[{"v":0.9121362566947937,"d":"0.912"},0.1579994559288025]
[{"v":0.8455883264541626,"d":"0.846"},0.29685676097869873]
[{"v":0.6253255009651184,"d":"0.625"},0.88028484582901]
[{"v":0.5516932010650635,"d":"0.552"},0.13000059127807617]
[{"v":0.6939615607261658,"d":"0.694"},0.11527413129806519]
[{"v":0.7983149290084839,"d":"0.798"},0.42503273487091064]
[{"v":0.33092743158340454,"d":"0.331"},0.49575692415237427]
[{"v":0.5298275947570801,"d":"0.530"},0.5491635799407959]
[{"v":0.5266024470329285,"d":"0.527"},0.388943612575531]
[{"v":0.8018571138381958,"d":"0.802"},0.8696035146713257]
[{"v":0.8217657208442688,"d":"0.822"},0.16204458475112915]
[{"v":0.5587775707244873,"d":"0.559"},0.01914215087890625]
[{"v":0.6133212447166443,"d":"0.613"},0.7134286761283875]
[{"v":0.11886441707611084,"d":"0.119"},0.36498987674713135]
[{"v":0.8916483521461487,"d":"0.892"},0.41030627489089966]
[{"v":0.16677188873291016,"d":"0.167"},0.8055155277252197]
[{"v":0.07582205533981323,"d":"0.076"},0.354308545589447]
[{"v":0.942146897315979,"d":"0.942"},0.44235026836395264]
[{"v":0.7496970295906067,"d":"0.750"},0.7093835473060608]
[{"v":0.09409070014953613,"d":"0.094"},0.6427044868469238]
[{"v":0.5920681357383728,"d":"0.592"},0.3115832209587097]
[{"v":0.8948734998703003,"d":"0.895"},0.5705262422561646]
[{"v":0.9241405129432678,"d":"0.924"},0.7936971783638]
[{"v":0.33780431747436523,"d":"0.338"},0.796288251876831]
[{"v":0.690288245677948,"d":"0.690"},0.31967347860336304]
[{"v":0.8984156847000122,"d":"0.898"},0.4839385747909546]
[{"v":0.6182411313056946,"d":"0.618"},0.7255640625953674]
[{"v":0.36675429344177246,"d":"0.367"},0.2662668228149414]
[{"v":0.8393239378929138,"d":"0.839"},0.6441585421562195]
[{"v":0.48393189907073975,"d":"0.484"},0.24490416049957275]
[{"v":0.42840391397476196,"d":"0.428"},0.7082465291023254]
[{"v":0.9806079864501953,"d":"0.981"},0.05264019966125488]
[{"v":0.5732633471488953,"d":"0.573"},0.5506176352500916]
[{"v":0.8739258050918579,"d":"0.874"},0.05668532848358154]
[{"v":0.28645259141921997,"d":"0.286"},0.2729030251502991]
[{"v":0.8456099033355713,"d":"0.846"},0.15540838241577148]
[{"v":0.35508865118026733,"d":"0.355"},0.5078923106193542]
[{"v":0.8266524076461792,"d":"0.827"},0.18486130237579346]
[{"v":0.7264752984046936,"d":"0.726"},0.6227958798408508]
[{"v":0.5581650733947754,"d":"0.558"},0.3089921474456787]
[{"v":0.18772953748703003,"d":"0.188"},0.5159825682640076]
[{"v":0.5483037233352661,"d":"0.548"},0.6294320821762085]
[{"v":0.21731358766555786,"d":"0.217"},0.5546627640724182]
[{"v":0.8526942729949951,"d":"0.853"},0.7789707183837891]
[{"v":0.27444833517074585,"d":"0.274"},0.10604685544967651]
[{"v":0.07150304317474365,"d":"0.072"},0.39039766788482666]
[{"v":0.7560377717018127,"d":"0.756"},0.5373452305793762]
[{"v":0.19510936737060547,"d":"0.195"},0.5653440952301025]
[{"v":0.7369491457939148,"d":"0.737"},0.7469267249107361]
[{"v":0.7049051523208618,"d":"0.705"},0.20217883586883545]
[{"v":0.8796656727790833,"d":"0.880"},0.10200172662734985]
[{"v":0.12242817878723145,"d":"0.122"},0.6681122779846191]
[{"v":0.9876160025596619,"d":"0.988"},0.7042014002799988]
[{"v":0.3920525312423706,"d":"0.392"},0.33035480976104736]
[{"v":0.5066390633583069,"d":"0.507"},0.4518945813179016]
[{"v":0.756354808807373,"d":"0.756"},0.8216960430145264]
[{"v":0.8202568888664246,"d":"0.820"},0.9778708815574646]
[{"v":0.661173939704895,"d":"0.661"},0.5093463659286499]
[{"v":0.9974773526191711,"d":"0.997"},0.1181822419166565]
[{"v":0.05088400840759277,"d":"0.051"},0.02609539031982422]
[{"v":0.9692925810813904,"d":"0.969"},0.036776721477508545]
[{"v":0.9811109304428101,"d":"0.981"},0.004732728004455566]
[{"v":0.2735520005226135,"d":"0.274"},0.1008647084236145]
[{"v":0.3962287902832031,"d":"0.396"},0.8124687671661377]
[{"v":0.3636171221733093,"d":"0.364"},0.9432358145713806]
[{"v":0.015178322792053223,"d":"0.015"},0.08209311962127686]
[{"v":0.38839083909988403,"d":"0.388"},0.39994198083877563]
[{"v":0.3147585391998291,"d":"0.315"},0.9152369499206543]
[{"v":0.8635515570640564,"d":"0.864"},0.9005104899406433]
[{"v":0.9679049253463745,"d":"0.968"},0.21026909351348877]
[{"v":0.5628343224525452,"d":"0.563"},0.015414059162139893]
[{"v":0.2928929328918457,"d":"0.293"},0.06882071495056152]
[{"v":0.6961924433708191,"d":"0.696"},0.9086007475852966]
[{"v":0.9714471101760864,"d":"0.971"},0.3892606496810913]
[{"v":0.2569349408149719,"d":"0.257"},0.9472809433937073]
[{"v":0.9939467906951904,"d":"0.994"},0.5387992858886719]
[{"v":0.8452281355857849,"d":"0.845"},0.4986650347709656]
[{"v":0.556963324546814,"d":"0.557"},0.15022623538970947]
[{"v":0.7985888123512268,"d":"0.799"},0.9299634099006653]
[{"v":0.3392915725708008,"d":"0.339"},0.32517266273498535]
[{"v":0.5139209628105164,"d":"0.514"},0.13954490423202515]
[{"v":0.9247862100601196,"d":"0.925"},0.9620074033737183]
[{"v":0.6537078022956848,"d":"0.654"},0.22904068231582642]
[{"v":0.9981014728546143,"d":"0.998"},0.42794084548950195]
[{"v":0.027237355709075928,"d":"0.027"},0.09681957960128784]
[{"v":0.5333050489425659,"d":"0.533"},0.09018337726593018]
[{"v":0.828151285648346,"d":"0.828"},0.5789335370063782]
[{"v":0.24181509017944336,"d":"0.242"},0.5815246105194092]
[{"v":0.8598782420158386,"d":"0.860"},0.10490983724594116]
[{"v":0.8024264574050903,"d":"0.802"},0.2691749334335327]
[{"v":0.7715194821357727,"d":"0.772"},0.5108004212379456]
[{"v":0.2707650661468506,"d":"0.271"},0.05150318145751953]
[{"v":0.27449315786361694,"d":"0.274"},0.4293949007987976]
[{"v":0.12236344814300537,"d":"0.122"},0.03014051914215088]
[{"v":0.3131733536720276,"d":"0.313"},0.49348288774490356]
[{"v":0.6161098480224609,"d":"0.616"},0.837876558303833]
[{"v":0.9431859850883484,"d":"0.943"},0.07027477025985718]
[{"v":0.7586952447891235,"d":"0.759"},0.5763424634933472]
[{"v":0.4368012547492981,"d":"0.437"},0.5269809365272522]
[{"v":0.4840414524078369,"d":"0.484"},0.4094862937927246]
[{"v":0.6656240820884705,"d":"0.666"},0.7619702219963074]
[{"v":0.4487723112106323,"d":"0.449"},0.7045184373855591]
[{"v":0.8797536492347717,"d":"0.880"},0.14245301485061646]
[{"v":0.4621758460998535,"d":"0.462"},0.8286492824554443]
[{"v":0.49826496839523315,"d":"0.498"},0.03563970327377319]
[{"v":0.45231449604034424,"d":"0.452"},0.14908921718597412]
[{"v":0.370591938495636,"d":"0.371"},0.07431989908218384]
[{"v":0.47481417655944824,"d":"0.475"},0.2986278533935547]
[{"v":0.647300660610199,"d":"0.647"},0.6257039904594421]
[{"v":0.9755138158798218,"d":"0.976"},0.6444755792617798]
[null,0.057002365589141846]
[null,0.08500123023986816]
[null,0.2665838599205017]
[null,0.7218359708786011]
[null,0.356079638004303]
[null,0.9221901893615723]
[null,0.2238585352897644]
[null,0.850011944770813]
[null,0.9715517163276672]
[null,0.341353178024292]
[null,0.4975280165672302]
[null,0.294582724571228]
[null,0.9034186005592346]
[null,0.8113317489624023]
[null,0.8220130801200867]
[null,0.7899690866470337]
[null,0.8861010670661926]
[null,0.5977051258087158]
[null,0.46289294958114624]
[null,0.6017502546310425]
[null,0.18517833948135376]
[null,0.7004733085632324]
[null,0.42016762495040894]
[null,0.4643470048904419]
[null,0.5350711941719055]
[null,0.5884778499603271]
[null,0.42825788259506226]
[null,0.9089177846908569]
[null,0.4669380784034729]
[null,0.0584564208984375]
[null,0.7527429461479187]
[null,0.6698833703994751]
[null,0.4496205449104309]
[null,0.844829797744751]
[null,0.6592020392417908]
[null,0.4816645383834839]
[null,0.748697817325592]
[null,0.9475979804992676]
[null,0.6164767146110535]
[null,0.6098405122756958]
[null,0.3641698956489563]
[null,0.1011817455291748]
[null,0.6245669722557068]
[null,0.05441129207611084]
[null,0.2960367798805237]
[null,0.5711603164672852]
[null,0.21463125944137573]
[null,0.5497976541519165]
[null,0.2787192463874817]
[null,0.35753369331359863]
[null,0.8555111289024353]
[null,0.6271580457687378]
[null,0.5777965188026428]
[null,0.46030187606811523]
[null,0.812785804271698]
[null,0.7553340196609497]
[null,0.19326859712600708]
[null,0.6138856410980225]
[null,0.08645528554916382]
[null,0.9343255758285522]
[null,0.859556257724762]
[null,0.08386421203613281]
[null,0.14536112546920776]
[null,0.4297119379043579]
[null,0.84223872423172]
[null,0.8702375888824463]
[null,0.051820218563079834]
[null,0.2414931058883667]
[null,0.1413159966468811]
[null,0.7074265480041504]
[null,0.00909489393234253]
[null,0.3696690797805786]
[null,0.7567880749702454]
[null,0.12658953666687012]
[null,0.01718515157699585]
[null,0.8142398595809937]
[null,0.42307573556900024]
[null,0.5965681076049805]
[null,0.6072494387626648]
[null,0.5752054452896118]
[null,0.6713374257087708]
[null,0.38294148445129395]
[null,0.24812930822372437]
[null,0.3869866132736206]
[null,0.9704146981239319]
[null,0.22013044357299805]
[null,0.20540398359298706]
[null,0.5151625871658325]
[null,0.5858867764472961]
[null,0.6392934322357178]
[null,0.4790734648704529]
[null,0.9597333669662476]
[null,0.7373276352882385]
[null,0.5944252014160156]
[null,0.2887117266654968]
[null,0.9402729272842407]
[null,0.7200101017951965]
[null,0.1152193546295166]
[null,0.6640123724937439]
[null,0.7520540952682495]
[null,0.019087374210357666]
[null,0.2179875373840332]
[null,0.6212870478630066]
[null,0.8802300691604614]
[null,0.6345594525337219]
[null,0.37157130241394043]
[null,0.6293773055076599]
[null,0.059221625328063965]
[null,0.03526788949966431]
[null,0.5759706497192383]

{"sheet":"Core Wksht","index":6,"n_rows":38,"n_cols":15,"rows_kept":38,"hidden":true,"merged":[[0,0,0,1],[0,3,0,4],[0,6,0,9],[0,12,0,13],[1,0,1,1],[1,2,1,3],[1,6,1,7],[1,8,1,9],[1,11,1,12],[1,13,1,14],[2,0,2,1],[2,2,2,3],[2,6,2,7],[2,8,2,9],[2,11,2,12],[2,13,2,14],[3,0,3,1],[3,2,3,3],[3,6,3,7],[3,8,3,9],[3,11,3,12],[3,13,3,14],[4,0,4,1],[4,2,4,3],[4,6,4,7],[4,8,4,9],[4,11,4,12],[4,13,4,14],[7,0,8,0],[11,6,11,8],[12,0,13,0],[16,6,16,8],[17,0,18,0],[21,6,21,8],[22,0,23,0],[26,6,26,8],[27,0,28,0],[31,6,31,8],[32,0,33,0],[36,6,36,8],[37,0,37,4],[37,6,37,8],[37,11,37,13],[38,11,38,13]]}
["TIME  IN:",null,null,"TIME OUT:",null,null,"CORE       WORKSHEET             "]
[{"$f":"'Core Stationing'!$F$5","v":"SP"},null,{"$f":"'Core Stationing'!$G$5","v":0},{"$nulls":3},"MDR/Rec.#",null,{"$f":"'Core Stationing'!$T$12","v":0},null,null,"LJD Mat Core"]
[{"$f":"'Core Stationing'!$J$5","v":"TH"},null,{"$f":"'Core Stationing'!$L$5","v":0},{"$nulls":3}," Mix Type",null,{"$f":"'Core Stationing'!$T$18","v":{"$error":"#N/A"}},null,null," Total  Tons"]
["Engineer",null,{"$f":"'Core Stationing'!$O$5","v":0},{"$nulls":3},"Date Paved",null,{"$f":"'Core Stationing'!$T$8","v":"00:00:00"},null,null,"Density Tons"]
["Contractor",null,{"$f":"'Core Stationing'!$G$6","v":0},{"$nulls":3},"Date Cored",null,{"$f":"'Core Stationing'!$T$10","v":"00:00:00"},null,null,"Misc. Tons"]
[null,null,"Thickness","AIR DRY","CORE/PAN",{"$nulls":5},"%  WATER",null,"AVE. ","MAX.","FINAL DENSITY"]
["LOT","CORE #","(mm)/in","CORE","(or dry wt.)","PAN ID.","PAN WT.","DRY WT.","SSD WT.","IMM. WT.","ABSORBED","Sp GRAV.","Sp GRAV.","GRAVITY","% 0F MAXIMUM "]
[{"$f":"'Core Stationing'!$B$42","v":1},{"$f":"'Core Stationing'!$C$42","v":1.1}]
[null,{"$f":"'Core Stationing'!$C$43","v":1.2}]
["COMP",{"$f":"B8","v":{"v":1.1,"d":"1.1C"}}]
["COMP",{"$f":"B9","v":{"v":1.2,"d":"1.2C"}}]
[]
[{"$f":"'Core Stationing'!$B$44","v":""},{"$f":"'Core Stationing'!$C$44","v":""}]
[null,{"$f":"'Core Stationing'!$C$45","v":""}]
["COMP",{"$f":"B13","v":""}]
["COMP",{"$f":"B14","v":""}]
[]
[{"$f":"'Core Stationing'!$B$46","v":""},{"$f":"'Core Stationing'!$C$46","v":""}]
[null,{"$f":"'Core Stationing'!$C$47","v":""}]
["COMP",{"$f":"B18","v":""}]
["COMP",{"$f":"B19","v":""}]
[]
[{"$f":"'Core Stationing'!$B$48","v":""},{"$f":"'Core Stationing'!$C$48","v":""}]
[null,{"$f":"'Core Stationing'!$C$49","v":""}]
["COMP",{"$f":"B23","v":""}]
["COMP",{"$f":"B24","v":""}]
[]
[{"$f":"'Core Stationing'!$B$50","v":""},{"$f":"'Core Stationing'!$C$50","v":""}]
[null,{"$f":"'Core Stationing'!$C$51","v":""}]
["COMP",{"$f":"B28","v":""}]
["COMP",{"$f":"B29","v":""}]
[]
[{"$f":"'Core Stationing'!$B$52","v":""},{"$f":"'Core Stationing'!$C$52","v":""}]
[null,{"$f":"'Core Stationing'!$C$53","v":""}]
["COMP",{"$f":"B33","v":""}]
["COMP",{"$f":"B34","v":""}]
[]
[" COMPANION  CORE,  TESTED BY Mn/DOT,  CHECK .030 TOLERANCE.",{"$nulls":4},"QC",{"$nulls":4},"QA"]

{"sheet":"Blank Core Wksht","index":7,"n_rows":38,"n_cols":15,"rows_kept":38,"hidden":true,"merged":[[0,0,0,1],[0,3,0,4],[0,6,0,9],[0,12,0,13],[1,0,1,1],[1,2,1,3],[1,6,1,7],[1,8,1,9],[1,11,1,12],[1,13,1,14],[2,0,2,1],[2,2,2,3],[2,6,2,7],[2,8,2,9],[2,11,2,12],[2,13,2,14],[3,0,3,1],[3,2,3,3],[3,6,3,7],[3,8,3,9],[3,11,3,12],[3,13,3,14],[4,0,4,1],[4,2,4,3],[4,6,4,7],[4,8,4,9],[4,11,4,12],[4,13,4,14],[7,0,8,0],[11,6,11,8],[12,0,13,0],[16,6,16,8],[17,0,18,0],[21,6,21,8],[22,0,23,0],[26,6,26,8],[27,0,28,0],[31,6,31,8],[32,0,33,0],[36,6,36,8],[37,0,37,4],[37,6,37,8],[37,11,37,13],[38,11,38,13]]}
["TIME  IN:",null,null,"TIME OUT:",null,null,"CORE       WORKSHEET             "]
[{"$f":"'Core Stationing'!$F$5","v":"SP"},{"$nulls":5},"MDR/Rec.#",{"$nulls":4},"LJD Mat Core"]
[{"$f":"'Core Stationing'!$J$5","v":"TH"},{"$nulls":5}," Mix Type",{"$nulls":4}," Total  Tons"]
["Engineer",{"$nulls":5},"Date Paved",{"$nulls":4},"Density Tons"]
["Contractor",{"$nulls":5},"Date Cored",{"$nulls":4},"Misc. Tons"]
[null,null,"Thickness","AIR DRY","CORE/PAN",{"$nulls":5},"%  WATER",null,"AVE. ","MAX.","FINAL DENSITY"]
["LOT","CORE #","(mm)/in","CORE","(or dry wt.)","PAN ID.","PAN WT.","DRY WT.","SSD WT.","IMM. WT.","ABSORBED","Sp GRAV.","Sp GRAV.","GRAVITY","% 0F MAXIMUM "]
[]
[]
["COMP"]
["COMP"]
[]
[]
[]
["COMP"]
["COMP"]
[]
[]
[]
["COMP"]
["COMP"]
[]
[]
[]
["COMP"]
["COMP"]
[]
[]
[]
["COMP"]
["COMP"]
[]
[]
[]
["COMP"]
["COMP"]
[]
[" COMPANION  CORE,  TESTED BY Mn/DOT,  CHECK .030 TOLERANCE.",{"$nulls":4},"QC",{"$nulls":4},"QA"]

{"sheet":"Core Stationing Blank","index":8,"n_rows":69,"n_cols":38,"rows_kept":69,"hidden":true,"merged":[[0,5,0,11],[1,5,1,11],[4,4,4,6],[4,7,4,8],[4,9,4,10],[4,12,4,13],[5,4,5,6],[5,7,5,8],[5,9,5,11],[7,8,7,10],[8,8,8,10],[10,8,10,9],[11,8,11,9],[12,8,12,9],[13,8,13,9],[14,8,14,9],[16,11,16,12],[17,7,17,8],[17,11,17,12],[18,7,18,8],[18,11,18,12],[19,11,19,12],[27,1,28,1],[29,1,30,1],[31,1,32,1],[33,1,34,1],[35,1,36,1],[37,1,38,1],[39,1,40,1],[41,1,42,1],[43,1,44,1],[45,1,46,1],[49,2,49,4],[50,2,50,3],[50,6,50,11],[51,2,51,3],[51,6,51,11],[52,2,52,3],[52,6,52,11],[53,2,53,3],[53,6,53,11],[54,2,54,3],[55,2,55,3],[56,2,56,3]]}
[{"$nulls":5},"Bituminous Core Stationing",{"$nulls":27},"Asphalt"]
[{"$nulls":5},{"$f":"IF(L8=\"Yes\",\"with Longitudinal Joint Density\",\"\")","v":""},{"$nulls":16},"Drop Down Box Lists",null,null,"County ",{"$nulls":4},"Show","Type","Mix","Binder",{"$nulls":3},"Density"]
[{"$nulls":3},"2013-04-11",{"$nulls":18},"Project","Road Type","LJD?","Number","County","Tons","Lots","Direction","Companion Cores?","of","Type","Grade","Lift","Direction","Lane","Determination"]
[{"$nulls":22},"SP","TH","Yes",null,null,0.1,0,{"$f":"IF(E10<F10,1,IF(E10=F10,0,IF(E10>F10,-1,\"NOT\")))","v":0},"All","Joint",null,null,"1st"]
[{"$nulls":3},"SP/SAP/CR",{"$nulls":3},"TH / CSAH / CR",{"$nulls":3},"Engineer",{"$nulls":10},"SAP","CSAH","No",1,"Aitkin",1,1,0,"1 per Lot",null,"SPWEA230","B= PG 58-28","2nd","NB","Mainline","No"]
[{"$nulls":3},"Contractor",{"$nulls":3},"Plant",{"$nulls":14},"CP","CR",null,2,"Anoka",601,2,0,"No","Confined","SPWEA240","C= PG 58-34","3rd","SB","Left","Yes"]
[{"$nulls":25},3,"Becker",1001,3,0,null,"Unconfined","SPWEA330","E= PG 64-28","4th","EB","Right"]
[null,"Lift","Direction","Lane","Begin Station","End Station","Lane Width",null,"Longitudinal Joint Density Project?",{"$nulls":3},"Date Paved",{"$nulls":12},4,"Beltrami",1601,4,0,null,null,"SPWEA340","F= PG 64-34","5th","WB","Left Center"]
[{"$nulls":4},"(ft)","(ft)","(ft)",null,"1% Density Reduction?",{"$nulls":3},"Day #",{"$nulls":12},5,"Benton",3601,5,0,null,null,"SPWEA430","L= PG 64-22","6th",null,"Right Center"]
[{"$nulls":12},"Date Cored",{"$nulls":12},6,"Big Stone",5001,6,0,null,null,"SPWEA440","A= PG 52-34","7th",null,"Center"]
[{"$nulls":8},"Total Density Tons Paved",{"$nulls":16},7,"Blue Earth",null,null,0,null,null,"SPWEA530","H= PG 70-28",null,null,"Left Shldr"]
[{"$nulls":8},"Tons Per Lot",{"$nulls":3},"MDR/Rec#",{"$nulls":12},8,"Brown",null,null,0,null,null,"SPWEA540",{"$nulls":3},"Right Shldr"]
[{"$nulls":8},"Lots Used for Calcuations",{"$nulls":3},"Bid Price/Ton",{"$nulls":12},9,"Carlton",null,null,0,null,null,"SPWEB230",{"$nulls":3},"Rt. Turn Lane"]
[{"$nulls":8},"Lots Required",{"$nulls":16},10,"Carver",{"$nulls":5},"SPWEB240",{"$nulls":3},"Lt. Turn Lane"]
[{"$nulls":8},"Over-ride # Lots",{"$nulls":16},11,"Cass",{"$nulls":5},"SPWEB330",{"$nulls":3},"Ramp"]
[{"$nulls":25},12,"Chippewa",{"$nulls":5},"SPWEB340",{"$nulls":3},"Loop"]
[{"$nulls":11},"Mix Spec",null,2360,{"$nulls":11},13,"Chisago",{"$nulls":5},"SPWEB430"]
[{"$nulls":7},"Test Companion",{"$nulls":3},"Mix Type",{"$nulls":13},14,"Clay",{"$nulls":5},"SPWEB440"]
[{"$nulls":7},"Cores Shown?",{"$nulls":3},"Asphalt Binder Grade",{"$nulls":13},15,"Clearwater",{"$nulls":5},"SPWEB530"]
[{"$nulls":11},"Total Area Paved (yd2)",{"$nulls":13},16,"Cook",{"$nulls":5},"SPWEB540"]
[]
[]
[{"$nulls":25},17,"Cottonwood",{"$nulls":5},"SPWEC230"]
[{"$nulls":9},"Left","Left","Left","Right","Right","Right",{"$nulls":10},18,"Crow Wing",{"$nulls":5},"SPWEC240"]
[null,null,"Mat",null,"Mat","Mat ","Mat","Mat","Test","LJD","LJD","LJD","LJD","LJD","LJD",{"$nulls":10},19,"Dakota",{"$nulls":5},"SPWEC330"]
[null,null,"Core","Name","Core","Station","Offset","Offset","Companion","Joint","Core","Offset","Joint","Core","Offset",{"$nulls":10},20,"Dodge",{"$nulls":5},"SPWEC340"]
[null,"Lot","ID",null,"Station","Random #","(ft.)","Random #","Core","Type","ID","(ft.)","Type","ID","(ft.)",{"$nulls":10},21,"Douglas",{"$nulls":5},"SPWEC430"]
[{"$nulls":25},22,"Faribault",{"$nulls":5},"SPWEC440"]
[{"$nulls":25},23,"Fillmore",{"$nulls":5},"SPWEC530"]
[{"$nulls":25},24,"Freeborn",{"$nulls":5},"SPWEC540"]
[{"$nulls":25},25,"Goodhue",{"$nulls":5},"SPNWA230"]
[{"$nulls":25},26,"Grant",{"$nulls":5},"SPNWA240"]
[{"$nulls":25},27,"Hennepin",{"$nulls":5},"SPNWA330"]
[{"$nulls":25},28,"Houston",{"$nulls":5},"SPNWA340"]
[{"$nulls":25},29,"Hubbard",{"$nulls":5},"SPNWA430"]
[{"$nulls":25},30,"Isanti",{"$nulls":5},"SPNWA440"]
[{"$nulls":25},31,"Itasca",{"$nulls":5},"SPNWA530"]
[{"$nulls":25},32,"Jackson",{"$nulls":5},"SPNWA540"]
[{"$nulls":25},33,"Kanabec",{"$nulls":5},"SPNWB230"]
[{"$nulls":25},34,"Kanndiyohi",{"$nulls":5},"SPNWB240"]
[{"$nulls":25},35,"Kittson",{"$nulls":5},"SPNWB330"]
[{"$nulls":25},36,"Koochiching",{"$nulls":5},"SPNWB340"]
[{"$nulls":25},37,"Lac qui Parle",{"$nulls":5},"SPNWB430"]
[{"$nulls":25},38,"Lake",{"$nulls":5},"SPNWB440"]
[{"$nulls":25},39,"Lake of the Woods",{"$nulls":5},"SPNWB530"]
[{"$nulls":25},40,"Le Sueur",{"$nulls":5},"SPNWB540"]
[{"$nulls":25},41,"Lincoln",{"$nulls":5},"SPNWC230"]
[{"$nulls":25},42,"Lyon",{"$nulls":5},"SPNWC240"]
[{"$nulls":25},43,"Mahnomen",{"$nulls":5},"SPNWC330"]
[null,null,"Daily Production",{"$nulls":3},"Remarks",{"$nulls":18},44,"Marshall",{"$nulls":5},"SPNWC340"]
[null,null,"English Tons",null,"Lot",{"$nulls":20},45,"Martin",{"$nulls":5},"SPNWC430"]
[null,null,"0-600",null,1,{"$nulls":20},46,"McLeod",{"$nulls":5},"SPNWC440"]
[null,null,"601-1000",null,2,{"$nulls":20},47,"Meeker",{"$nulls":5},"SPNWC530"]
[null,null,"1001-1600",null,3,{"$nulls":20},48,"Mille Lacs",{"$nulls":5},"SPNWC540"]
[null,null,"1601-2600",null,4,{"$nulls":20},49,"Morrison"]
[null,null,"2601-4600",null,5,{"$nulls":20},50,"Mower"]
[null,null,"> 4600*",null,6,null,"Street Inspector",{"$nulls":18},51,"Murray"]
[{"$nulls":25},52,"Nicollet"]
[null,null,"* Add one additional lot each additional 900 tons",{"$nulls":22},53,"Nobles"]
[{"$nulls":25},54,"Norman"]
[{"$nulls":25},55,"Olmsted"]
[{"$nulls":25},56,"Otter Tail"]
[{"$nulls":25},57,"Pennington"]
[{"$nulls":25},58,"Pine"]
[{"$nulls":25},59,"Pipestone"]
[{"$nulls":25},60,"Polk"]
[{"$nulls":25},61,"Pope"]
[{"$nulls":25},62,"Ramsey"]
[{"$nulls":25},63,"Red Lake"]

{"sheet":"Notes","index":9,"n_rows":87,"n_cols":5,"rows_kept":87,"merged":[[82,0,82,14]]}
[]
[null,"2009-05-05",null,"Problem:  Inspectors would like to have the option to hard code in the number of lots for the day"]
[{"$nulls":3},"Changed language in Core Stationing cell I15 from \"# of Additional Over-ride Lots\" to \"Over-ride # Lots\""]
[{"$nulls":3},"Modified logic in Core Stationing cell k13"]
[{"$nulls":3}," from =IF(K15>0,(VLOOKUP(K11,AB5:AC10,2)+K15),(VLOOKUP(K11,AB5:AC10,2)))"]
[{"$nulls":3},"to = if(((isnumber(k15))=true,k15,(vlookup(k11,AB5:AC10,2)))"]
[]
[null,"2009-05-13",null,"Problem:  If the same lane name is used in mutiple rows with gaps in the stationing, the spreadsheet may"]
[{"$nulls":4},"choose a core stationing in exception areas that are in the lanes specified."]
[{"$nulls":3},"Solution:","Created a row a unique letter to identify the lane names for calculation purposes.  These were inserted"]
[{"$nulls":4},"in \"Core Stationing\" E83:E92.  Then the formulas were adjusted in the subsiquent cells to included the column E.  "]
[{"$nulls":4},"Row 110 was added so the unique letter names are changed back to the user inputed names."]
[]
[{"$nulls":3},"Problem:","Would like three choices for if companion cores are tested.  (All, 1 per Lot, No) "]
[{"$nulls":3},"Solution:","Modified \"Core Stationing\" J19 to have the choices (All, 1 per Lot, No) instead of (Yes, No)"]
[{"$nulls":4},"Modified equation for cells I26:I37"]
[{"$nulls":4},"from =if($k$14>=1,(if(and($j$19=\"Yes\",$F123=\"Y\"),$F123,\"\"),\"\")"]
[{"$nulls":4},"to =if($k$14>=1,(if($J$19=\"All\",\"Y\",if(and($J$19=\"1 per Lot\",$F123=\"Y\"),$F123,\"\"))),\"\")"]
[]
[null,"2009-05-27",null,"Problem:","The drop down boxes are limiting for inputting data for inspectors (Lift, Direction, Lane) "]
[{"$nulls":3},"Solution:","Remove drop down boxes so description can be manually chosen."]
[{"$nulls":4},"Removed drop down (B10:B19)"]
[{"$nulls":4},"I have not determined a way in Excel to have a drop down box that can be manually overwritten."]
[]
[null,"2009-06-04",null,"Problem:","Cores were being randomly selected for mat cores from only the mat width -2 feet"]
[{"$nulls":3},"Solution:","Recoded equations so the entire mat can be randomly selected."]
[{"$nulls":3},"Changed equation in cells I168:I179"]
[]
[null,"2009-06-04",null,"Problem:","XX.2 cores were not being offset by if LJD core was in that lot."]
[{"$nulls":3},"Solution:","Inserted missing equations."]
[{"$nulls":3},"Copied equations into XX.2 missing cells in J168:L179"]
[]
[null,"2009-06-09",null,"Problem:","Non LJD projects were coded so that the cores were no closer than 1 foot from the edge of the mat (confiined or unconfined)"]
[{"$nulls":3},"Solution:","Reduced type of joint column to one, and recoded sheet so that unconfined and confined edges would have different calculations."]
[{"$nulls":4},"Reduced type of joint column to one (I26:I37)"]
[{"$nulls":4},"Coded Non LJD core logic by inserted columns J168:L179"]
[{"$nulls":4},"Recoded logic in columnP168:P179 to search for non LJD cores in column L instead of I"]
[]
[null,"2009-07-10",null,"Problem:","Needed a blank cores stationing sheet"]
[{"$nulls":3},"Solution:","Created tab \"Core Stationing Blank\" with all cell cleared"]
[]
[null,"2010-01-29",null,"Problem:","Type of joint pick list is only available once. It is needed for both edge cores."]
[{"$nulls":3},"Solution:","Copied pick list a second time are reformatted to put next to right and left edge cores."]
[]
[null,"2010-03-01",null,"Problem:","Field personnel would like cell N19 to display yd^2 instead of ft^2"]
[{"$nulls":3},"Solution:","Made change to display yd^2"]
[]
[null,"2011-06-27",null,"Problem:","Number of LJD core lots was not calculating correctly"]
[{"$nulls":3},"Solution:","Fixed formula in C155.  Instead of going off the number of lots, it will using the number of tons"]
[]
[{"$nulls":3},"Problem:","Extra LJD cores lots were being show when they did not exist"]
[{"$nulls":3},"Solution:","Fixed formula in cells S198:V205.  Incorrect cell references were being used"]
[]
[null,"2012-04-23",null,"Updated dates for 2012 and fixed formatting "]
[]
[null,"2012-08-13",null,"Reformatted Comments text box"]
[]
[null,"2012-04-11",null,"Added four input rows for paving locations"]
[{"$nulls":3},"Output will only display 8 to 10 density lots"]
[]
[]
[null,"2013-05-02",null,"Split Remarks box into individual lines"]
[]
[null,"2013-06-18",null,"Random Number generator was using same seed value, Inserted Randomize function to randomize the seed value for the Rnd function."]
[]
[null,"2013-06-21",null,"Unprotected Worksheet"]
[]
[null,"2013-12-26",null,"Modified formula in F161:F180 to make I-Pad compatible."]
[]
[null,"2015-04-03",null,"Added PMB binders to AC binder list"]
[]
[null,"2016-03-28",null,"Added MSCR binders to AC binder list (AH4:AH24)"]
[]
[null,"2017-04-11",null,"Added PG 64E-34 MSCR binder AC binder list (AH4:AH25)"]
[]
[null,"2019-08-01",null,"Changed functionality to have uniform naming conventions for lanes and lifts. Automatically calculates lane width. Option for custom offsets and lane widths."]
[]
[null,"2019-08-07",null,"Added \"Alignment Name\" Field"]
[]
[null,"2019-08-15",null,"Changed longitudinal joint core offsets from a relative 0.5 ft offset to actual calculated offsets "]
[]
[null,"2019-09-20",null,"Added 14 more input rows, reordered naming output, added alignment field to output"]
["Bitiminous Street Work book updates below"]
[null,"2021-09-30",null,"Added a lock button for Core Locations"]
[{"$nulls":3},"Fixed the logic in Cell H138, G139:G144 to include the entire table for vlookup functionality Core Locations"]
[{"$nulls":3},"Fixed table in “Drop Downs” to have correct “Add to Offset” value for 12R-20R (8’ R SHLD).  Value was 20, changed to 12"]
[{"$nulls":3},"Updated Mix Type drop down list on Data sheet to include all mix types included in Core Stationing v.7/22/2021"]

{"sheet":"Drop Downs","index":10,"n_rows":28,"n_cols":6,"rows_kept":28,"hidden":true}
[]
[null,"Lift","Direction","Centerline Offset","Lane Width","Add to Offset"]
[]
[null,1,"NB","12L-CL",12,-12]
[null,2,"SB","CL-12R",12,0]
[null,3,"EB","18L-CL",18,-18]
[null,4,"WB","CL-18R",18,0]
[null,5,null,"18L-6L",12,-18]
[null,6,null,"6R-18R",12,6]
[{"$nulls":3},"24L-12L",12,-24]
[{"$nulls":3},"12R-24R",12,12]
[{"$nulls":3},"36L-24L",12,-36]
[{"$nulls":3},"24R-36R",12,24]
[{"$nulls":3},"48L-36L",12,-48]
[{"$nulls":3},"36R-48R",12,36]
[{"$nulls":3},"6L-6R",12,-6]
[{"$nulls":3},"20L-12L (8' L SHLD)",8,-20]
[{"$nulls":3},"22L-12L (10' L SHLD)",10,-22]
[{"$nulls":3},"12R-20R (8' R SHLD)",8,12]
[{"$nulls":3},"12R-22R (10' R SHLD)",10,12]
[{"$nulls":3},"32L-24L (8' L SHLD)",8,-32]
[{"$nulls":3},"34L-24L (10' L SHLD)",10,-34]
[{"$nulls":3},"24R-32R (8' R SHLD)",8,24]
[{"$nulls":3},"24R-34R (10' R SHLD)",10,24]
[{"$nulls":3},"44L-34R (8' L SHLD)",8,-44]
[{"$nulls":3},"46L-36L (10' L SHLD)",10,-46]
[{"$nulls":3},"36R-44R (8' R SHLD)",8,36]
[{"$nulls":3},"36R-46R (10' R SHLD)",10,36]