{"text_format":"3","workbook":"xlsx","n_sheets":11,"sheets":["Data sheet","Street Report","Tape ","IC-106","Core Stationing","random numbers","Core Wksht","Blank Core Wksht","Core Stationing Blank","Notes","Drop Downs"],"not_rendered":{"images":1,"macros":1,"defined_names":36,"comments":3},"read":"whole","date_system":"1900"}

{"sheet":"Data sheet","index":0,"n_rows":110,"n_cols":56,"rows_kept":110,"merged":[[0,0,0,11],[1,0,1,11],[2,0,3,0],[2,1,3,1],[2,2,4,2],[2,3,3,3],[2,4,3,4],[2,5,5,6],[2,7,3,7],[2,8,3,8],[2,9,5,9],[2,10,3,10],[2,11,3,11],[4,0,5,0],[4,1,5,1],[4,3,5,3],[4,4,5,4],[4,7,5,7],[4,8,5,8],[4,10,5,10],[4,11,5,11],[6,0,13,1],[6,6,6,7],[7,6,7,7],[8,6,8,7],[9,6,9,7],[10,6,10,7],[11,6,11,7],[12,6,12,7],[13,6,13,7],[14,0,18,2],[15,6,15,7],[16,6,16,7],[17,6,17,7],[18,6,18,7],[19,5,19,8],[20,0,20,11],[22,9,22,10],[22,12,24,12],[23,9,23,10],[24,9,24,10],[25,9,25,10],[26,9,26,10],[27,9,27,10],[28,9,28,10],[29,9,29,10],[32,0,32,11],[32,24,32,25],[33,0,33,11],[34,0,35,11],[51,4,52,15],[53,4,53,12],[61,26,61,33],[62,18,62,24],[80,26,80,33],[83,4,83,5],[94,16,95,18],[99,4,99,5],[106,0,108,4],[106,5,108,8],[109,6,109,7]]}
["ONE WORKBOOK PER DAY PER MIX DESIGN"]
["BITUMINOUS STREET REPORT PROJECT DATA"]
["TH",null,null,"ENGINEER:",null,"ms",null,"PAVING CONTRACTOR:",null,null,"DATE:"]
[]
["SP",null,null,"CONTRACT:",{"$nulls":3},"PLANT IDENTIFICATION:",null,null,"REPORT#:"]
[null,null,{"$f":"A5","v":"SP"}]
["LIST ALL S.P.'S ASSOCIATED WITH CONTRACT",null,{"$f":"B5","v":0},"MDR/Rec#","SPEC.","MIX DESIGN","ITEM",null,"UNITS","Price Per Unit","LBS. PER CU FT","LBS PER SY.IN."]
[{"$nulls":11},{"$f":"K8/12*9","v":{"v":0,"d":"0.00"}}]
[{"$nulls":11},{"$f":"K9/12*9","v":{"v":0,"d":"0.00"}}]
[{"$nulls":11},{"v":0,"d":"0.00"}]
{"$rows_left_out":101}
{"sheet":"Street Report","index":1,"n_rows":71,"n_cols":22,"rows_kept":71,"merged":[[1,1,2,21],[3,1,3,4],[3,5,3,6],[3,8,3,9],[3,10,3,11],[3,15,3,16],[3,17,3,18],[3,20,3,21],[4,1,4,4],[4,5,4,6],[4,7,4,8],[4,11,4,12],[4,15,4,16],[4,17,4,18],[4,20,4,21],[5,1,5,4],[5,5,5,6],[5,7,6,15],[5,16,6,21],[6,1,6,4],[6,5,6,6],[7,5,7,6],[8,5,8,6],[9,5,9,6],[10,5,10,6],[11,5,11,6],[12,5,12,6],[13,5,13,6],[14,5,14,6],[15,5,15,6],[16,5,16,6],[17,5,17,6],[18,5,18,6],[19,5,19,6],[20,5,20,6],[21,5,21,6],[22,5,22,6],[23,5,23,6],[24,5,24,6],[25,5,25,6],[26,5,26,6],[27,5,27,6],[28,5,28,6],[29,5,29,6],[30,5,30,6],[31,5,31,6],[32,5,32,6],[33,5,33,6],[34,5,34,6],[35,5,35,6],[36,2,36,11],[36,12,36,16],[38,1,39,5],[38,7,39,21],[40,1,40,2],[40,4,40,5],[40,7,42,7],[40,8,42,8],[40,9,42,9],[40,10,42,10],[40,11,42,11],[40,12,42,12],[40,13,42,13],[40,14,42,14],[40,15,42,15],[40,16,42,16],[40,17,42,17],[40,18,42,18],[40,19,42,19],[40,20,42,20],[40,21,42,21],[41,1,41,2],[41,4,41,5],[42,1,42,2],[42,4,42,5],[43,1,43,2],[43,4,43,5],[46,1,46,5],[47,1,57,5],[58,1,61,8],[58,11,58,16],[59,9,60,9],[59,10,60,10],[59,11,60,11],[59,12,60,12],[59,16,59,17],[62,1,62,2],[62,4,62,5],[62,6,62,7],[63,1,63,2],[63,4,63,5],[63,6,63,7],[64,1,64,2],[64,4,64,5],[64,6,64,7],[65,1,65,2],[65,4,65,5],[65,6,65,7],[66,1,66,2],[66,4,66,5],[66,6,66,7],[66,16,66,18],[67,1,67,2],[67,4,67,5],[67,6,67,7],[68,1,68,2],[68,4,68,5],[68,6,68,7],[68,16,69,21],[69,1,69,2],[69,4,69,5],[69,6,69,7],[70,1,70,2],[70,4,70,5],[70,6,70,7],[70,16,70,21]]}
[]
[null,"DAILY STREET REPORT FOR BITUMINOUS PLANT MIX\nUSE SEPARATE DAILY STREET REPORT FOR EACH MIXTURE TYPE"]
[]
[null,"ENGINEER:",{"$nulls":3},{"$f":"'Data sheet'!E3","v":0},null,"ITEM:",{"$f":"IFERROR(VLOOKUP(L5,'Data sheet'!D8:L20,4,FALSE),\" \")","v":" "},{"$f":"IFERROR(VLOOKUP(I5,'Data sheet'!#REF!,7,FALSE),\" \")","v":" "},"CALCULATED YIELD (LBS. PER SY.IN.):",null,{"$f":"IFERROR((VLOOKUP(L5,'Data sheet'!D8:L20,8,FALSE)*0.75),\" \")","v":" "},"UNIT:",{"$f":"IFERROR(VLOOKUP(L5,'Data sheet'!D8:L20,6,FALSE),\" \")","v":" "},"WEATHER:",{"$nulls":3},"DATE:",{"$f":"'Data sheet'!L3","v":"00:00:00"}]
[null,"CONTRACT:",{"$nulls":3},{"$f":"'Data sheet'!E5","v":0},null,"MIX DESIGN:",null,{"$f":"IFERROR(VLOOKUP(L5,'Data sheet'!D8:L20,3,FALSE),\" \")","v":" "},"‼MDR/REC#:‼",null,null,"PRICE:",{"$f":"IFERROR(VLOOKUP(L5,'Data sheet'!D8:L20,7,FALSE),\" \")","v":" "},"TEMP:",{"$nulls":3},"REP#:",{"$f":"'Data sheet'!L5","v":0}]
[null,"PAVING CONTRACTOR:",{"$nulls":3},{"$f":"'Data sheet'!I3","v":0},null,"MAINLINE, TURNLANES, AND SHOULDERS OVER 6' WIDE\n(COMPACTION BY MAX. DENSITY)"]
[null,"PLANT INDENTIFICATION:",{"$nulls":3},{"$f":"'Data sheet'!I5","v":0}]
[null,"S.P.","ROUTE\nSYSTEM","ROUTE\nNO.","LIFT","LANE TYPE",null,"DIRECTION OF TRAVEL","STANDARD CENTERLINE OFFSET","CUSTOM OFFSET \nLEFT\n BOUNDARY \nEXAMPLE:           11L OR 12R","CUSTOM OFFSET RIGHT \nBOUNDARY\nEXAMPLE:            CL OR 20R","ALIGNMENT NAME\n(IF APPLICABLE)","BEGIN STATION","END\nSTATION","LANE WIDTH","CUSTOM LANE WIDTH","LENGTH\n(FT.)","AREA\n(S.Y.)","MIXTURE\nPLACED\n(TONS)","PLAN\nTHICKNESS\n(INCHES)","YIELD\n(LBS./S.Y.)\n(Ex2000/D)","OVER/\nUNDER\nRUN"]
[{"$nulls":14},{"$f":"IFERROR(VLOOKUP(I9,'Drop Downs'!$D$4:$E$28,2,FALSE),\" \")","v":" "},{"$f":"IFERROR('Data sheet'!Y64,\" \")","v":{"v":0,"d":"0.00"}},{"$f":"ABS(N9-M9)","v":0},{"$f":"IFERROR(IF(O9=\" \",(P9*Q9/9),(O9*Q9/9)),\" \")","v":0},null,null,{"$f":"IFERROR(S9*2000/R9/T9,\" \")","v":" "},{"$f":"IFERROR(S9-($M$4*R9*T9/2000),\" \")","v":" "}]
[{"$nulls":14},{"$f":"IFERROR(VLOOKUP(I10,'Drop Downs'!$D$4:$E$28,2,FALSE),\" \")","v":" "},{"$f":"IFERROR('Data sheet'!Y65,\" \")","v":{"v":0,"d":"0.00"}},{"$f":"ABS(N10-M10)","v":0},{"$f":"IFERROR(IF(O10=\" \",(P10*Q10/9),(O10*Q10/9)),\" \")","v":0},null,null,{"$f":"IFERROR(S10*2000/R10/T10,\" \")","v":" "}," "]
{"$rows_left_out":62}
{"sheet":"Tape ","index":2,"n_rows":101,"n_cols":31,"rows_kept":101,"merged":[[2,20,3,24],[3,3,3,6],[3,9,3,10],[4,9,4,10],[4,12,4,14],[4,20,4,24],[77,3,77,5],[77,7,77,9]]}
[]
[]
[null,"  S.P.: ",{"$f":"'Data sheet'!B5","v":0},"T.H.: ",{"$f":"'Data sheet'!B3","v":0},null,"REPORT #:",{"$f":"'Data sheet'!L5","v":0},null,"DATE: ",{"$f":"'Data sheet'!L3","v":"00:00:00"},{"$nulls":9},{"$f":"'Street Report'!Q69","v":0}]
[null,null,"TYPE OF MIXTURE: ",{"$f":"'Street Report'!I4","v":" "},{"$nulls":5},"SHEET TOTAL:",null,{"$f":"X76","v":{"v":1910,"d":"1910.00"}}]
[null,null,"STARTING LOAD # :",1,null,null,0,null,null,"OVERLOAD TOTAL:",null,{"$f":"SUM(E$7:E$76,I$7:I$76,M$7:M$76,Q$7:Q$76,U$7:U$76,Y$7:Y$76)","v":{"v":0,"d":"0.00"}},"STREET/PLANT WASTE:",{"$nulls":7},"STEET INSPECTOR "]
[null,"LOAD NO.","NET TONS","SUB TOTAL","OVERLOAD","LOAD NO.","NET TONS","SUB TOTAL","OVERLOAD","LOAD NO.","NET TONS","SUB TOTAL","OVERLOAD","LOAD NO.","NET TONS","SUB TOTAL","OVERLOAD","LOAD NO.","NET TONS","SUB TOTAL","OVERLOAD","LOAD NO.","NET TONS","SUB TOTAL","OVERLOAD"]
[null,{"$f":"D5","v":1},{"v":1910,"d":"1910.00"},{"$f":"C7","v":{"v":1910,"d":"1910.00"}},null,{"$f":"IF(B76=\" \",\" \",B76+1)","v":71},null,{"$f":"G7+D76","v":{"v":1910,"d":"1910.00"}},null,{"$f":"IF(F76=\" \",\" \",F76+1)","v":141},null,{"$f":"K7+H76","v":{"v":1910,"d":"1910.00"}},null,{"$f":"IF(J76=\" \",\" \",J76+1)","v":211},null,{"$f":"O7+L76","v":{"v":1910,"d":"1910.00"}},null,{"$f":"IF(N76=\" \",\" \",N76+1)","v":281},null,{"$f":"S7+P76","v":{"v":1910,"d":"1910.00"}},null,{"$f":"IF(R76=\" \",\" \",R76+1)","v":351},null,{"$f":"W7+T76","v":{"v":1910,"d":"1910.00"}}]
[null,{"$f":"IF(B7=\" \",\" \",B7+1)","v":2},null,{"$f":"D7+C8","v":{"v":1910,"d":"1910.00"}},null,{"$f":"IF(F7=\" \",\" \",F7+1)","v":72},null,{"$f":"H7+G8","v":{"v":1910,"d":"1910.00"}},null,{"$f":"IF(J7=\" \",\" \",J7+1)","v":142},null,{"$f":"L7+K8","v":{"v":1910,"d":"1910.00"}},null,{"$f":"IF(N7=\" \",\" \",N7+1)","v":212},null,{"$f":"P7+O8","v":{"v":1910,"d":"1910.00"}},null,{"$f":"IF(R7=\" \",\" \",R7+1)","v":282},null,{"$f":"T7+S8","v":{"v":1910,"d":"1910.00"}},null,{"$f":"IF(V7=\" \",\" \",V7+1)","v":352},null,{"$f":"X7+W8","v":{"v":1910,"d":"1910.00"}}]
[null,3,null,{"v":1910,"d":"1910.00"},null,73,null,{"v":1910,"d":"1910.00"},null,143,null,{"v":1910,"d":"1910.00"},null,213,null,{"v":1910,"d":"1910.00"},null,283,null,{"v":1910,"d":"1910.00"},null,353,null,{"v":1910,"d":"1910.00"}]
[null,4,null,{"v":1910,"d":"1910.00"},null,74,null,{"v":1910,"d":"1910.00"},null,144,null,{"v":1910,"d":"1910.00"},null,214,null,{"v":1910,"d":"1910.00"},null,284,null,{"v":1910,"d":"1910.00"},null,354,null,{"v":1910,"d":"1910.00"}]
{"$rows_left_out":69}
{"sheet":"IC-106","index":3,"n_rows":39,"n_cols":26,"rows_kept":39,"merged":[[2,4,7,9],[2,10,7,13],[8,1,10,1],[8,2,10,2],[8,3,8,13],[9,4,10,4],[9,5,10,5],[9,6,10,6],[9,7,10,7],[9,8,9,9],[9,10,10,10],[9,12,9,13],[11,25,13,29],[14,25,16,29]]}
[{"$nulls":3},"Minnesota Department of Transportation (MnDOT)",{"$nulls":12},"Start Row",null,"High Accuracy PMTP?"]
[{"$nulls":16},11]
[{"$nulls":4},"THIS IS NOT AN IC-106 FORM. THIS FORM ALLOWS THE USER TO COPY AND PAST DATA ONTO THE IC-106 FORM.",{"$nulls":5},"COPY CELLS D12 TO N39 AND PASTE \"VALUES\" ONTO PROJECT \nIC-106 FORM",{"$nulls":5},false]
[{"$nulls":16},false]
[]
[]
[]
[]
[null,"Data Lot Number","Filter Group Name","Inspector Input"]
[{"$nulls":3},"For overnight paving enter first day only","Route System","Route No.","Material","Lift","Do not include shoulders",null,"Divided Highway (Yes)","Divided Highways Only","Use ROVER to\ndetermine stations"]
{"$rows_left_out":30}
{"sheet":"Core Stationing","index":4,"n_rows":281,"n_cols":40,"rows_kept":281,"merged":[[0,7,0,13],[1,7,1,13],[4,6,4,8],[4,9,4,10],[4,11,4,12],[4,14,4,15],[5,6,5,8],[5,9,5,10],[5,11,5,13],[18,19,18,20],[23,14,24,14],[23,15,24,15],[23,16,24,16],[23,17,24,17],[33,15,33,16],[34,15,34,16],[35,15,35,16],[36,15,36,16],[41,1,42,1],[41,3,41,5],[42,3,42,5],[43,1,44,1],[43,3,43,5],[44,3,44,5],[45,1,46,1],[45,3,45,5],[46,3,46,5],[47,1,48,1],[47,3,47,5],[48,3,48,5],[49,1,50,1],[49,3,49,5],[50,3,50,5],[51,1,52,1],[51,3,51,5],[52,3,52,5],[53,1,54,1],[53,3,53,5],[54,3,54,5],[55,1,56,1],[55,3,55,5],[56,3,56,5],[57,1,58,1],[59,1,60,1],[62,1,62,3],[62,4,62,8],[62,10,68,14],[63,1,63,2],[63,4,66,9],[64,1,64,2],[65,1,65,2],[66,1,66,2],[67,1,67,2],[67,4,68,5],[67,6,68,9],[68,1,68,2],[69,1,69,2],[69,10,71,14],[69,15,71,18],[70,1,71,3],[72,9,75,18],[73,4,73,5],[74,4,74,5],[75,4,75,5],[76,4,76,5],[77,4,77,5],[78,4,78,5],[79,4,79,5],[80,4,80,5],[269,10,269,13]]}
["MN_DOT_AASHTOWare Project Support <AASHTOWareProjectSupport.DOT@state.mn.us>",{"$nulls":6},"Bituminous Core Stationing with Formatted Locations",{"$nulls":27},"Asphalt"]
[{"$nulls":7},{"$f":"IF(R8=\"Yes\",\"including Longitudinal Joint Density\",\"\")","v":"including Longitudinal Joint Density"},{"$nulls":16},"Drop Down Box Lists",null,null,"County ",{"$nulls":4},"Show","Type","Mix","Binder",null,null,"Lane","Density"]
[{"$nulls":5},"2019-09-20",{"$nulls":18},"Project","Road Type","LJD?","Number","County","Tons","Lots","Direction","Companion Cores?","of","Type","Grade","L","Direction","Type","Determination"]
[{"$nulls":24},"SP","TH","Yes",null,null,0.1,0,{"$f":"IF(J10<K10,1,IF(J10=K10,0,IF(J10>K10,-1,\"NOT\")))","v":0},"All","Joint",null,"A= PG 52-34","L1"]
[{"$nulls":5},{"$f":"'Data sheet'!A5","v":"SP"},{"$f":"'Data sheet'!B5","v":0},null,null,{"$f":"'Data sheet'!A3","v":"TH"},null,{"$f":"'Data sheet'!B3","v":0},null,"Engineer",{"$f":"'Data sheet'!E3","v":0},{"$nulls":9},"SAP","CSAH","No",1,"Aitkin",1,1,0,"1 per Lot",null,"SPWEA230","B= PG 58-28","L2","NB","Traffic Lane","No"]
[{"$nulls":5},"Contractor",{"$f":"'Data sheet'!I3","v":0},null,null,"Plant",null,{"$f":"'Data sheet'!I5","v":0},{"$nulls":12},"CP","CR",null,2,"Anoka",601,2,0,"No","Confined","SPWEA240","C= PG 58-34","L3","SB","Lt Shoulder","Yes"]
[{"$nulls":24},"MP","MSAH",null,3,"Becker",1001,3,0,null,"Unconfined","SPWEA330","E= PG 64-28","L4","EB","Lt Turn Lane 2"]
[null,"Route","Lift","Lane Type","Direction of Travel","Standard Centerline Offset","Custom Offset Left Boundary (Example: 11L, 12R)","Custom Offset Right Boundary (Example: CL, 20R)","Alignment Name\n(If Applicable)","Begin Station","End Station","Lane Width","Custom Lane Width",{"$nulls":3},"Longitudinal Joint Density Project?","Yes","Date Paved",{"$f":"'Data sheet'!L3","v":"00:00:00"},{"$nulls":5},"MS ",null,4,"Beltrami",1601,4,0,null,null,"SPWEA340","F= PG 64-34","L5","WB","Lt Turn Lane  "]
[{"$nulls":9},"(ft)","(ft)","(ft)",{"$nulls":4},"1% Density Reduction?","No","REPORT #",{"$f":"'Data sheet'!L5","v":0},{"$nulls":7},5,"Benton",2601,5,0,null,null,"SPWEA430","H= PG 70-28","L6",null,"Lt Lane"]
[null,{"$f":"'Street Report'!C9","v":0},{"$f":"'Street Report'!E9","v":0},{"$f":"'Street Report'!F9","v":0},{"$f":"'Street Report'!H9","v":0},{"$f":"'Street Report'!I9","v":0},{"$f":"'Street Report'!J9","v":0},{"$f":"IFERROR('Street Report'!K9,\" \")","v":0},{"$f":"'Street Report'!L9","v":0},{"$f":"'Street Report'!M9","v":{"v":0,"d":"0+00"}},{"$f":"'Street Report'!N9","v":{"v":0,"d":"0+00"}},{"$f":"'Street Report'!O9","v":" "},{"$f":"'Street Report'!P9","v":{"v":0,"d":"0.00"}},{"$nulls":5},"Date Cored",{"$nulls":8},6,"Big Stone",4601,6,0,null,null,"SPWEA440","I= PG 70-34","L7",null,"Lt Center"]
{"$rows_left_out":263}
{"sheet":"random numbers","index":5,"n_rows":220,"n_cols":2,"rows_kept":220,"hidden":true}
[{"v":0.9121362566947937,"d":"0.912"},0.1579994559288025]
[{"v":0.8455883264541626,"d":"0.846"},0.29685676097869873]
[{"v":0.6253255009651184,"d":"0.625"},0.88028484582901]
[{"v":0.5516932010650635,"d":"0.552"},0.13000059127807617]
[{"v":0.6939615607261658,"d":"0.694"},0.11527413129806519]
[{"v":0.7983149290084839,"d":"0.798"},0.42503273487091064]
[{"v":0.33092743158340454,"d":"0.331"},0.49575692415237427]
[{"v":0.5298275947570801,"d":"0.530"},0.5491635799407959]
[{"v":0.5266024470329285,"d":"0.527"},0.388943612575531]
[{"v":0.8018571138381958,"d":"0.802"},0.8696035146713257]
{"$rows_left_out":211}
{"sheet":"Core Wksht","index":6,"n_rows":38,"n_cols":15,"rows_kept":38,"hidden":true,"merged":[[0,0,0,1],[0,3,0,4],[0,6,0,9],[0,12,0,13],[1,0,1,1],[1,2,1,3],[1,6,1,7],[1,8,1,9],[1,11,1,12],[1,13,1,14],[2,0,2,1],[2,2,2,3],[2,6,2,7],[2,8,2,9],[2,11,2,12],[2,13,2,14],[3,0,3,1],[3,2,3,3],[3,6,3,7],[3,8,3,9],[3,11,3,12],[3,13,3,14],[4,0,4,1],[4,2,4,3],[4,6,4,7],[4,8,4,9],[4,11,4,12],[4,13,4,14],[7,0,8,0],[11,6,11,8],[12,0,13,0],[16,6,16,8],[17,0,18,0],[21,6,21,8],[22,0,23,0],[26,6,26,8],[27,0,28,0],[31,6,31,8],[32,0,33,0],[36,6,36,8],[37,0,37,4],[37,6,37,8],[37,11,37,13],[38,11,38,13]]}
["TIME  IN:",null,null,"TIME OUT:",null,null,"CORE       WORKSHEET             "]
[{"$f":"'Core Stationing'!$F$5","v":"SP"},null,{"$f":"'Core Stationing'!$G$5","v":0},{"$nulls":3},"MDR/Rec.#",null,{"$f":"'Core Stationing'!$T$12","v":0},null,null,"LJD Mat Core"]
[{"$f":"'Core Stationing'!$J$5","v":"TH"},null,{"$f":"'Core Stationing'!$L$5","v":0},{"$nulls":3}," Mix Type",null,{"$f":"'Core Stationing'!$T$18","v":{"$error":"#N/A"}},null,null," Total  Tons"]
["Engineer",null,{"$f":"'Core Stationing'!$O$5","v":0},{"$nulls":3},"Date Paved",null,{"$f":"'Core Stationing'!$T$8","v":"00:00:00"},null,null,"Density Tons"]
["Contractor",null,{"$f":"'Core Stationing'!$G$6","v":0},{"$nulls":3},"Date Cored",null,{"$f":"'Core Stationing'!$T$10","v":"00:00:00"},null,null,"Misc. Tons"]
[null,null,"Thickness","AIR DRY","CORE/PAN",{"$nulls":5},"%  WATER",null,"AVE. ","MAX.","FINAL DENSITY"]
["LOT","CORE #","(mm)/in","CORE","(or dry wt.)","PAN ID.","PAN WT.","DRY WT.","SSD WT.","IMM. WT.","ABSORBED","Sp GRAV.","Sp GRAV.","GRAVITY","% 0F MAXIMUM "]
[{"$f":"'Core Stationing'!$B$42","v":1},{"$f":"'Core Stationing'!$C$42","v":1.1}]
[null,{"$f":"'Core Stationing'!$C$43","v":1.2}]
["COMP",{"$f":"B8","v":{"v":1.1,"d":"1.1C"}}]
{"$rows_left_out":29}
{"sheet":"Blank Core Wksht","index":7,"n_rows":38,"n_cols":15,"rows_kept":38,"hidden":true,"merged":[[0,0,0,1],[0,3,0,4],[0,6,0,9],[0,12,0,13],[1,0,1,1],[1,2,1,3],[1,6,1,7],[1,8,1,9],[1,11,1,12],[1,13,1,14],[2,0,2,1],[2,2,2,3],[2,6,2,7],[2,8,2,9],[2,11,2,12],[2,13,2,14],[3,0,3,1],[3,2,3,3],[3,6,3,7],[3,8,3,9],[3,11,3,12],[3,13,3,14],[4,0,4,1],[4,2,4,3],[4,6,4,7],[4,8,4,9],[4,11,4,12],[4,13,4,14],[7,0,8,0],[11,6,11,8],[12,0,13,0],[16,6,16,8],[17,0,18,0],[21,6,21,8],[22,0,23,0],[26,6,26,8],[27,0,28,0],[31,6,31,8],[32,0,33,0],[36,6,36,8],[37,0,37,4],[37,6,37,8],[37,11,37,13],[38,11,38,13]]}
["TIME  IN:",null,null,"TIME OUT:",null,null,"CORE       WORKSHEET             "]
[{"$f":"'Core Stationing'!$F$5","v":"SP"},{"$nulls":5},"MDR/Rec.#",{"$nulls":4},"LJD Mat Core"]
[{"$f":"'Core Stationing'!$J$5","v":"TH"},{"$nulls":5}," Mix Type",{"$nulls":4}," Total  Tons"]
["Engineer",{"$nulls":5},"Date Paved",{"$nulls":4},"Density Tons"]
["Contractor",{"$nulls":5},"Date Cored",{"$nulls":4},"Misc. Tons"]
[null,null,"Thickness","AIR DRY","CORE/PAN",{"$nulls":5},"%  WATER",null,"AVE. ","MAX.","FINAL DENSITY"]
["LOT","CORE #","(mm)/in","CORE","(or dry wt.)","PAN ID.","PAN WT.","DRY WT.","SSD WT.","IMM. WT.","ABSORBED","Sp GRAV.","Sp GRAV.","GRAVITY","% 0F MAXIMUM "]
[]
[]
["COMP"]
{"$rows_left_out":29}
{"sheet":"Core Stationing Blank","index":8,"n_rows":69,"n_cols":38,"rows_kept":69,"hidden":true,"merged":[[0,5,0,11],[1,5,1,11],[4,4,4,6],[4,7,4,8],[4,9,4,10],[4,12,4,13],[5,4,5,6],[5,7,5,8],[5,9,5,11],[7,8,7,10],[8,8,8,10],[10,8,10,9],[11,8,11,9],[12,8,12,9],[13,8,13,9],[14,8,14,9],[16,11,16,12],[17,7,17,8],[17,11,17,12],[18,7,18,8],[18,11,18,12],[19,11,19,12],[27,1,28,1],[29,1,30,1],[31,1,32,1],[33,1,34,1],[35,1,36,1],[37,1,38,1],[39,1,40,1],[41,1,42,1],[43,1,44,1],[45,1,46,1],[49,2,49,4],[50,2,50,3],[50,6,50,11],[51,2,51,3],[51,6,51,11],[52,2,52,3],[52,6,52,11],[53,2,53,3],[53,6,53,11],[54,2,54,3],[55,2,55,3],[56,2,56,3]]}
[{"$nulls":5},"Bituminous Core Stationing",{"$nulls":27},"Asphalt"]
[{"$nulls":5},{"$f":"IF(L8=\"Yes\",\"with Longitudinal Joint Density\",\"\")","v":""},{"$nulls":16},"Drop Down Box Lists",null,null,"County ",{"$nulls":4},"Show","Type","Mix","Binder",{"$nulls":3},"Density"]
[{"$nulls":3},"2013-04-11",{"$nulls":18},"Project","Road Type","LJD?","Number","County","Tons","Lots","Direction","Companion Cores?","of","Type","Grade","Lift","Direction","Lane","Determination"]
[{"$nulls":22},"SP","TH","Yes",null,null,0.1,0,{"$f":"IF(E10<F10,1,IF(E10=F10,0,IF(E10>F10,-1,\"NOT\")))","v":0},"All","Joint",null,null,"1st"]
[{"$nulls":3},"SP/SAP/CR",{"$nulls":3},"TH / CSAH / CR",{"$nulls":3},"Engineer",{"$nulls":10},"SAP","CSAH","No",1,"Aitkin",1,1,0,"1 per Lot",null,"SPWEA230","B= PG 58-28","2nd","NB","Mainline","No"]
[{"$nulls":3},"Contractor",{"$nulls":3},"Plant",{"$nulls":14},"CP","CR",null,2,"Anoka",601,2,0,"No","Confined","SPWEA240","C= PG 58-34","3rd","SB","Left","Yes"]
[{"$nulls":25},3,"Becker",1001,3,0,null,"Unconfined","SPWEA330","E= PG 64-28","4th","EB","Right"]
[null,"Lift","Direction","Lane","Begin Station","End Station","Lane Width",null,"Longitudinal Joint Density Project?",{"$nulls":3},"Date Paved",{"$nulls":12},4,"Beltrami",1601,4,0,null,null,"SPWEA340","F= PG 64-34","5th","WB","Left Center"]
[{"$nulls":4},"(ft)","(ft)","(ft)",null,"1% Density Reduction?",{"$nulls":3},"Day #",{"$nulls":12},5,"Benton",3601,5,0,null,null,"SPWEA430","L= PG 64-22","6th",null,"Right Center"]
[{"$nulls":12},"Date Cored",{"$nulls":12},6,"Big Stone",5001,6,0,null,null,"SPWEA440","A= PG 52-34","7th",null,"Center"]
{"$rows_left_out":60}
{"sheet":"Notes","index":9,"n_rows":87,"n_cols":5,"rows_kept":87,"merged":[[82,0,82,14]]}
[]
[null,"2009-05-05",null,"Problem:  Inspectors would like to have the option to hard code in the number of lots for the day"]
[{"$nulls":3},"Changed language in Core Stationing cell I15 from \"# of Additional Over-ride Lots\" to \"Over-ride # Lots\""]
[{"$nulls":3},"Modified logic in Core Stationing cell k13"]
[{"$nulls":3}," from =IF(K15>0,(VLOOKUP(K11,AB5:AC10,2)+K15),(VLOOKUP(K11,AB5:AC10,2)))"]
[{"$nulls":3},"to = if(((isnumber(k15))=true,k15,(vlookup(k11,AB5:AC10,2)))"]
[]
[null,"2009-05-13",null,"Problem:  If the same lane name is used in mutiple rows with gaps in the stationing, the spreadsheet may"]
[{"$nulls":4},"choose a core stationing in exception areas that are in the lanes specified."]
[{"$nulls":3},"Solution:","Created a row a unique letter to identify the lane names for calculation purposes.  These were inserted"]
{"$rows_left_out":78}
{"sheet":"Drop Downs","index":10,"n_rows":28,"n_cols":6,"rows_kept":28,"hidden":true}
[]
[null,"Lift","Direction","Centerline Offset","Lane Width","Add to Offset"]
[]
[null,1,"NB","12L-CL",12,-12]
[null,2,"SB","CL-12R",12,0]
[null,3,"EB","18L-CL",18,-18]
[null,4,"WB","CL-18R",18,0]
[null,5,null,"18L-6L",12,-18]
[null,6,null,"6R-18R",12,6]
[{"$nulls":3},"24L-12L",12,-24]
{"$rows_left_out":18}