{"text_format":"1","workbook":"xlsx","n_sheets":91,"sheets":["POSTS-MA","SEQ-PSTAB","SEQ-4Temp","TOC","POSTS25","POSTS30","ESGNPOSTS","POSTSPACING","PICILINKS","ACTIVITIES","CS&I","CSIGN","CINS","CSAL","CREM","DREM","D REM PANEL","DSIGN","DINS","DS&I","DSAL","MASTARM","DELINEATOR","MARKER","DELS&I","DELREM","REF SIGN","SAL REF SIGN","REF SIGN S&I","BRIDGE NO","PU3LB","OL","S&I SPEC","A REM FOOT","SIGN PANELS TYPE A EXTRUDED","AEXTRM","AEXTSA","APSTMOD","AREM","AS&IHP","ASAL","ASIGNHP","SIGN PANELS TYPE A","ASPNLIN","ASPNLOL","ASPNLSAL","ASPNLSAW","ANOTES","AFF","A REM PANEL","AKP","EA","EAOL","EAREM","EAEXTFI","EOREM","EO","EOOL","EO EXT PAN SECT","ESALINS","EO SAW","OH REM","OH SAL PN","OHREPOSPNL","OH BTQ","OH B","S & I_OH B","OH OL","OH INSPN","SIGN PANELS TYPE OH","OH ID ","OH EXT REM","OH REMPAN","OH SAW","OH PMP","OH PMP MOD","BMST","SIGN PANELS TYPE OH (EXT PAN )","REMOVE EXT PANEL SECT","OH REM FOOT","OH SGN SUP CANT","OH SIGN SUP BRIDGE","OH REM WKWY","OH REM LT SYS","safety cable","REMOVE BRIDGE MTD OH LIGHT SYST","SIGN CODES","SEQ-4Copy","OLD DELIN-retired","Sheet3","Sheet1"],"not_rendered":{"charts":0,"images":16,"macros":1,"external_links":0,"defined_names":112,"comments":57,"pivot_tables":0},"unopened":[],"bounds":{"document_bytes":16777216,"sheet_cells":100000,"rows_first":2000,"rows_last":500,"rows_between":2000,"halvings":0,"cell_chars":16384,"cell_head_chars":4096},"cells_cut":0,"cells_raw":0,"read":"whole","date_system":"1900"}

{"sheet":"POSTS-MA","index":0,"n_rows":279,"n_cols":22,"rows_kept":279,"cut":false,"hidden":true,"merged":[[1,1,1,4],[3,1,3,2],[2,3,2,4]]}
[]
[null,"STRUCTURAL DETAILS FOR SIGNAL MAST ARM MOUNTED SIGNS"]
[null,"HEIGHT ","LENGTH","STIFFENER"]
[null,"INCH",null,"QTY","SPACING"]
[null,24,24,2,{"$f":"IF(D5=\"X\",\"X\",mastarmspace(C5,D5))","v":12},{"$f":"(C5-((D5-1)*E5))/2","v":6},null,null,null,2,{"$f":"J5+1","v":3},4,5,6,7,8,9,10,11,12,13,14]
[null,24,{"$f":"C5+6","v":30},2,18,6,null,null,2,{"$f":"mastarmposts($I6*12,J$5*12,MAH,MAW,MAQ)","v":"2"},{"$f":"mastarmposts($I6*12,K$5*12,MAH,MAW,MAQ)","v":"2"},"2","3","3","3","4","4","4","5","5","5","5"]
[null,24,36,2,24,6,null,null,3,"2","2","2","3","3","3","4","4","5","5","5","5","5"]
[null,24,42,2,30,6,null,null,4,"2","2","2","3","3","3","4","4","5","5","5","5","6"]
[null,24,48,2,36,6,null,null,5,"2","2","2","3","4","4","5","5","5","5","5","5","6"]
[null,24,54,3,21,6,null,null,6,"X","X","2","3","4","4","5","5","5","5","5","5","6"]
[null,24,60,3,24,6,null,null,7,"X","X","X","4","4","5","5","5","5","5","5","5","6"]
[null,24,66,3,27,6]
[null,24,72,3,30,6,null,null,null,2,{"$f":"J13+1","v":3},4,5,6,7,8,9,10,11,12,13,14]
[null,24,78,3,33,6,null,null,2,{"$f":"mastarmposts($I14*12,J$5*12,MAH,MAW,MAS)","v":"12"},"24","36","24","30","36","27","30","36","30","33","36","36"]
[null,24,84,3,36,6,null,null,3,"12","24","36","24","30","36","27","30","27","30","33","36","36"]
[null,24,90,4,24,9,null,null,4,"12","24","36","24","30","36","27","30","27","30","33","36","30"]
[null,24,96,4,27,7.5,null,null,5,"12","24","36","24","18","24","21","24","27","30","33","36","30"]
[null,24,102,4,30,6,null,null,6,"X","X","36","24","18","24","21","24","27","30","33","36","30"]
[null,24,108,4,30,9,null,null,7,"X","X","X","15","18","18","21","24","27","30","33","36","30"]
[null,24,114,4,33,7.5]
[null,24,120,4,36,6]
[null,24,126,5,27,9]
[null,24,132,5,30,6]
[null,24,138,5,30,9]
[null,24,144,5,33,6]
[null,24,150,5,33,9]
[null,24,156,5,36,6]
[null,24,162,5,36,9]
[null,24,168,5,36,12]
[null,30,24,2,12,6]
[null,30,{"$f":"C30+6","v":30},2,18,6]
[null,30,36,2,24,6]
[null,30,42,2,30,6]
[null,30,48,2,36,6]
[null,30,54,3,21,6]
[null,30,60,3,24,6]
[null,30,66,3,27,6]
[null,30,72,3,30,6]
[null,30,78,3,33,6]
[null,30,84,3,36,6]
[null,30,90,4,24,9]
[null,30,96,4,27,7.5]
[null,30,102,4,30,6]
[null,30,108,4,30,9]
[null,30,114,5,24,9]
[null,30,120,5,27,6]
[null,30,126,5,27,9]
[null,30,132,5,30,6]
[null,30,138,5,30,9]
[null,30,144,5,33,6]
[null,30,150,5,33,9]
[null,30,156,5,36,6]
[null,30,162,5,36,9]
[null,30,168,5,36,12]
[null,36,24,2,12,6]
[null,36,{"$f":"C55+6","v":30},2,18,6]
[null,36,36,2,24,6]
[null,36,42,2,30,6]
[null,36,48,2,36,6]
[null,36,54,3,21,6]
[null,36,60,3,24,6]
[null,36,66,3,27,6]
[null,36,72,3,30,6]
[null,36,78,3,33,6]
[null,36,84,3,36,6]
[null,36,90,4,24,9]
[null,36,96,4,27,7.5]
[null,36,102,4,30,6]
[null,36,108,4,{"$f":"IF(D69=\"X\",\"X\",mastarmspace(C69,D69))","v":30},{"$f":"(C69-((D69-1)*E69))/2","v":9}]
[null,36,114,5,24,9]
[null,36,120,5,27,6]
[null,36,126,5,27,9]
[null,36,132,5,30,6]
[null,36,138,5,30,9]
[null,36,144,5,33,6]
[null,36,150,5,33,9]
[null,36,156,5,36,6]
[null,36,162,5,36,9]
[null,36,168,5,36,12]
[null,42,24,2,12,6]
[null,42,{"$f":"C80+6","v":30},2,18,6]
[null,42,36,2,24,6]
[null,42,42,2,30,6]
[null,42,48,2,36,6]
[null,42,54,3,21,6]
[null,42,60,3,24,6]
[null,42,66,3,27,6]
[null,42,72,3,30,6]
[null,42,78,3,33,6]
[null,42,84,3,36,6]
[null,42,90,4,24,9]
[null,42,96,4,27,7.5]
[null,42,102,4,30,6]
[null,42,108,4,30,9]
[null,42,114,5,24,9]
[null,42,120,5,27,6]
[null,42,126,5,27,9]
[null,42,132,5,30,6]
[null,42,138,5,30,9]
[null,42,144,5,33,6]
[null,42,150,5,33,9]
[null,42,156,5,36,6]
[null,42,162,6,30,6]
[null,42,168,6,30,9]
[null,48,24,2,12,6]
[null,48,{"$f":"C105+6","v":30},2,18,6]
[null,48,36,2,24,6]
[null,48,42,2,30,6]
[null,48,48,2,36,6]
[null,48,54,3,21,6]
[null,48,60,3,24,6]
[null,48,66,3,27,6]
[null,48,72,3,30,6]
[null,48,78,3,33,6]
[null,48,84,3,36,6]
[null,48,90,4,24,9]
[null,48,96,4,27,7.5]
[null,48,102,4,30,6]
[null,48,108,4,30,9]
[null,48,114,5,24,9]
[null,48,120,5,27,6]
[null,48,126,5,27,9]
[null,48,132,5,30,6]
[null,48,138,5,30,9]
[null,48,144,5,33,6]
[null,48,150,5,33,9]
[null,48,156,5,36,6]
[null,48,162,6,30,6]
[null,48,168,6,30,9]
[null,54,24,2,12,6]
[null,54,{"$f":"C130+6","v":30},2,18,6]
[null,54,36,2,24,6]
[null,54,42,2,{"$f":"IF(D133=\"X\",\"X\",mastarmspace(C133,D133))","v":30},{"$f":"(C133-((D133-1)*E133))/2","v":6}]
[null,54,48,2,36,6]
[null,54,54,3,21,6]
[null,54,60,3,24,6]
[null,54,66,4,18,6]
[null,54,72,4,18,9]
[null,54,78,4,21,7.5]
[null,54,84,4,24,6]
[null,54,90,5,18,9]
[null,54,96,5,21,6]
[null,54,102,5,21,9]
[null,54,108,5,24,6]
[null,54,114,5,24,9]
[null,54,120,5,27,6]
[null,54,126,5,27,9]
[null,54,132,5,30,6]
[null,54,138,5,30,9]
[null,54,144,5,33,6]
[null,54,150,5,33,9]
[null,54,156,5,36,6]
[null,54,162,6,30,6]
[null,54,168,6,30,9]
[null,60,24,2,12,6]
[null,60,{"$f":"C155+6","v":30},2,18,6]
[null,60,36,2,24,6]
[null,60,42,2,30,6]
[null,60,48,2,36,6]
[null,60,54,3,21,6]
[null,60,60,3,24,6]
[null,60,66,4,18,6]
[null,60,72,4,18,9]
[null,60,78,4,21,7.5]
[null,60,84,4,24,6]
[null,60,90,5,18,9]
[null,60,96,5,21,6]
[null,60,102,5,21,9]
[null,60,108,5,24,6]
[null,60,114,5,24,9]
[null,60,120,5,27,6]
[null,60,126,5,27,9]
[null,60,132,5,30,6]
[null,60,138,5,30,9]
[null,60,144,5,33,6]
[null,60,150,5,33,9]
[null,60,156,5,36,6]
[null,60,162,6,30,6]
[null,60,168,6,30,9]
[null,66,24,"X","X",{"$error":"#VALUE!"}]
[null,66,{"$f":"C180+6","v":30},"X","X",{"$error":"#VALUE!"}]
[null,66,36,"X","X",{"$error":"#VALUE!"}]
[null,66,42,2,30,6]
[null,66,48,2,36,6]
[null,66,54,3,21,6]
[null,66,60,3,24,6]
[null,66,66,4,18,6]
[null,66,72,4,18,9]
[null,66,78,4,21,7.5]
[null,66,84,4,24,6]
[null,66,90,5,18,9]
[null,66,96,5,21,6]
[null,66,102,5,21,9]
[null,66,108,5,24,6]
[null,66,114,5,24,9]
[null,66,120,5,27,6]
[null,66,126,5,{"$f":"IF(D197=\"X\",\"X\",mastarmspace(C197,D197))","v":27},{"$f":"(C197-((D197-1)*E197))/2","v":9}]
[null,66,132,5,30,6]
[null,66,138,5,30,9]
[null,66,144,5,33,6]
[null,66,150,5,33,9]
[null,66,156,5,36,6]
[null,66,162,6,30,6]
[null,66,168,6,30,9]
[null,72,24,"X","X",{"$error":"#VALUE!"}]
[null,72,{"$f":"C205+6","v":30},"X","X",{"$error":"#VALUE!"}]
[null,72,36,"X","X",{"$error":"#VALUE!"}]
[null,72,42,2,30,6]
[null,72,48,2,36,6]
[null,72,54,3,21,6]
[null,72,60,3,24,6]
[null,72,66,4,18,6]
[null,72,72,4,18,9]
[null,72,78,4,21,7.5]
[null,72,84,4,24,6]
[null,72,90,5,18,9]
[null,72,96,5,21,6]
[null,72,102,5,21,9]
[null,72,108,5,24,6]
[null,72,114,5,24,9]
[null,72,120,5,27,6]
[null,72,126,5,27,9]
[null,72,132,5,30,6]
[null,72,138,5,30,9]
[null,72,144,5,33,6]
[null,72,150,5,33,9]
[null,72,156,5,36,6]
[null,72,162,6,30,6]
[null,72,168,6,30,9]
[null,78,24,"X","X",{"$error":"#VALUE!"}]
[null,78,{"$f":"C230+6","v":30},"X","X",{"$error":"#VALUE!"}]
[null,78,36,"X","X",{"$error":"#VALUE!"}]
[null,78,42,"X","X",{"$error":"#VALUE!"}]
[null,78,48,"X","X",{"$error":"#VALUE!"}]
[null,78,54,4,12,9]
[null,78,60,4,15,7.5]
[null,78,66,4,18,6]
[null,78,72,4,18,9]
[null,78,78,4,21,7.5]
[null,78,84,4,24,6]
[null,78,90,4,24,9]
[null,78,96,4,27,7.5]
[null,78,102,5,21,9]
[null,78,108,5,24,6]
[null,78,114,5,24,9]
[null,78,120,5,27,6]
[null,78,126,5,27,9]
[null,78,132,5,30,6]
[null,78,138,5,30,9]
[null,78,144,5,33,6]
[null,78,150,5,33,9]
[null,78,156,5,36,6]
[null,78,162,6,30,6]
[null,78,168,6,30,9]
[null,84,24,"X","X",{"$error":"#VALUE!"}]
[null,84,{"$f":"C255+6","v":30},"X","X",{"$error":"#VALUE!"}]
[null,84,36,"X","X",{"$error":"#VALUE!"}]
[null,84,42,"X","X",{"$error":"#VALUE!"}]
[null,84,48,"X","X",{"$error":"#VALUE!"}]
[null,84,54,4,12,9]
[null,84,60,4,{"$f":"IF(D261=\"X\",\"X\",mastarmspace(C261,D261))","v":15},{"$f":"(C261-((D261-1)*E261))/2","v":7.5}]
[null,84,66,4,18,6]
[null,84,72,4,18,9]
[null,84,78,5,15,9]
[null,84,84,5,18,6]
[null,84,90,5,18,9]
[null,84,96,5,21,6]
[null,84,102,5,21,9]
[null,84,108,5,24,6]
[null,84,114,5,24,9]
[null,84,120,5,27,6]
[null,84,126,5,27,9]
[null,84,132,5,30,6]
[null,84,138,5,30,9]
[null,84,144,5,33,6]
[null,84,150,5,33,9]
[null,84,156,5,36,6]
[null,84,162,6,30,6]
[null,84,168,6,30,9]

{"sheet":"SEQ-PSTAB","index":1,"n_rows":193,"n_cols":12,"rows_kept":193,"cut":false,"hidden":false,"merged":[[0,1,0,2],[1,1,1,2],[2,1,2,2],[0,9,0,13],[1,9,1,13],[2,9,2,13],[4,9,4,10],[191,1,191,10],[192,1,192,10],[186,1,186,10],[6,9,6,10],[7,9,7,10],[5,2,7,2],[5,9,5,10],[171,3,171,4],[5,3,5,4],[6,3,6,4],[7,3,7,4],[172,3,172,4],[11,3,11,4],[8,3,8,4],[9,3,9,4],[17,3,17,4],[18,3,18,4],[19,3,19,4],[20,3,20,4],[21,3,21,4],[13,3,13,4],[12,3,12,4],[14,3,14,4],[15,3,15,4],[16,3,16,4],[27,3,27,4],[28,3,28,4],[29,3,29,4],[30,3,30,4],[31,3,31,4],[22,3,22,4],[23,3,23,4],[24,3,24,4],[25,3,25,4],[26,3,26,4],[32,3,32,4],[33,3,33,4],[151,3,151,4],[149,3,149,4],[147,3,147,4],[145,3,145,4],[146,3,146,4],[148,3,148,4],[150,3,150,4],[46,3,46,4],[47,3,47,4],[48,3,48,4],[49,3,49,4],[50,3,50,4],[52,3,52,4],[51,3,51,4],[53,3,53,4],[54,3,54,4],[56,3,56,4],[55,3,55,4],[34,3,34,4],[81,3,81,4],[82,3,82,4],[83,3,83,4],[84,3,84,4],[35,3,35,4],[36,3,36,4],[37,3,37,4],[38,3,38,4],[39,3,39,4],[40,3,40,4],[41,3,41,4],[42,3,42,4],[57,3,57,4],[43,3,43,4],[44,3,44,4],[45,3,45,4],[63,3,63,4],[64,3,64,4],[65,3,65,4],[66,3,66,4],[67,3,67,4],[80,3,80,4],[71,3,71,4],[72,3,72,4],[73,3,73,4],[74,3,74,4],[75,3,75,4],[58,3,58,4],[59,3,59,4],[60,3,60,4],[61,3,61,4],[62,3,62,4],[68,3,68,4],[170,3,170,4],[169,3,169,4],[168,3,168,4],[167,3,167,4],[166,3,166,4],[165,3,165,4],[164,3,164,4],[163,3,163,4],[162,3,162,4],[161,3,161,4],[160,3,160,4],[159,3,159,4],[69,3,69,4],[70,3,70,4],[76,3,76,4],[77,3,77,4],[78,3,78,4],[79,3,79,4],[85,3,85,4],[96,3,96,4],[97,3,97,4],[98,3,98,4],[99,3,99,4],[100,3,100,4],[91,3,91,4],[92,3,92,4],[93,3,93,4],[94,3,94,4],[95,3,95,4],[86,3,86,4],[87,3,87,4],[88,3,88,4],[89,3,89,4],[90,3,90,4],[106,3,106,4],[107,3,107,4],[108,3,108,4],[109,3,109,4],[110,3,110,4],[101,3,101,4],[102,3,102,4],[103,3,103,4],[104,3,104,4],[105,3,105,4],[116,3,116,4],[117,3,117,4],[118,3,118,4],[119,3,119,4],[120,3,120,4],[111,3,111,4],[112,3,112,4],[113,3,113,4],[114,3,114,4],[115,3,115,4],[126,3,126,4],[127,3,127,4],[128,3,128,4],[129,3,129,4],[130,3,130,4],[121,3,121,4],[122,3,122,4],[123,3,123,4],[124,3,124,4],[125,3,125,4],[152,3,152,4],[153,3,153,4],[154,3,154,4],[155,3,155,4],[131,3,131,4],[132,3,132,4],[133,3,133,4],[134,3,134,4],[135,3,135,4],[10,3,10,4],[181,3,181,4],[182,3,182,4],[183,3,183,4],[176,3,176,4],[177,3,177,4],[178,3,178,4],[179,3,179,4],[180,3,180,4],[157,3,157,4],[158,3,158,4],[173,3,173,4],[174,3,174,4],[175,3,175,4],[141,3,141,4],[142,3,142,4],[143,3,143,4],[144,3,144,4],[156,3,156,4],[136,3,136,4],[137,3,137,4],[138,3,138,4],[139,3,139,4],[140,3,140,4]]}
[null,{"$f":"IF(F1=\"X\",\"Choose one---\",\"\")","v":""},null,null,{"$f":"IF(F1=\"X\",\"------->\",\"\")","v":""},null,"STATEMENT OF ESTIMATED QUANTITIES",null,"<-------","Use this chart title if you are preparing a complete state project plan set."]
[null,{"$f":"IF(F2=\"X\",\"Choose one---\",\"\")","v":"Choose one---"},null,null,{"$f":"IF(F2=\"X\",\"------->\",\"\")","v":"------->"},"x","PERMANENT SIGNING TABULATION",null,"<-------","Use this chart title if your plan sheet set is part of a larger state project."]
[null,{"$f":"IF(F3=\"X\",\"Choose one---\",\"\")","v":""},null,null,{"$f":"IF(F3=\"X\",\"------->\",\"\")","v":""},null,"Custom Title - Type Here",null,"<-------","Use this chart title if your plan sheet set is part of a larger state project."]
[]
[null,{"$f":"IF(F1<>\"\",G1,IF(F2<>\"\",G2,G3))","v":"PERMANENT SIGNING TABULATION"},null,null,null,null,null,null,null,"X",null,"Include"]
[null,null,"SHEET\nNO",null,null,null,null,null,null,"TOTAL",null,"x"]
[null,"TAB",null,"ITEM NO",null,null,"ITEM",null,"UNIT",{"$f":"IF(F1<>\"\",\"ESTIMATED\",IF(F2<>\"\",\"SIGNING\",\"SIGNING\"))","v":"SIGNING"},null,"x"]
[null,null,null,null,null,null,null,null,null,"QUANTITIES",null,"x"]
[null,"AA",null,2011.6010000000001,null,null,"AS BUILT",null,"LUMP SUM",0,null,"SIGNING"]
[null,null,null,2021.501,null,null,"MOBILIZATION",null,"LUMP SUM",null,null,"SIGNING"]
[null,null,null,2104.502,null,null,"REMOVE DELINEATOR",null,"EACH",0,null,"SIGNING"]
[null,null,null,2104.502,null,null,"REMOVE MARKER",null,"EACH",0,null,"SIGNING"]
[null,null,null,2104.502,null,null,"REMOVE REFERENCE LOCATION SIGN",null,"EACH",null,null,"SIGNING"]
[null,null,null,2104.502,null,null,"REMOVE SIGN",null,"EACH",null,null,"SIGNING"]
[null,null,null,2104.502,null,null,"REMOVE SIGN TYPE A",null,"EACH",{"$f":"AREM!C2","v":0},null,"SIGNING"]
[null,null,null,2104.502,null,null,"REMOVE SIGN TYPE C",null,"EACH",17,null,"SIGNING"]
[null,null,null,2104.502,null,null,"REMOVE SIGN TYPE D",null,"EACH",{"$f":"DREM!C15","v":3},null,"SIGNING"]
[null,null,null,2104.502,null,null,"REMOVE SIGN TYPE EA",null,"EACH",{"$f":"EAREM!C14","v":0},null,"SIGNING"]
[null,null,null,2104.502,null,null,"REMOVE SIGN TYPE EO",null,"EACH",{"$f":"EOREM!C14","v":0},null,"SIGNING"]
[null,null,null,2104.502,null,null,"REMOVE SIGN TYPE OH (BRIDGE MOUNTED)",null,"EACH",{"$f":"'OH REM'!F15","v":0},null,"SIGNING"]
[null,null,null,2104.502,null,null,"REMOVE SIGN TYPE OH",null,"EACH",{"$f":"'OH REM'!F14","v":1},null,"SIGNING"]
[null,null,null,2104.502,null,null,"REMOVE SIGN TYPE SPECIAL",null,"EACH",0,null,"SIGNING"]
[null,null,null,2104.502,null,null,"REMOVE SIGN PANEL OVERLAY TYPE A",null,"EACH",0,null,"SIGNING"]
[null,null,null,2104.502,null,null,"REMOVE SIGN PANEL OVERLAY TYPE EA",null,"EACH",{"$f":"EAOL!K15","v":0},null,"SIGNING"]
[null,null,null,2104.502,null,null,"REMOVE SIGN PANEL OVERLAY TYPE EO",null,"EACH",{"$f":"EOOL!K15","v":0},null,"SIGNING"]
[null,null,null,2104.502,null,null,"REMOVE SIGN PANEL OVERLAY TYPE OH",null,"EACH",0,null,"SIGNING"]
[null,null,null,2104.502,null,null,"REMOVE SIGN LIGHTING SYSTEM",null,"EACH",{"$f":"'OH REM LT SYS'!C15","v":1},null,"SIGNING"]
[null,null,null,2104.502,null,null,"REMOVE SIGN PANEL TYPE A",null,"EACH",0,null,"SIGNING"]
[null,null,null,2104.502,null,null,"REMOVE SIGN PANEL TYPE C",null,"EACH",0,null,"SIGNING"]
[null,null,null,2104.502,null,null,"REMOVE SIGN PANEL TYPE D",null,"EACH",{"$f":"'D REM PANEL'!C15","v":0},null,"SIGNING"]
[null,null,null,2104.502,null,null,"REMOVE SIGN PANEL TYPE OH",null,"EACH",{"$f":"'OH REMPAN'!G14","v":4},null,"SIGNING"]
[null,null,null,2104.502,null,null,"REMOVE SIGN FOOTING - TYPE A",null,"EACH",{"$f":"'A REM FOOT'!C19","v":2},null,"SIGNING"]
[null,null,null,2104.502,null,null,"REMOVE SIGN FOOTING - TYPE OH",null,"EACH",{"$f":"'OH REM FOOT'!C15","v":1},null,"SIGNING"]
[null,null,null,2104.502,null,null,"SALVAGE DELINEATOR",null,"EACH",{"$f":"'DELS&I'!E13","v":14},null,"SIGNING"]
[null,null,null,2104.502,null,null,"SALVAGE MARKER",null,"EACH",{"$f":"'DELS&I'!D13","v":2},null,"SIGNING"]
[null,null,null,2104.502,null,null,"SALVAGE REFERENCE LOCATION SIGN",null,"EACH",{"$f":"'SAL REF SIGN'!C11","v":3},null,"SIGNING"]
[null,null,null,2104.502,null,null,"SALVAGE SIGN PANEL TYPE A",null,"EACH",0,null,"SIGNING"]
[null,null,null,2104.502,null,null,"SALVAGE SIGN PANEL TYPE C",null,"EACH",0,null,"SIGNING"]
[null,null,null,2104.502,null,null,"SALVAGE SIGN PANEL TYPE D",null,"EACH",0,null,"SIGNING"]
[null,null,null,2104.502,null,null,"SALVAGE SIGN PANEL TYPE EA",null,"EACH",0,null,"SIGNING"]
[null,null,null,2104.502,null,null,"SALVAGE SIGN PANEL TYPE EO",null,"EACH",{"$f":"ESALINS!C38","v":0},null,"SIGNING"]
[null,null,null,2104.502,null,null,"SALVAGE SIGN PANEL TYPE OH",null,"EACH",0,null,"SIGNING"]
[null,null,null,2104.502,null,null,"SALVAGE SIGN TYPE A",null,"EACH",0,null,"SIGNING"]
[null,null,null,2104.502,null,null,"SALVAGE SIGN TYPE C",null,"EACH",{"$f":"'CS&I'!C11+CSAL!C15","v":1},null,"SIGNING"]
[null,null,null,2104.502,null,null,"SALVAGE SIGN TYPE D",null,"EACH",{"$f":"'DS&I'!C969","v":0},null,"SIGNING"]
[null,null,null,2104.502,null,null,"SALVAGE SIGN TYPE EA",null,"EACH",0,null,"SIGNING"]
[null,null,null,2104.502,null,null,"SALVAGE SIGN TYPE EO",null,"EACH",{"$f":"ESALINS!C38","v":0},null,"SIGNING"]
[null,null,null,2104.502,null,null,"SALVAGE SIGN TYPE OH",null,"EACH",0,null,"SIGNING"]
[null,null,null,2104.502,null,null,"SALVAGE SIGN TYPE OH (BR MOUNTED)",null,"EACH",0,null,"SIGNING"]
[null,null,null,2104.502,null,null,"SALVAGE SIGN TYPE SPECIAL",null,"EACH",0,null,"SIGNING"]
[null,null,null,2104.502,null,null,"SALVAGE SIGN SUPPORT OH",null,"EACH",0,null,"SIGNING"]
[null,null,null,2104.5030000000002,null,null,"REMOVE SIGN WALKWAY",null,"LIN FT",{"$f":"'OH REM WKWY'!D7","v":0},null,"SIGNING"]
[null,null,null,2104.5230000000001,null," ","SALVAGE SIGN",null,"EACH",{"$f":"'OH REM WKWY'!D8","v":0},null,"SIGNING"]
[null,null,null,2545.5160000000001,null,null,"SIGN LIGHTING SYSTEM",null,"SYSTEM",{"$f":"'OH REM WKWY'!D9","v":0},null,"SIGNING"]
[null,null,null,2545.5160000000001,null,null,"SIGN LIGHTING SYSTEM BRIDGE MOUNTED",null,"SYSTEM",{"$f":"'OH REM WKWY'!D10","v":0},null,"SIGNING"]
[null,null,null,2545.616,null,null,"MODIFY SIGN LIGHTING SYSTEM",null,"SYSTEM",{"$f":"'OH REM WKWY'!D10","v":0},null,"SIGNING"]
[null,null,null,2563.6010000000001,null,null,"TRAFFIC CONTROL",null,"LUMP SUM",{"$f":"'OH REM WKWY'!D11","v":0},null,"SIGNING"]
[null,null,null,2564.502,null,null,"MEDIAN BARRIER FOOTING",null,"EACH",0,null,"SIGNING"]
[null,null,null,2564.502,null,null,"SIGN SUPPORT SIGN BRIDGE",null,"EACH",{"$f":"'OH SIGN SUP BRIDGE'!C18","v":1},null,"SIGNING"]
[null,"AA",null,2564.502,null,null,"SIGN SUPPORT CANTILEVER",null,"EACH",{"$f":"'OH SGN SUP CANT'!B14","v":1},null,"SIGNING"]
[null,"BB",null,2564.502,null,null,"MODIFY POST",null,"EACH",0,null,"SIGNING"]
[null,null,null,2564.502,null,null,"INSTALL DELINEATOR",null,"EACH",{"$f":"'DELS&I'!E13","v":14},null,"SIGNING"]
[null,null,null,2564.502,null,null,"INSTALL MARKER",null,"EACH",{"$f":"'DELS&I'!D13","v":2},null,"SIGNING"]
[null,null,null,2564.502,null,null,"INSTALL REFERENCE LOCATION SIGN",null,"EACH",0,null,"SIGNING"]
[null,null,null,2564.502,null,null,"INSTALL SIGN PANEL",null,"EACH",0,null,"SIGNING"]
[null,null,null,2564.502,null,null,"INSTALL SIGN PANEL TYPE A",null,"EACH",{"$f":"ASPNLIN!C12","v":0},null,"SIGNING"]
[null,null,null,2564.502,null,null,"INSTALL SIGN PANEL TYPE C",null,"EACH",{"$f":"'CS&I'!C11","v":1},null,"SIGNING"]
[null,null,null,2564.502,null,null,"INSTALL SIGN PANEL TYPE D",null,"EACH",0,null,"SIGNING"]
[null,null,null,2564.502,null,null,"INSTALL SIGN PANEL TYPE EO",null,"EACH",{"$f":"ESALINS!C38","v":0},null,"SIGNING"]
[null,null,null,2564.502,null,null,"INSTALL SIGN PANEL TYPE OH",null,"EACH",0,null,"SIGNING"]
[null,null,null,2564.502,null,null,"INSTALL SIGN PANEL TYPE SPECIAL",null,"EACH",0,null,"SIGNING"]
[null,null,null,2564.502,null,null,"INSTALL SIGN PANEL TYPE OVERLAY",null,"EACH",0,null,"SIGNING"]
[null,null,null,2564.502,null,null,"INSTALL SIGN TYPE A",null,"EACH",0,null,"SIGNING"]
[null,null,null,2564.502,null,null,"INSTALL SIGN TYPE C",null,"EACH",{"$f":"'CS&I'!C11","v":1},null,"SIGNING"]
[null,null,null,2564.502,null,null,"INSTALL SIGN TYPE D",null,"EACH",{"$f":"'DS&I'!C12+DINS!C16","v":5},null,"SIGNING"]
[null,null,null,2564.502,null,null,"INSTALL SIGN TYPE EA",null,"EACH",0,null,"SIGNING"]
[null,null,null,2564.502,null,null,"INSTALL SIGN TYPE EO",null,"EACH",{"$f":"ESALINS!C38","v":0},null,"SIGNING"]
[null,null,null,2564.502,null,null,"INSTALL SIGN TYPE OH",null,"EACH",0,null,"SIGNING"]
[null,null,null,2564.502,null,null,"INSTALL SIGN TYPE OH (BR MOUNT)",null,"EACH",0,null,"SIGNING"]
[null,null,null,2564.502,null,null,"OVERHEAD SIGN IDENTIFICATION PLATE",null,"EACH",{"$f":"'OH ID '!C14","v":0},null,"SIGNING"]
[null,null,null,2564.502,null,null,"LIGHTING SYSTEM IDENTIFICATION PLATE",null,"EACH",null,null,"SIGNING"]
[null,null,null,2564.502,null,null,"EXTEND WALKWAY SUPPORT",null,"EACH",0,null,"SIGNING"]
[null,null,null,2564.502,null,null,"FRICTION FUSE",null,"EACH",0,null,"SIGNING"]
[null,null,null,2564.502,null,null,"KEEPER PLATE",null,"EACH",0,null,"SIGNING"]
[null,null,null,2564.502,null,null,"DELINEATOR",null,"EACH",0,null,"SIGNING"]
[null,null,null,2564.502,null,null,"DELINEATOR TYPE X4-6",null,"EACH",{"$f":"DELINEATOR!E7","v":0},null,"SIGNING"]
[null,null,null,2564.502,null,null,"DELINEATOR TYPE X4-8",null,"EACH",{"$f":"DELINEATOR!E8","v":0},null,"SIGNING"]
[null,null,null,2564.502,null,null,"DELINEATOR TYPE X4-13",null,"EACH",{"$f":"DELINEATOR!E9","v":0},null,"SIGNING"]
[null,null,null,2564.502,null,null,"DELINEATOR TYPE RECOVERABLE",null,"EACH",null,null,"SIGNING"]
[null,null,null,2564.502,null,null,"DELINEATOR TYPE SPECIAL",null,"EACH",0,null,"SIGNING"]
[null,null,null,2564.502,null,null,"BRIDGE NUMBER MARKER X4-12A",null,"EACH",{"$f":"'BRIDGE NO'!C7","v":4},null,"SIGNING"]
[null,null,null,2564.502,null,null,"INFILTRATION AREA MARKER X3-6A",null,"EACH",0,null,"SIGNING"]
[null,null,null,2564.502,null,null,"REFERENCE LOCATION SIGN",null,"EACH",{"$f":"'REF SIGN'!C967","v":0},null,"SIGNING"]
[null,null,null,2564.502,null,null,"RIGHT OF WAY MARKER TYPE X3-1",null,"EACH",{"$f":"DELINEATOR!E6","v":0},null,"SIGNING"]
[null,null,null,2564.502,null,null,"OBJECT MARKER TYPE X4-2",null,"EACH",{"$f":"MARKER!D19","v":4},null,"SIGNING"]
[null,null,null,2564.502,null,null,"OBJECT MARKER TYPE X4-3",null,"EACH",{"$f":"MARKER!D20","v":1},null,"SIGNING"]
[null,null,null,2564.502,null,null,"OBJECT MARKER TYPE X4-4",null,"EACH",{"$f":"MARKER!D21","v":9},null,"SIGNING"]
[null,null,null,2564.502,null,null,"OBJECT MARKER TYPE X4-5",null,"EACH",{"$f":"MARKER!D22","v":1},null,"SIGNING"]
[null,null,null,2564.502,null,null,"OBJECT MARKER TYPE X4-11",null,"EACH",{"$f":"MARKER!D23","v":2},null,"SIGNING"]
[null,null,null,2564.5030000000002,null,null,"SAW SIGN PANELS",null,"LIN FT",0,null,"SIGNING"]
[null,null,null,2564.5030000000002,null,null,"SAW SIGN PANELS TYPE A",null,"LIN FT",0,null,"SIGNING"]
[null,null,null,2564.5030000000002,null,null,"SAW SIGN PANELS TYPE EA",null,"LIN FT",0,null,"SIGNING"]
[null,null,null,2564.5030000000002,null,null,"SAW SIGN PANELS TYPE EO",null,"LIN FT",0,null,"SIGNING"]
[null,null,null,2564.5030000000002,null,null,"SAW SIGN PANELS TYPE OH",null,"LIN FT",0,null,"SIGNING"]
[null,null,null,2564.5070000000001,null,null,"CONCRETE FOOTINGS",null,"CU YD",0,null,"SIGNING"]
[null,null,null,2564.5070000000001,null,null,"CONCRETE FOOTINGS (TYPE A SIGNS)",null,"CU YD",0,null,"SIGNING"]
[null,null,null,2564.5070000000001,null,null,"CONCRETE FOOTINGS (TYPE OH SHAFT)",null,"CU YD",{"$f":"'OH BTQ'!J12","v":0},null,"SIGNING"]
[null,null,null,2564.5070000000001,null,null,"CONCRETE FOOTINGS (TYPE OH SPREAD)",null,"CU YD",{"$f":"'OH BTQ'!J11","v":0},null,"SIGNING"]
[null,"BB",null,2564.5070000000001,null,null,"CONCRETE FOOTINGS (DESIGN SPECIAL)",null,"CU YD",0,null,"SIGNING"]
[null,"CC",null,2564.5079999999998,null,null,"STRUCTURAL STEEL",null,"POUND",0,null,"SIGNING"]
[null,null,null,2564.5079999999998,null,null,"STRUCT STEEL-POSTS FOR TYPE A SIGNS","(P)","POUND",0,null,"SIGNING"]
[null,null,null,2564.5079999999998,null,null,"STRUCT STEEL-POSTS FOR OH SIGNS (A)","(P)","POUND",0,null,"SIGNING"]
[null,null,null,2564.5079999999998,null,null,"STRUCT STEEL-POSTS FOR OH SIGNS (B)","(P)","POUND",{"$f":"'OH BTQ'!J6","v":0},null,"SIGNING"]
[null,null,null,2564.5079999999998,null,null,"STRUCT STEEL-POSTS FOR OH SIGNS (C)","(P)","POUND",null,null,"SIGNING"]
[null,null,null,2564.5079999999998,null,null,"STRUCT STEEL-POSTS FOR OH SIGNS (D)","(P)","POUND",null,null,"SIGNING"]
[null,null,null,2564.5079999999998,null,null,"STRUCT STEEL-TRUSSES FOR OH SIGNS (A)","(P)","POUND",0,null,"SIGNING"]
[null,null,null,2564.5079999999998,null,null,"STRUCT STEEL-TRUSSES FOR OH SIGNS (B)","(P)","POUND",{"$f":"'OH BTQ'!J7","v":0},null,"SIGNING"]
[null,null,null,2564.5079999999998,null,null,"STRUCT STEEL-TRUSSES FOR OH SIGNS (C)","(P)","POUND",{"$f":"'OH BTQ'!J8","v":0},null,"SIGNING"]
[null,null,null,2564.5079999999998,null,null,"STRUCT STEEL-TRUSSES FOR OH SIGNS (D)","(P)","POUND",{"$f":"'OH BTQ'!J9","v":0},null,"SIGNING"]
[null,null,null,2564.5079999999998,null,null,"STR STEEL-TRUSSES FOR OH SIGNS BR MTD","(P)","POUND",{"$f":"BMST!D9","v":0},null,"SIGNING"]
[null,null,null,2564.5079999999998,null,null,"STR STEEL-WLKWY SPRT FOR OH SIGNS (B)","(P)","POUND",0,null,"SIGNING"]
[null,null,null,2564.5079999999998,null,null,"STR STEEL-WLKWY SPRT FOR OH SIGNS (D)","(P)","POUND",0,null,"SIGNING"]
[null,null,null,2564.5079999999998,null,null,"STR STEEL-WLKWY GRTNG FOR OH SIGNS (B)","(P)","POUND",0,null,"SIGNING"]
[null,null,null,2564.5079999999998,null,null,"STR STEEL-WLKWY GRTNG FOR OH SIGNS (C)","(P)","POUND",0,null,"SIGNING"]
[null,null,null,2564.5079999999998,null,null,"STR STEEL-WLKWY GRTNG FOR OH SIGNS (D)","(P)","POUND",0,null,"SIGNING"]
[null,null,null,2564.5079999999998,null,null,"STR STEEL-WLKWY GRTNG FOR OH SIGNS (SPEC)","(P)","POUND",0,null,"SIGNING"]
[null,null,null,2564.5079999999998,null,null,"STR STEEL-PANEL MT PST FOR OH SIGNS (A)","(P)","POUND",null,null,"SIGNING"]
[null,null,null,2564.5079999999998,null,null,"STR STEEL-PANEL MT PST FOR OH SIGNS (B)","(P)","POUND",{"$f":"'OH BTQ'!J10","v":0},null,"SIGNING"]
[null,null,null,2564.5079999999998,null,null,"STR STEEL-PANEL MT PST FOR OH SIGNS (C)","(P)","POUND",{"$f":"'OH BTQ'!J11","v":0},null,"SIGNING"]
[null,null,null,2564.5079999999998,null,null,"STR STEEL-PANEL MT PST FOR OH SIGNS (D)","(P)","POUND",{"$f":"'OH BTQ'!J12","v":0},null,"SIGNING"]
[null,null,null,2564.518,null,null,"OVERHEAD SIGN STRUCTURE REPAIR",null,"HOUR",0,null,"SIGNING"]
[null,null,null,2564.518,null,null,"SIGN PANELS TYPE A","(P)","SQ FT",{"$f":"'SIGN PANELS TYPE A EXTRUDED'!H16+'SIGN PANELS TYPE A'!H18","v":0},null,"SIGNING"]
[null,null,null,2564.518,null,null,"SIGN PANELS TYPE C",null,"SQ FT",{"$f":"ROUNDUP(CSIGN!N985,0)","v":0},null,"SIGNING"]
[null,null,null,2564.518,null,null,"SIGN PANELS TYPE D",null,"SQ FT",{"$f":"ROUNDUP(DSIGN!O975,0)","v":0},null,"SIGNING"]
[null,null,null,2564.518,null,null,"SIGN PANELS TYPE EA","(P)","SQ FT",{"$f":"EA!J975+EAEXTFI!K9","v":0},null,"SIGNING"]
[null,null,null,2564.518,null,null,"SIGN PANELS TYPE EO","(P)","SQ FT",{"$f":"EO!J15+'EO EXT PAN SECT'!I20","v":0},null,"SIGNING"]
[null,null,null,2564.518,null,null,"SIGN PANELS TYPE OH","(P)","SQ FT",{"$f":"'SIGN PANELS TYPE OH'!P17+'SIGN PANELS TYPE OH (EXT PAN )'!G8","v":0},null,"SIGNING"]
[null,null,null,2564.518,null,null,"SIGN PANELS TYPE OVERLAY",null,"SQ FT",{"$f":"ROUNDUP(OL!J973,0)","v":0},null,"SIGNING"]
[null,null,null,2564.518,null,null,"SIGN PANELS TYPE SPECIAL",null,"SQ FT",0,null,"SIGNING"]
[null,null,null,2564.518,null,null,"SIGN PANEL OVERLAY TYPE A","(P)","SQ FT",0,null,"SIGNING"]
[null,null,null,2564.518,null,null,"SIGN PANEL OVERLAY TYPE EA","(P)","SQ FT",0,null,"SIGNING"]
[null,null,null,2564.518,null,null,"SIGN PANEL OVERLAY TYPE EO","(P)","SQ FT",0,null,"SIGNING"]
[null,null,null,2564.518,null,null,"SIGN PANEL OVERLAY TYPE OH","(P)","SQ FT",{"$f":"'OH OL'!P17","v":0},null,"SIGNING"]
[null,null,null,2564.518,null,null,"FURNISH SIGN PANELS TYPE C",null,"SQ FT",0,null,"SIGNING"]
[null,null,null,2564.518,null,null,"FURNISH SIGN PANELS TYPE D",null,"SQ FT",0,null,"SIGNING"]
[null,null,null,2564.518,null,null,"FURNISH SIGN PANELS TYPE OH",null,"SQ FT",0,null,"SIGNING"]
[null,null,null,2564.518,null,null,"FURNISH SIGN PANELS TYPE OVERLAY",null,"SQ FT",0,null,"SIGNING"]
[null,null,null,2013.6030000000001,null,null,"SAFETY CABLE",null,"LIN FT",{"$f":"'safety cable'!E15","v":96},null,"SIGNING"]
[null,null,null,2104.6010000000001,null,null,"SALVAGE LIGHTING SYSTEM",null,"LUMP SUM",0,null,"SIGNING"]
[null,null,null,2564.6019999999999,null,null,"INSTALL SIGN COLLAR",null,"EACH",0,null,"SIGNING"]
[null,null,null,2564.6019999999999,null,null,"SIGN COLLAR",null,"EACH",0,null,"SIGNING"]
[null,null,null,2564.6019999999999,null,null,"CONC PEDESTAL EXTENSION DES SPEC",null,"EACH",0,null,"SIGNING"]
[null,null,null,2564.6019999999999,null,null,"INSTALL SIGN",null,"EACH",0,null,"SIGNING"]
[null,null,null,2564.6019999999999,null,null,"INSTALL STEEL POST",null,"EACH",0,null,"SIGNING"]
[null,null,null,2564.6019999999999,null,null,"FOUNDATION SPECIAL OH",null,"EACH",0,null,"SIGNING"]
[null,null,null,2564.6019999999999,null,null,"MEDIAN SIGN POST ANCHOR",null,"EACH",0,null,"SIGNING"]
[null,null,null,2564.6019999999999,null,null,"REPAIR SIGN TYPE OH",null,"EACH",0,null,"SIGNING"]
[null,null,null,2564.6019999999999,null,null,"FURNISH & INSTALL TRAFFIC WARNING SIGN",null,"EACH",0,null,"SIGNING"]
[null,null,null,2564.6019999999999,null,null,"INSTALL SIGN SUPPORT",null,"EACH",0,null,"SIGNING"]
[null,null,null,2564.6019999999999,null,null,"REPOSITION SIGN PANEL TYPE OH",null,"EACH",{"$f":"OHREPOSPNL!P11","v":4},null,"SIGNING"]
[null,"CC",null,2564.6019999999999,null,null,"REPOSITION SIGN PANEL",null,"EACH",0,null,"SIGNING"]
[null,"DD",null,2564.6019999999999,null,null,"HIGHWAY ADVISORY RADIO SIGN",null,"EACH",0,null,"SIGNING"]
[null,null,null,2564.6019999999999,null,null,"MODIFY SIGN TYPE OH (BR MTD)",null,"EACH",0,null,"SIGNING"]
[null,null,null,2564.6019999999999,null,null,"MODIFY SIGN TYPE OH",null,"EACH",0,null,"SIGNING"]
[null,null,null,2564.6019999999999,null,null,"INSTALL SIGN TRUSS",null,"EACH",0,null,"SIGNING"]
[null,null,null,2564.6019999999999,null,null,"RELOCATE SIGN",null,"EACH",0,null,"SIGNING"]
[null,null,null,2564.6019999999999,null,null,"INSTALL SIGN TYPE SPECIAL",null,"EACH",0,null,"SIGNING"]
[null,null,null,2564.6019999999999,null,null,"FURNISH DELINEATOR",null,"EACH",0,null,"SIGNING"]
[null,null,null,2564.6019999999999,null,null,"FURNISH DELINEATOR TYPE RECOVERABLE",null,"EACH",null,null,"SIGNING"]
[null,null,null,2564.6019999999999,null,null,"FURNISH DELINEATOR/MARKER PANEL",null,"EACH",null,null,"SIGNING"]
[null,null,null,2564.6019999999999,null,null,"FURNISH MARKER",null,"EACH",0,null,"SIGNING"]
[null,null,null,2564.6019999999999,null,null,"FURNISH TYPE C SIGN",null,"EACH",0,null,"SIGNING"]
[null,null,null,2564.6019999999999,null,null,"FURNISH SIGN POSTS",null,"EACH",0,null,"SIGNING"]
[null,null,null,2564.6019999999999,null,null,"CONCRETE FOOTINGS DESIGN SPECIAL",null,"EACH",0,null,"SIGNING"]
[null,null,null,2564.6019999999999,null,null,"INTERNALLY ILLUMINATED SIGN",null,"EACH",0,null,"SIGNING"]
[null,null,null,2564.6019999999999,null,null,"DELINEATOR/MARKER PANEL",null,"EACH",null,null,"SIGNING"]
[null,null,null,2564.6019999999999,null,null,"DELINEATOR/MARKER SIGN",null,"EACH",null,null,"SIGNING"]
[null,null,null,2564.6019999999999,null,null,"SIGN FRAME",null,"EACH",null,null,"SIGNING"]
[null,null,null,2564.6019999999999,null,null,"SUPPLEMENTAL DESCRIPTION",null,"EACH",0,null,"SIGNING"]
[null,null,null,2564.6080000000002,null,null,"FURNISH STRUCTURAL STEEL 2.5# U-POST",null,"POUND",0,null,"SIGNING"]
[null,null,null,2564.6080000000002,null,null,"FURNISH STRUCTURAL STEEL 3# U-POST",null,"POUND",0,null,"SIGNING"]
[null,null,null,2564.6179999999999,null,null,"SIGN TYPE C",null,"SQ FT",0,null,"SIGNING"]
[null,"DD",null,2564.6179999999999,null,null,"SIGN TYPE D",null,"SQ FT",0,null,"SIGNING"]
[]
[]
[null,null,null,null,null,null,null,null,null,null,null,"x"]
[null,null,null,null,null,null,null,null,null,null,null,"x"]
[null,"GENERAL NOTE:"]
[null,"FOR SIGNS THAT ARE LOCATED ADJACENT TO A SIDEWALK OR TRAIL, A 4' MINIMUM (6' PREFERRED) UNOBSTRUCTED PAVED WALKWAY OR PATH"]
[]
[null,"(P) DENOTES PLAN QUANTITY",null,null,null,null,null,null,null,null,null,"High"]
[null,{"$f":"\"(3)  OTHER NOTES.\"","v":"(3)  OTHER NOTES."},null,null,null,null,null,null,null,null,null,"High"]
[null,{"$f":"\"(4)  OTHER NOTES.\"","v":"(4)  OTHER NOTES."},null,null,null,null,null,null,null,null,null,"High"]

{"sheet":"SEQ-4Temp","index":2,"n_rows":8,"n_cols":8,"rows_kept":8,"cut":false,"hidden":true,"merged":[[4,1,4,6],[5,2,7,2],[4,7,4,8],[5,7,5,8],[6,7,6,8],[7,7,7,8]]}
[]
[]
[]
[]
[null,{"$f":"IF('SEQ-PSTAB'!F1<>\"\",'SEQ-PSTAB'!G1,IF('SEQ-PSTAB'!F2<>\"\",'SEQ-PSTAB'!G2,'SEQ-PSTAB'!G3))","v":"PERMANENT SIGNING TABULATION"},null,null,null,null,null,"X"]
[null,null,"SHEET\nNO",null,null,null,null,"TOTAL"]
[null,"TAB",null,"ITEM NO",null,"ITEM","UNIT","ESTIMATED"]
[null,null,null,null,null,null,null,"QUANTITIES"]

{"sheet":"TOC","index":3,"n_rows":70,"n_cols":3,"rows_kept":70,"cut":false,"hidden":false,"merged":[[21,1,21,2],[40,1,40,2],[38,1,38,2],[30,1,30,2],[5,1,5,2],[25,1,25,2],[2,1,2,2],[17,1,17,2],[15,1,15,2],[12,1,12,2],[9,1,9,2]]}
[]
[null,"PAGE\nNO","SHEET NAME"]
[null,"ID PLATE (STANDARD SIGN DRAWINGS)"]
[null,0,"OH IDENTIFICATION PLATE"]
[null,0,"FEED POINT IDENTIFICATION PLATE"]
[null,"PLACEMENT DETAILS"]
[null,"ST13","SIGN PLACEMENT"]
[null,"ST87","DELINEATORS AND MARKERS"]
[null,58,"FLANGED CHANNEL POST MOUNTED THROUGH SURFACED MEDIAN OR SIDEWALK"]
[null,"A SIGN STRUCTURAL DETAILS"]
[null,0,"H-PILE FOOTINGS - SHEET 1"]
[null,0,"H-PILE FOOTINGS - SHEET 2"]
[]
[null,0,"CONCRETE FOOTINGS - SHEET 1"]
[null,0,"CONCRETE FOOTINGS - SHEET 2"]
[]
[null,0,"POST MODIFICATIONS"]
[null,"C & D SIGN STRUCTURAL DETAILS"]
[null,"ST23","SHEET 1 (MAIN)"]
[null,"ST24","SHEET 2 (A-FRAME)"]
[null,"ST25","SHEET 3 (PUNCH) * PUNCHING DETAILS ARE IN STANDARDS SIGN MANUAL PAGE 110."]
[null,"C SIGN: VARIOUS MOUNTING SHEETS"]
[null,57,"TYPE C SIGNS MOUNTED ON BRIDGE MEDIAN ISLAND"]
[null,56,"TYPE C SIGNS, DELINEATORES, & MARKERS IN CONCRETE "]
[null,59,"TYPC C SIGNS MOUNTED ON O-POSTS, OH SIGN POSTS, OR SIGNAL STANDARDS"]
[null,"MOUNTED ON BRIDGE RAIL"]
[null,32,"4 1/2\" O-PIPE [A]"]
[null,0,"6 5/8\" O-PIPE"]
[null,0,"4 1/2\" O-PIPE [B]"]
[null,0,"WALL RAIL"]
[null,"BRIDGE MOUNTED (D SIGNS ONLY)"]
[null,36,"DESIGN A1"]
[null,0,"DESIGN B4"]
[null,0,"DESIGN B3"]
[null,0,"DESIGN B2"]
[null,0,"DESIGN B1"]
[null,0,"DESIGN A2"]
[null,0,"DESIGN B5"]
[null,"EA & EO SIGNS"]
[null,94,"STRUCTURAL DETAIL"]
[null,"OH (OVERHEAD) SIGNS"]
[null,0,"PANEL MOUNTING POST MODIFICATION DETAILS"]
[null,0,"OH SIGN SUPPORTS"]
[null,0,"OH SIGN SAFETY CABLE - DESIGN A"]
[null,0,"OH SIGN SAFETY CABLE - DESIGN B"]
[null,0,"GENERAL ELEVATIONS AND NOTES (DRAWING ST-1)"]
[null,0,"CAMBER, POST IDENTIFICATION, AND ESTIMATED QUANTITIES (DRAWING ST-2)"]
[null,0,"FOUNDATIONS AND ANCHOR RODS (DRAWING ST-3)"]
[null,0,"TRUSS/POST CONNECTION & BASEPLATES (DRAWING ST-4)"]
[null,0,"SIGN TRUSS DETAILS - TRUSS TYPE A (DRAWING ST-5)"]
[null,0,"SIGN TRUSS DETAILS - TRUSS TYPE B (DRAWING ST-6)"]
[null,0,"SIGN TRUSS DETAILS - TRUSS TYPE C (DRAWING ST-7)"]
[null,0,"WALKWAY DETAILS (DRAWING ST-8)"]
[null,0,"FOLDING HANDRAIL (DRAWING ST-9)"]
[null,0,"SIGN PANEL AND PANEL MOUNTING POSTS DETAILS (DRAWING ST-10)"]
[null,0,"ELECTRICAL DETAILS (DRAWING ST-11)"]
[null,0,"ELECTRICAL DETAILS (DRAWING ST-12)"]
[null,0,"MODIFIED ELECTRICAL DETAILS (DRAWING ST-13) (INPLACE OF 12 UNLESS BOTH CMS & REG. OH)"]
[null,null,"D PANELS"]
[null,"ST81","FIRST PAGE OF TYPE D SIGN PANEL LAYOUTS"]
[null,"ST94","LAST PAGE OF SIGN PANEL TYPE D LAYOUTS"]
[null,null,"EO PANELS"]
[null,"ST27","FIRST PAGE OF TYPE EO SIGN PANEL LAYOUTS"]
[null,"ST47","LAST PAGE OF TYPE EO SIGN PANEL LAYOUTS"]
[null,null,"OH PANELS"]
[null,"ST67","FIRST PAGE OF TYPE OH SIGN PANEL LAYOUTS"]
[null,"ST68","LAST PAGE OF TYPE OH SIGN PANEL LAYOUTS"]
[null,null,"OH OVERLAY"]
[null,"ST70","FIRST PAGE OF TYPE OH SIGN PANEL OVERLAY LAYOUTS"]
[null,"ST71","LAST PAGE OF TYPE OH SIGN PANEL OVERLAY LAYOUTS"]

{"sheet":"POSTS25","index":4,"n_rows":412,"n_cols":5,"rows_kept":412,"cut":false,"hidden":true,"merged":[[1,1,1,4],[3,1,3,2],[2,3,3,3],[2,4,3,4]]}
[]
[null,"2.5# POSTS"]
[null,"HEIGHT ","LENGTH","V-POST","K-POST"]
[null,"INCH"]
[null,12,12,1,0]
[null,{"$f":"B5+6","v":18},12,1,0]
[null,24,12,1,0]
[null,30,12,1,0]
[null,36,12,2,0]
[null,42,12,2,0]
[null,48,12,2,0]
[null,54,12,2,0]
[null,60,12,2,1]
[null,66,12,2,1]
[null,72,12,2,1]
[null,78,12,2,1]
[null,84,12,2,1]
[null,90,12,2,1]
[null,96,12,2,1]
[null,102,12,2,1]
[null,108,12,2,1]
[null,114,12,2,1]
[null,120,12,2,1]
[null,126,12,2,1]
[null,132,12,2,1]
[null,138,12,2,1]
[null,144,12,2,1]
[null,150,12,2,1]
[null,12,18,1,0]
[null,{"$f":"B29+6","v":18},18,1,0]
[null,24,18,2,0]
[null,30,18,2,0]
[null,36,18,2,0]
[null,42,18,2,1]
[null,48,18,2,1]
[null,54,18,2,1]
[null,60,18,2,1]
[null,66,18,2,1]
[null,72,18,2,1]
[null,78,18,2,1]
[null,84,18,2,1]
[null,90,18,2,1]
[null,96,18,2,1]
[null,102,18,2,1]
[null,108,18,2,1]
[null,114,18,2,1]
[null,120,18,2,1]
[null,126,18,2,1]
[null,132,18,2,2]
[null,138,18,2,2]
[null,144,18,2,2]
[null,150,18,2,2]
[null,12,24,1,0]
[null,{"$f":"B53+6","v":18},24,2,0]
[null,24,24,2,0]
[null,30,24,2,0]
[null,36,24,2,1]
[null,42,24,2,1]
[null,48,24,2,1]
[null,54,24,2,1]
[null,60,24,2,1]
[null,66,24,2,1]
[null,72,24,2,1]
[null,78,24,2,1]
[null,84,24,2,1]
[null,90,24,2,1]
[null,96,24,2,1]
[null,102,24,2,1]
[null,108,24,2,1]
[null,114,24,2,2]
[null,120,24,2,2]
[null,126,24,2,2]
[null,132,24,2,2]
[null,138,24,2,2]
[null,144,24,2,2]
[null,150,24,2,2]
[null,12,30,1,0]
[null,{"$f":"B77+6","v":18},30,2,0]
[null,24,30,2,0]
[null,30,30,2,1]
[null,36,30,2,1]
[null,42,30,2,1]
[null,48,30,2,1]
[null,54,30,2,1]
[null,60,30,2,1]
[null,66,30,2,1]
[null,72,30,2,1]
[null,78,30,2,1]
[null,84,30,2,1]
[null,90,30,2,1]
[null,96,30,2,1]
[null,102,30,2,2]
[null,108,30,2,2]
[null,114,30,2,2]
[null,120,30,2,2]
[null,126,30,2,2]
[null,132,30,2,2]
[null,138,30,2,2]
[null,12,36,2,0]
[null,{"$f":"B99+6","v":18},36,2,0]
[null,24,36,2,1]
[null,30,36,2,1]
[null,36,36,2,1]
[null,42,36,2,1]
[null,48,36,2,1]
[null,54,36,2,1]
[null,60,36,2,1]
[null,66,36,2,1]
[null,72,36,2,1]
[null,78,36,2,1]
[null,84,36,2,1]
[null,90,36,2,2]
[null,96,36,2,2]
[null,102,36,2,2]
[null,108,36,2,2]
[null,114,36,2,2]
[null,120,36,2,2]
[null,12,42,2,0]
[null,{"$f":"B118+6","v":18},42,2,0]
[null,24,42,2,1]
[null,30,42,2,1]
[null,36,42,2,1]
[null,42,42,2,1]
[null,48,42,2,1]
[null,54,42,2,1]
[null,60,42,2,1]
[null,66,42,2,1]
[null,72,42,2,1]
[null,78,42,2,2]
[null,84,42,2,2]
[null,90,42,2,2]
[null,96,42,2,2]
[null,102,42,2,2]
[null,108,42,2,2]
[null,114,42,2,2]
[null,120,42,2,2]
[null,12,48,2,0]
[null,{"$f":"B137+6","v":18},48,2,1]
[null,24,48,2,1]
[null,30,48,2,1]
[null,36,48,2,1]
[null,42,48,2,1]
[null,48,48,2,1]
[null,54,48,2,1]
[null,60,48,2,1]
[null,66,48,2,1]
[null,72,48,2,2]
[null,78,48,2,2]
[null,84,48,2,2]
[null,90,48,2,2]
[null,96,48,2,2]
[null,102,48,2,2]
[null,108,48,2,2]
[null,12,54,1,0]
[null,{"$f":"B154+6","v":18},54,2,1]
[null,24,54,2,1]
[null,30,54,2,1]
[null,36,54,2,1]
[null,42,54,2,1]
[null,48,54,2,1]
[null,54,54,2,1]
[null,60,54,2,1]
[null,66,54,2,2]
[null,72,54,2,2]
[null,78,54,2,2]
[null,84,54,2,2]
[null,90,54,2,2]
[null,96,54,2,2]
[null,12,60,1,0]
[null,{"$f":"B169+6","v":18},60,2,1]
[null,24,60,2,1]
[null,30,60,2,1]
[null,36,60,2,1]
[null,42,60,2,1]
[null,48,60,2,1]
[null,54,60,2,1]
[null,60,60,2,2]
[null,66,60,2,2]
[null,72,60,2,2]
[null,78,60,2,2]
[null,84,60,2,2]
[null,90,60,2,2]
[null,12,66,1,0]
[null,{"$f":"B183+6","v":18},66,2,2]
[null,24,66,2,2]
[null,30,66,2,2]
[null,36,66,2,2]
[null,42,66,2,2]
[null,48,66,2,2]
[null,54,66,2,2]
[null,60,66,2,2]
[null,66,66,2,2]
[null,72,66,2,2]
[null,78,66,2,2]
[null,84,66,2,2]
[null,90,66,2,2]
[null,12,72,2,2]
[null,{"$f":"B197+6","v":18},72,2,2]
[null,24,72,2,2]
[null,30,72,2,2]
[null,36,72,2,2]
[null,42,72,2,2]
[null,48,72,2,2]
[null,54,72,2,2]
[null,60,72,2,2]
[null,66,72,2,2]
[null,72,72,2,2]
[null,78,72,2,2]
[null,84,72,2,2]
[null,12,78,2,2]
[null,{"$f":"B210+6","v":18},78,2,2]
[null,24,78,2,2]
[null,30,78,2,2]
[null,36,78,2,2]
[null,42,78,2,2]
[null,48,78,2,2]
[null,54,78,2,2]
[null,60,78,2,2]
[null,66,78,2,2]
[null,72,78,2,2]
[null,78,78,2,2]
[null,12,84,2,2]
[null,{"$f":"B222+6","v":18},84,2,2]
[null,24,84,2,2]
[null,30,84,2,2]
[null,36,84,2,2]
[null,42,84,2,2]
[null,48,84,2,2]
[null,54,84,2,2]
[null,60,84,2,2]
[null,66,84,2,2]
[null,72,84,2,2]
[null,12,90,2,2]
[null,{"$f":"B233+6","v":18},90,2,2]
[null,24,90,2,2]
[null,30,90,2,2]
[null,36,90,2,2]
[null,42,90,2,2]
[null,48,90,2,2]
[null,54,90,2,2]
[null,60,90,2,2]
[null,66,90,2,2]
[null,72,90,2,2]
[null,12,96,2,2]
[null,{"$f":"B244+6","v":18},96,2,2]
[null,24,96,2,2]
[null,30,96,2,2]
[null,36,96,2,2]
[null,42,96,2,2]
[null,48,96,2,2]
[null,54,96,2,2]
[null,60,96,2,2]
[null,66,96,2,2]
[null,12,102,2,2]
[null,{"$f":"B254+6","v":18},102,2,2]
[null,24,102,2,2]
[null,30,102,2,2]
[null,36,102,2,2]
[null,42,102,2,2]
[null,48,102,2,2]
[null,54,102,2,2]
[null,60,102,2,2]
[null,66,102,2,2]
[null,72,102,3,3]
[null,78,102,3,3]
[null,84,102,3,3]
[null,12,108,2,2]
[null,{"$f":"B267+6","v":18},108,2,2]
[null,24,108,2,2]
[null,30,108,2,2]
[null,36,108,2,2]
[null,42,108,2,2]
[null,48,108,2,2]
[null,54,108,2,2]
[null,60,108,2,2]
[null,66,108,3,3]
[null,72,108,3,3]
[null,78,108,3,3]
[null,84,108,3,3]
[null,12,114,2,2]
[null,{"$f":"B280+6","v":18},114,2,2]
[null,24,114,2,2]
[null,30,114,2,2]
[null,36,114,2,2]
[null,42,114,2,2]
[null,48,114,2,2]
[null,54,114,2,2]
[null,60,114,2,2]
[null,66,114,3,3]
[null,72,114,3,3]
[null,78,114,3,3]
[null,12,120,2,2]
[null,{"$f":"B292+6","v":18},120,2,2]
[null,24,120,2,2]
[null,30,120,2,2]
[null,36,120,2,2]
[null,42,120,2,2]
[null,48,120,2,2]
[null,54,120,2,2]
[null,60,120,3,3]
[null,66,120,3,3]
[null,72,120,3,3]
[null,78,120,3,3]
[null,12,126,2,2]
[null,{"$f":"B304+6","v":18},126,2,2]
[null,24,126,2,2]
[null,30,126,2,2]
[null,36,126,2,2]
[null,42,126,2,2]
[null,48,126,2,2]
[null,54,126,2,2]
[null,60,126,3,3]
[null,66,126,3,3]
[null,72,126,3,3]
[null,12,132,2,2]
[null,{"$f":"B315+6","v":18},132,2,2]
[null,{"$f":"B316+6","v":24},132,2,2]
[null,{"$f":"B317+6","v":30},132,2,2]
[null,{"$f":"B318+6","v":36},132,2,2]
[null,{"$f":"B319+6","v":42},132,2,2]
[null,12,138,2,2]
[null,{"$f":"B321+6","v":18},138,2,2]
[null,24,138,2,2]
[null,30,138,2,2]
[null,36,138,2,2]
[null,42,138,2,2]
[null,48,138,2,2]
[null,54,138,3,3]
[null,60,138,3,3]
[null,66,138,3,3]
[null,12,144,2,2]
[null,{"$f":"B331+6","v":18},144,2,2]
[null,24,144,2,2]
[null,30,144,2,2]
[null,36,144,2,2]
[null,42,144,2,2]
[null,48,144,2,2]
[null,54,144,3,3]
[null,60,144,3,3]
[null,66,144,3,3]
[null,72,144,4,4]
[null,78,144,4,4]
[null,84,144,4,4]
[null,12,150,2,2]
[null,{"$f":"B344+6","v":18},150,2,2]
[null,24,150,2,2]
[null,30,150,2,2]
[null,36,150,2,2]
[null,42,150,2,2]
[null,48,150,2,2]
[null,54,150,3,3]
[null,60,150,3,3]
[null,66,150,3,3]
[null,72,150,4,4]
[null,78,150,4,4]
[null,12,156,2,2]
[null,{"$f":"B356+6","v":18},156,2,2]
[null,24,156,2,2]
[null,30,156,2,2]
[null,36,156,2,2]
[null,42,156,2,2]
[null,48,156,2,2]
[null,54,156,3,3]
[null,60,156,3,3]
[null,66,156,4,4]
[null,72,156,4,4]
[null,78,156,4,4]
[null,12,162,2,2]
[null,{"$f":"B368+6","v":18},162,2,2]
[null,24,162,2,2]
[null,30,162,2,2]
[null,36,162,2,2]
[null,42,162,2,2]
[null,48,162,3,3]
[null,54,162,3,3]
[null,60,162,3,3]
[null,66,162,4,4]
[null,72,162,4,4]
[null,78,162,4,4]
[null,12,168,2,2]
[null,{"$f":"B380+6","v":18},168,2,2]
[null,24,168,2,2]
[null,30,168,2,2]
[null,36,168,2,2]
[null,42,168,2,2]
[null,48,168,3,3]
[null,54,168,3,3]
[null,60,168,3,3]
[null,66,168,4,4]
[null,72,168,4,4]
[null,12,174,2,2]
[null,{"$f":"B391+6","v":18},174,2,2]
[null,24,174,2,2]
[null,30,174,2,2]
[null,36,174,2,2]
[null,42,174,2,2]
[null,48,174,3,3]
[null,54,174,3,3]
[null,60,174,3,3]
[null,66,174,4,4]
[null,72,174,4,4]
[null,12,180,2,2]
[null,{"$f":"B402+6","v":18},180,2,2]
[null,24,180,2,2]
[null,30,180,2,2]
[null,36,180,2,2]
[null,42,180,2,2]
[null,48,180,3,3]
[null,54,180,3,3]
[null,60,180,4,4]
[null,66,180,4,4]
[null,72,180,4,4]

{"sheet":"POSTS30","index":5,"n_rows":432,"n_cols":5,"rows_kept":432,"cut":false,"hidden":true,"merged":[[1,1,1,4],[3,1,3,2],[2,3,3,3],[2,4,3,4]]}
[]
[null,"3.0# POSTS"]
[null,"HEIGHT ","LENGTH","V-POST","K-POST"]
[null,"INCH"]
[null,12,12,1,0]
[null,18,12,1,0]
[null,24,12,1,0]
[null,30,12,1,0]
[null,36,12,2,0]
[null,42,12,2,0]
[null,48,12,2,0]
[null,54,12,2,0]
[null,60,12,2,0]
[null,66,12,2,0]
[null,72,12,2,1]
[null,78,12,2,1]
[null,84,12,2,1]
[null,90,12,2,1]
[null,96,12,2,1]
[null,102,12,2,1]
[null,108,12,2,1]
[null,114,12,2,1]
[null,120,12,2,1]
[null,126,12,2,1]
[null,132,12,2,1]
[null,138,12,2,1]
[null,144,12,2,1]
[null,150,12,2,1]
[null,12,18,1,0]
[null,18,18,1,0]
[null,24,18,1,0]
[null,30,18,2,0]
[null,36,18,2,0]
[null,42,18,2,0]
[null,48,18,2,1]
[null,54,18,2,1]
[null,60,18,2,1]
[null,66,18,2,1]
[null,72,18,2,1]
[null,78,18,2,1]
[null,84,18,2,1]
[null,90,18,2,1]
[null,96,18,2,1]
[null,102,18,2,1]
[null,108,18,2,1]
[null,114,18,2,1]
[null,120,18,2,1]
[null,126,18,2,1]
[null,132,18,2,1]
[null,138,18,2,2]
[null,144,18,2,2]
[null,150,18,2,2]
[null,12,24,1,0]
[null,18,24,1,0]
[null,24,24,2,0]
[null,30,24,2,0]
[null,36,24,2,0]
[null,42,24,2,1]
[null,48,24,2,1]
[null,54,24,2,1]
[null,60,24,2,1]
[null,66,24,2,1]
[null,72,24,2,1]
[null,78,24,2,1]
[null,84,24,2,1]
[null,90,24,2,1]
[null,96,24,2,1]
[null,102,24,2,1]
[null,108,24,2,1]
[null,114,24,2,2]
[null,120,24,2,2]
[null,126,24,2,2]
[null,132,24,2,2]
[null,138,24,2,2]
[null,144,24,2,2]
[null,150,24,2,2]
[null,12,30,1,0]
[null,18,30,2,0]
[null,24,30,2,0]
[null,30,30,2,0]
[null,36,30,2,1]
[null,42,30,2,1]
[null,48,30,2,1]
[null,54,30,2,1]
[null,60,30,2,1]
[null,66,30,2,1]
[null,72,30,2,1]
[null,78,30,2,1]
[null,84,30,2,1]
[null,90,30,2,1]
[null,96,30,2,1]
[null,102,30,2,2]
[null,108,30,2,2]
[null,114,30,2,2]
[null,120,30,2,2]
[null,126,30,2,2]
[null,132,30,2,2]
[null,138,30,2,2]
[null,144,30,2,2]
[null,12,36,2,0]
[null,18,36,2,0]
[null,24,36,2,0]
[null,30,36,2,1]
[null,36,36,2,1]
[null,42,36,2,1]
[null,48,36,2,1]
[null,54,36,2,1]
[null,60,36,2,1]
[null,66,36,2,1]
[null,72,36,2,1]
[null,78,36,2,1]
[null,84,36,2,1]
[null,90,36,2,2]
[null,96,36,2,2]
[null,102,36,2,2]
[null,108,36,2,2]
[null,114,36,2,2]
[null,120,36,2,2]
[null,126,36,2,2]
[null,132,36,2,2]
[null,12,42,2,0]
[null,18,42,2,0]
[null,24,42,2,1]
[null,30,42,2,1]
[null,36,42,2,1]
[null,42,42,2,1]
[null,48,42,2,1]
[null,54,42,2,1]
[null,60,42,2,1]
[null,66,42,2,1]
[null,72,42,2,1]
[null,78,42,2,1]
[null,84,42,2,2]
[null,90,42,2,2]
[null,96,42,2,2]
[null,102,42,2,2]
[null,108,42,2,2]
[null,114,42,2,2]
[null,120,42,2,2]
[null,12,48,2,0]
[null,18,48,2,0]
[null,24,48,2,1]
[null,30,48,2,1]
[null,36,48,2,1]
[null,42,48,2,1]
[null,48,48,2,1]
[null,54,48,2,1]
[null,60,48,2,1]
[null,66,48,2,1]
[null,72,48,2,1]
[null,78,48,2,2]
[null,84,48,2,2]
[null,90,48,2,2]
[null,96,48,2,2]
[null,102,48,2,2]
[null,108,48,2,2]
[null,12,54,2,0]
[null,18,54,2,1]
[null,24,54,2,1]
[null,30,54,2,1]
[null,36,54,2,1]
[null,42,54,2,1]
[null,48,54,2,1]
[null,54,54,2,1]
[null,60,54,2,1]
[null,66,54,2,1]
[null,72,54,2,2]
[null,78,54,2,2]
[null,84,54,2,2]
[null,90,54,2,2]
[null,96,54,2,2]
[null,102,54,2,2]
[null,12,60,2,0]
[null,18,60,2,1]
[null,24,60,2,1]
[null,30,60,2,1]
[null,36,60,2,1]
[null,42,60,2,1]
[null,48,60,2,1]
[null,54,60,2,1]
[null,60,60,2,1]
[null,66,60,2,2]
[null,72,60,2,2]
[null,78,60,2,2]
[null,84,60,2,2]
[null,90,60,2,2]
[null,96,60,2,2]
[null,12,66,3,0]
[null,18,66,2,2]
[null,24,66,2,2]
[null,30,66,2,2]
[null,36,66,2,2]
[null,42,66,2,2]
[null,48,66,2,2]
[null,54,66,2,2]
[null,60,66,2,2]
[null,66,66,2,2]
[null,72,66,2,2]
[null,78,66,2,2]
[null,84,66,2,2]
[null,90,66,2,2]
[null,12,72,3,0]
[null,18,72,2,2]
[null,24,72,2,2]
[null,30,72,2,2]
[null,36,72,2,2]
[null,42,72,2,2]
[null,48,72,2,2]
[null,54,72,2,2]
[null,60,72,2,2]
[null,66,72,2,2]
[null,72,72,2,2]
[null,78,72,2,2]
[null,84,72,2,2]
[null,12,78,3,0]
[null,18,78,2,2]
[null,24,78,2,2]
[null,30,78,2,2]
[null,36,78,2,2]
[null,42,78,2,2]
[null,48,78,2,2]
[null,54,78,2,2]
[null,60,78,2,2]
[null,66,78,2,2]
[null,72,78,2,2]
[null,78,78,2,2]
[null,12,84,3,0]
[null,18,84,2,2]
[null,24,84,2,2]
[null,30,84,2,2]
[null,36,84,2,2]
[null,42,84,2,2]
[null,48,84,2,2]
[null,54,84,2,2]
[null,60,84,2,2]
[null,66,84,2,2]
[null,72,84,2,2]
[null,78,84,2,2]
[null,12,90,3,0]
[null,18,90,2,2]
[null,24,90,2,2]
[null,30,90,2,2]
[null,36,90,2,2]
[null,42,90,2,2]
[null,48,90,2,2]
[null,54,90,2,2]
[null,60,90,2,2]
[null,66,90,2,2]
[null,72,90,2,2]
[null,12,96,3,0]
[null,18,96,2,2]
[null,24,96,2,2]
[null,30,96,2,2]
[null,36,96,2,2]
[null,42,96,2,2]
[null,48,96,2,2]
[null,54,96,2,2]
[null,60,96,2,2]
[null,66,96,2,2]
[null,72,96,2,2]
[null,12,102,3,0]
[null,18,102,2,2]
[null,24,102,2,2]
[null,30,102,2,2]
[null,36,102,2,2]
[null,42,102,2,2]
[null,48,102,2,2]
[null,54,102,2,2]
[null,60,102,2,2]
[null,66,102,2,2]
[null,72,102,3,3]
[null,78,102,3,3]
[null,84,102,3,3]
[null,90,102,3,3]
[null,96,102,3,3]
[null,12,108,3,0]
[null,18,108,2,2]
[null,24,108,2,2]
[null,30,108,2,2]
[null,36,108,2,2]
[null,42,108,2,2]
[null,48,108,2,2]
[null,54,108,2,2]
[null,60,108,2,2]
[null,66,108,2,2]
[null,72,108,3,3]
[null,78,108,3,3]
[null,84,108,3,3]
[null,90,108,3,3]
[null,12,114,3,0]
[null,18,114,2,2]
[null,24,114,2,2]
[null,30,114,2,2]
[null,36,114,2,2]
[null,42,114,2,2]
[null,48,114,2,2]
[null,54,114,2,2]
[null,60,114,2,2]
[null,66,114,3,3]
[null,72,114,3,3]
[null,78,114,3,3]
[null,84,114,3,3]
[null,12,120,3,0]
[null,18,120,2,2]
[null,24,120,2,2]
[null,30,120,2,2]
[null,36,120,2,2]
[null,42,120,2,2]
[null,48,120,2,2]
[null,54,120,2,2]
[null,60,120,2,2]
[null,66,120,3,3]
[null,72,120,3,3]
[null,78,120,3,3]
[null,12,126,2,2]
[null,18,126,2,2]
[null,24,126,2,2]
[null,30,126,2,2]
[null,36,126,2,2]
[null,42,126,2,2]
[null,48,126,2,2]
[null,54,126,2,2]
[null,60,126,2,2]
[null,66,126,3,3]
[null,72,126,3,3]
[null,78,126,3,3]
[null,12,132,2,2]
[null,18,132,2,2]
[null,24,132,2,2]
[null,30,132,2,2]
[null,36,132,2,2]
[null,42,132,2,2]
[null,48,132,2,2]
[null,54,132,2,2]
[null,60,132,3,3]
[null,66,132,3,3]
[null,72,132,3,3]
[null,12,138,2,2]
[null,18,138,2,2]
[null,24,138,2,2]
[null,30,138,2,2]
[null,36,138,2,2]
[null,42,138,2,2]
[null,48,138,2,2]
[null,54,138,2,2]
[null,60,138,3,3]
[null,66,138,3,3]
[null,72,138,3,3]
[null,12,144,2,2]
[null,18,144,2,2]
[null,24,144,2,2]
[null,30,144,2,2]
[null,36,144,2,2]
[null,42,144,2,2]
[null,48,144,2,2]
[null,54,144,2,2]
[null,60,144,3,3]
[null,66,144,3,3]
[null,72,144,3,3]
[null,78,144,4,4]
[null,84,144,4,4]
[null,12,150,2,2]
[null,18,150,2,2]
[null,24,150,2,2]
[null,30,150,2,2]
[null,36,150,2,2]
[null,42,150,2,2]
[null,48,150,2,2]
[null,54,150,3,3]
[null,60,150,3,3]
[null,66,150,3,3]
[null,72,150,4,4]
[null,78,150,4,4]
[null,84,150,4,4]
[null,12,156,2,2]
[null,18,156,2,2]
[null,24,156,2,2]
[null,30,156,2,2]
[null,36,156,2,2]
[null,42,156,2,2]
[null,48,156,2,2]
[null,54,156,3,3]
[null,60,156,3,3]
[null,66,156,3,3]
[null,72,156,4,4]
[null,78,156,4,4]
[null,12,162,2,2]
[null,18,162,2,2]
[null,24,162,2,2]
[null,30,162,2,2]
[null,36,162,2,2]
[null,42,162,2,2]
[null,48,162,2,2]
[null,54,162,3,3]
[null,60,162,3,3]
[null,66,162,3,3]
[null,72,162,4,4]
[null,78,162,4,4]
[null,12,168,2,2]
[null,18,168,2,2]
[null,24,168,2,2]
[null,30,168,2,2]
[null,36,168,2,2]
[null,42,168,2,2]
[null,48,168,2,2]
[null,54,168,3,3]
[null,60,168,3,3]
[null,66,168,4,4]
[null,72,168,4,4]
[null,78,168,4,4]
[null,12,174,2,2]
[null,18,174,2,2]
[null,24,174,2,2]
[null,30,174,2,2]
[null,36,174,2,2]
[null,42,174,2,2]
[null,48,174,3,3]
[null,54,174,3,3]
[null,60,174,3,3]
[null,66,174,4,4]
[null,72,174,4,4]
[null,12,180,2,2]
[null,18,180,2,2]
[null,24,180,2,2]
[null,30,180,2,2]
[null,36,180,2,2]
[null,42,180,2,2]
[null,48,180,3,3]
[null,54,180,3,3]
[null,60,180,3,3]
[null,66,180,4,4]
[null,72,180,4,4]

{"sheet":"ESGNPOSTS","index":6,"n_rows":27,"n_cols":5,"rows_kept":27,"cut":false,"hidden":true,"merged":[[3,1,3,4],[1,1,1,4]]}
[]
[null,"E SIGN POST SPACING"]
[null,"WIDTH","2 POSTS","3 POSTS","4 POSTS"]
[null,"INCH"]
[null,48,30]
[null,{"$f":"B5+6","v":54},30]
[null,{"$f":"B6+6","v":60},36]
[null,66,36]
[null,72,42]
[null,78,48]
[null,84,48]
[null,90,54]
[null,96,54]
[null,102,null,36]
[null,108,null,36]
[null,114,null,42]
[null,120,null,42]
[null,126,null,42]
[null,132,null,48]
[null,138,null,48]
[null,144,null,54]
[null,150,null,null,42]
[null,156,null,null,42]
[null,162,null,null,42]
[null,168,null,null,42]
[null,174,null,null,48]
[null,180,null,null,48]

{"sheet":"POSTSPACING","index":7,"n_rows":29,"n_cols":5,"rows_kept":29,"cut":false,"hidden":true,"merged":[[3,1,3,4],[1,1,1,4]]}
[]
[null,"SIGN POST SPACING"]
[null,"WIDTH","2 POSTS","3 POSTS","4 POSTS"]
[null,"INCH"]
[null,36,24]
[null,{"$f":"B5+6","v":42},30]
[null,48,30]
[null,54,30]
[null,60,36]
[null,66,42]
[null,72,42]
[null,78,54]
[null,84,54]
[null,90,54]
[null,96,54]
[null,102,60,45]
[null,108,66,45]
[null,114,66,45]
[null,120,72,45]
[null,126,78,45]
[null,132,78,45]
[null,138,78,48]
[null,144,90,51,45]
[null,150,90,54,45]
[null,156,90,54,45]
[null,162,96,57,48]
[null,168,96,60,48]
[null,174,102,63,54]
[null,180,108,63,54]

{"sheet":"PICILINKS","index":8,"n_rows":295,"n_cols":8,"rows_kept":295,"cut":false,"hidden":true,"merged":[]}
["Rev","Item_Number","Short_Description","Units_Code"]
[null,"2102.501/00010","PAVEMENT MARKING REMOVAL","S F"]
["F","2104.509/00170","REMOVE DELINEATOR","EACH","DELREM"]
["F","2104.509/00180","REMOVE MARKER","EACH"]
[null,"2104.509/00199","REMOVE SIGN","EACH"]
[null,"2104.509/00200","REMOVE SIGN TYPE A (BRIDGE MOUNTED)","EACH"]
["x","2104.509/00201","REMOVE SIGN TYPE A","EACH","AREM","ABASRM"]
["F","2104.509/00203","REMOVE SIGN TYPE C","EACH"]
["F","2104.509/00205","REMOVE SIGN TYPE D","EACH","DREM"]
[null,"2104.509/00206","REMOVE SIGN TYPE EA","EACH"]
[null,"2104.509/00207","REMOVE SIGN TYPE EO","EACH"]
[null,"2104.509/00208","REMOVE SIGN TYPE OH (BRIDGE MOUNTED)","EACH"]
[null,"2104.509/00209","REMOVE SIGN TYPE OH","EACH"]
[null,"2104.509/00210","REMOVE SIGN TYPE D (BRIDGE MOUNTED)","EACH"]
[null,"2104.509/00220","REMOVE SIGN TYPE SPECIAL","EACH","AEXTRM"]
[null,"2104.509/00250","REMOVE SIGN PANEL OVERLAY TYPE A","EACH"]
[null,"2104.509/00251","REMOVE SIGN PANEL OVERLAY TYPE OH","EACH"]
[null,"2104.509/00252","REMOVE SIGN PANEL OVERLAY TYPE EA","EACH"]
[null,"2104.509/00253","REMOVE SIGN PANEL OVERLAY TYPE EO","EACH"]
[null,"2104.509/00410","REMOVE SIGN BASE","EACH"]
[null,"2104.509/00411","REMOVE SIGN BASE-TYPE OH","EACH"]
[null,"2104.509/00412","REMOVE SIGN BASE-TYPE A","EACH","ABASRM"]
[null,"2104.509/00497","REMOVE SIGN PANEL TYPE C","EACH"]
[null,"2104.509/00498","REMOVE SIGN PANEL TYPE D","EACH"]
[null,"2104.509/00499","REMOVE SIGN PANEL TYPE A","EACH",null,"AEXTRM"]
[null,"2104.509/00500","REMOVE SIGN PANEL TYPE OH","EACH"]
[null,"2104.509/00660","REMOVE HISTORIC PLAQUE","EACH"]
[null,"2104.509/00700","REMOVE WOOD INFORMATION SIGN","EACH"]
[null,"2104.523/00067","SALVAGE HISTORIC MARKER","EACH"]
[null,"2104.523/00068","SALVAGE HISTORIC PLAQUE","EACH"]
[null,"2104.523/00069","SALVAGE DEDICATION PLAQUE","EACH"]
["F","2104.523/00072","SALVAGE MARKER","EACH","DELS&I"]
["F","2104.523/00075","SALVAGE DELINEATOR","EACH","DELS&I"]
[null,"2104.523/00078","SALVAGE GUIDE POST TYPE A","EACH"]
[null,"2104.523/00080","SALVAGE GUIDE POST TYPE B","EACH"]
[null,"2104.523/00475","SALVAGE PED PUSH BUTTON AND SIGN","EACH"]
[null,"2104.523/00530","SALVAGE R10-10 SIGN","EACH"]
[null,"2104.523/00531","SALVAGE R11-2 SIGN","EACH"]
[null,"2104.523/00537","SALVAGE SIGN SUPPORT","EACH"]
[null,"2104.523/00538","SALVAGE COMMERCIAL SIGN","EACH"]
[null,"2104.523/00539","SALVAGE SIGN","EACH"]
["x","2104.523/00540","SALVAGE SIGN TYPE A","EACH","ASAL","AS&IHP"]
["x","2104.523/00543","SALVAGE SIGN TYPE C","EACH","CS&I","CSAL"]
["x","2104.523/00544","SALVAGE SIGN TYPE D","EACH","DS&I","DSAL"]
[null,"2104.523/00547","SALVAGE SIGN TYPE EA","EACH"]
[null,"2104.523/00548","SALVAGE SIGN TYPE EO","EACH"]
[null,"2104.523/00549","SALVAGE SIGN TYPE OH (BR MOUNTED)","EACH"]
[null,"2104.523/00550","SALVAGE SIGN TYPE OH","EACH"]
[null,"2104.523/00560","SALVAGE SIGN TYPE SPECIAL","EACH"]
[null,"2104.523/00593","SALVAGE SIGN PANEL TYPE A","EACH","ASPNLSAL","ASPNLIN","ASPNLSAL"]
[null,"2104.523/00594","SALVAGE SIGN PANEL TYPE A (EXTRUD)","EACH","AEXTSA","AEXTRM","ASPNLSAL"]
[null,"2104.523/00595","SALVAGE SIGN PANEL TYPE A (FLT SHT)","EACH"]
[null,"2104.523/00598","SALVAGE SIGN PANEL TYPE EA","EACH"]
[null,"2104.523/00600","SALVAGE SIGN PANEL TYPE EO","EACH"]
[null,"2104.523/00601","SALVAGE SIGN PANEL TYPE OH","EACH"]
[null,"2104.523/00605","SALVAGE SIGN PANEL TP OH (FLT SHT)","EACH"]
[null,"2104.523/00606","SALVAGE SIGN PANEL TYPE C","EACH"]
[null,"2104.523/00608","SALVAGE SIGN PANEL TYPE D","EACH"]
[null,"2104.523/00610","SALVAGE SIGN PANEL TYPE D (BR MTD)","EACH"]
[null,"2104.523/00652","SALVAGE SIGN POST TYPE B","EACH"]
[null,"2104.602/00025","RELOCATE COMMERCIAL SIGN","EACH"]
[null,"2232.602/00010","MILLED RUMBLE STRIPS","EACH"]
[null,"2232.603/00025","MILLED RUMBLE STRIPS","L F"]
[null,"2232.603/00030","MILLED RUMBLE STRIPS-INTERMITTENT","L F"]
[null,"2232.603/00035","MILLED RUMBLE STRIPS-CENTERLINE","L F"]
[null,"2554.602/00080","REPLACE DELINEATOR TYPE SPEC (NEW)","EACH"]
[null,"2554.602/00081","REPLACE DELINEATOR TYPE SPEC(SALV)","EACH"]
[null,"2563.601/00210","STOP SIGN RELOCATION","LS"]
[null,"2563.601/00220","SIGN REMOVAL","LS"]
[null,"2563.613/01200","SIGNS BY SQUARE INCH","UDAY"]
[null,"2563.613/01220","24\"X24\" SIGN","UDAY"]
[null,"2563.613/01221","24\"X24\" SIGN WITH SUPPORTS","UDAY"]
[null,"2563.613/01441","4'X4' SIGN WITH SUPPORTS","UDAY"]
[null,"2563.618/00011","CONSTRUCTION SIGN-SPECIAL","S F"]
[null,"2563.618/00024","FURNISH, INSTALL & REMOVE TYPE D SIGNS","S F"]
[null,"2563.618/00030","SIGN PANEL COVER","S F"]
[null,"2564.511/00010","CONCRETE FOOTINGS (TYPE OH SPREAD)","C Y"]
[null,"2564.511/00011","CONCRETE FOOTINGS (TYPE A SIGNS)","C Y"]
[null,"2564.511/00012","CONCRETE FOOTINGS (TYPE OH SHAFT)","C Y"]
[null,"2564.511/00013","CONCRETE FOOTINGS DESIGN SPECIAL","C Y"]
[null,"2564.515/00010","SIGN SUPPORT","EACH"]
[null,"2564.515/00011","SIGN SUPPORT TYPE A","EACH"]
[null,"2564.515/00020","SIGN SUPPORT SIGN OH","EACH"]
[null,"2564.515/00030","SIGN SUPPORT CANTILEVER","EACH"]
["x","2564.522/00111","STRUCT STEEL-POSTS FOR TYPE A SIGNS","LB","AS&IHP","ASIGNHP"]
[null,"2564.522/00121","STRUCT STEEL-POSTS FOR OH SIGNS (A)","LB"]
[null,"2564.522/00122","STRUCT STEEL-POSTS FOR OH SIGNS (B)","LB"]
[null,"2564.522/00221","STRUCT STEEL-TRUSSES FOR OH SIGNS (A)","LB"]
[null,"2564.522/00222","STRUCT STEEL-TRUSSES FOR OH SIGNS (B)","LB"]
[null,"2564.522/00225","STR STEEL-TRUSSES FOR OH SIGNS BR MTD","LB"]
[null,"2564.522/00226","STR STEEL-TRUS FOR OH SIGNS (A) BR MTD","LB"]
[null,"2564.522/00228","STR STEEL-TRUSSES FOR A SIGNS BR MTD","LB"]
[null,"2564.522/00251","STR STEEL-SIGN CMS 100 A (BR MTD)","LB"]
[null,"2564.522/00322","STR STEEL-WLKWY SPRT FOR OH SIGNS (B)","LB"]
[null,"2564.522/00422","STR STEEL-WLKWY GRTNG FOR OH SIGNS (B)","LB"]
[null,"2564.522/00522","STR STEEL-PANEL MT PST FOR OH SIGNS (B)","LB"]
[null,"2564.522/00530","STR STEEL-SIGN BRKT OH SIGNS (B)","LB"]
["x","2564.524/00010","MODIFY POST","EACH","APSTMOD"]
[null,"2564.531/00105","SIGN PANELS TYPE SPECIAL","S F"]
["x","2564.531/00110","SIGN PANELS TYPE A","S F","ASPNL","OL","AEXT","ASIGNHP"]
["x","2564.531/00111","SIGN PANELS TYPE A (EXTRUDED)","S F"]
["x","2564.531/00112","SIGN PANELS TYPE A (FLAT SHEET)","S F"]
["x","2564.531/00130","SIGN PANELS TYPE C","S F","CSIGN"]
["x","2564.531/00140","SIGN PANELS TYPE D","S F","DSIGN","OL"]
[null,"2564.531/00141","SIGN PANELS TYPE D-SIGNALS","S F"]
[null,"2564.531/00142","SIGN PANELS TYPE D-SIGNAL SYS A","S F"]
[null,"2564.531/00143","SIGN PANELS TYPE D-SIGNAL SYS B","S F"]
[null,"2564.531/00144","SIGN PANELS TYPE D-SIGNAL SYS C","S F"]
[null,"2564.531/00145","SIGN PANELS TYPE D-SIGNAL SYS D","S F"]
[null,"2564.531/00146","SIGN PANELS TYPE D-SIGNAL SYS E","S F"]
[null,"2564.531/00149","SIGN PANELS TYPE D-SIGNAL SYS I","S F"]
[null,"2564.531/00151","SIGN PANELS TYPE EA","S F"]
[null,"2564.531/00158","SIGN PANELS TYPE EO","S F"]
[null,"2564.531/00159","SIGN PANELS TYPE EO (EXTRUDED)","S F"]
[null,"2564.531/00160","SIGN PANELS TYPE EO (LOUVERED)","S F"]
[null,"2564.531/00189","SIGN PANELS TYPE OVERLAY","S F","OL","APSTCLP"]
[null,"2564.531/00190","SIGN PANELS TYPE OH","S F","OL"]
[null,"2564.531/00191","SIGN PANELS TYPE OH (EXTRUDED)","S F"]
[null,"2564.531/00192","SIGN PANELS TYPE OH (LOUVERED)","S F"]
[null,"2564.531/00193","SIGN PANELS TYPE OH (FLAT SHEET)","S F"]
[null,"2564.533/00130","FURNISH SIGN PANELS TYPE C","S F"]
[null,"2564.533/00140","FURNISH SIGN PANELS TYPE D","S F"]
[null,"2564.533/00190","FURNISH SIGN PANELS TYPE OVERLAY","S F"]
[null,"2564.533/00195","FURNISH SIGN PANELS TYPE OH","S F"]
["x","2564.534/00010","SAW SIGN PANELS","L F"]
[null,"2564.534/00011","SAW SIGN PANELS TYPE A","L F","ASPNLSAW"]
[null,"2564.534/00016","SAW SIGN PANELS TYPE OH","L F"]
["x","2564.534/00017","SAW SIGN PANELS TYPE OH (EXTRUDED)","L F"]
["x","2564.535/00010","SIGN PANEL OVERLAY TYPE A","S F","ASPNLOL","APSTCLP","APSTMOD","OL"]
[null,"2564.535/00100","SIGN PANEL OVERLAY TYPE OH","S F","OL"]
[null,"2564.535/00110","SIGN PANEL OVERLAY TYPE EO","S F"]
[null,"2564.535/00120","SIGN PANEL OVERLAY TYPE EA","S F"]
[null,"2564.536/00010","INSTALL SIGN PANEL","EACH"]
["x","2564.536/00011","INSTALL SIGN PANEL TYPE A","EACH","ASPNLIN"]
["x","2564.536/00013","INSTALL SIGN PANEL TYPE C","EACH"]
[null,"2564.536/00014","INSTALL SIGN PANEL TYPE D","EACH"]
[null,"2564.536/00020","INSTALL SIGN PANEL TYPE OH","EACH"]
[null,"2564.536/00030","INSTALL SIGN PANEL TYPE EO","EACH"]
["x","2564.537/00010","INSTALL SIGN TYPE A","EACH","AS&IHP"]
["x","2564.537/00013","INSTALL SIGN TYPE C","EACH","CS&I","CINS"]
["x","2564.537/00014","INSTALL SIGN TYPE D","EACH","DS&I","DINS"]
[null,"2564.537/00020","INSTALL SIGN TYPE OH","EACH"]
[null,"2564.537/00021","INSTALL SIGN TYPE OH (BR MOUNT)","EACH"]
[null,"2564.537/00022","INSTALL SIGN TYPE CMS (BR MOUNT)","EACH"]
[null,"2564.537/00030","INSTALL SIGN TYPE SPECIAL","EACH"]
[null,"2564.537/00040","INSTALL SIGN TYPE EO","EACH"]
[null,"2564.537/00045","INSTALL SIGN TYPE EA","EACH"]
[null,"2564.538/00009","SIGN LEGEND REVISION","EACH"]
[null,"2564.538/00010","SIGN LEGEND REVISION TYPE EA","EACH"]
[null,"2564.538/00015","SIGN LEGEND REVISION TYPE EO","EACH"]
[null,"2564.538/00020","SIGN LEGEND REVISION TYPE OH","EACH"]
[null,"2564.538/00021","SIGN LEGEND REVISION TYPE OH-SPECIAL","EACH"]
[null,"2564.538/00031","SIGN LEGEND REVISION TYPE A","EACH","ALGNDREV"]
[null,"2564.538/00034","SIGN LEGEND REVISION TYPE D","EACH"]
[null,"2564.539/00010","OVERHEAD SIGN IDENTIFICATION PLATE","EACH"]
[null,"2564.540/00010","EXTEND WALKWAY SUPPORT","EACH"]
[null,"2564.540/00011","EXTEND WALKWAY SUPPORT (A)","EACH"]
[null,"2564.540/00012","EXTEND WALK SUPPORT (B)","EACH"]
["x","2564.550/00010","DELINEATOR","EACH","DELIN"]
["x","2564.550/00011","DELINEATOR TYPE SPECIAL","EACH","DELIN"]
["x","2564.550/00020","DELINEATOR TYPE ONE TENTH MILE","EACH","DELIN"]
["x","2564.550/00030","DELINEATOR TYPE CYLINDER STYLE","EACH","DELIN"]
["x","2564.550/00040","DELINEATOR TYPE ALIGNMENT","EACH","DELIN"]
["x","2564.550/00111","DELINEATOR TYPE X4-6","EACH","DELIN"]
["x","2564.551/00010","REFERENCE POST MARKER","EACH","RPM"]
["x","2564.552/00010","HAZARD MARKER X4-2","EACH","DELIN"]
["x","2564.553/00010","CLEARANCE MARKER X4-4","EACH","DELIN"]
["x","2564.554/00010","SNOW PLOW MARKER X4-5","EACH","DELIN"]
["x","2564.555/00010","END OF ROADWAY MARKER X4-11","EACH","DELIN"]
[null,"2564.601/00100","INTERNALLY LIT SIGNING OH","LS"]
[null,"2564.601/00101","INTERNALLY LIT SIGNING OH A","LS"]
[null,"2564.601/00102","INTERNALLY LIT SIGNING OH B","LS"]
[null,"2564.601/00103","INTERNALLY LIT SIGNING OH C","LS"]
[null,"2564.601/00104","INTERNALLY LIT SIGNING OH D","LS"]
[null,"2564.601/00105","INTERNALLY LIT SIGNING OH E","LS"]
[null,"2564.601/00106","INTERNALLY LIT SIGNING OH F","LS"]
[null,"2564.601/00107","INTERNALLY LIT SIGNING OH G","LS"]
[null,"2564.601/00108","INTERNALLY LIT SIGNING OH H","LS"]
[null,"2564.601/00109","INTERNALLY LIT SIGNING OH I","LS"]
[null,"2564.601/00110","INTERNALLY LIT SIGNING OH J","LS"]
[null,"2564.601/00111","INTERNALLY LIT SIGNING OH K","LS"]
[null,"2564.601/00112","INTERNALLY LIT SIGNING OH L","LS"]
[null,"2564.602/00001","INSTALL SIGN COLLAR","EACH"]
[null,"2564.602/00005","SIGN COLLAR","EACH"]
[null,"2564.602/00008","CONC PEDESTAL EXTENSION DES SPEC","EACH"]
["x","2564.602/00010","INSTALL DELINEATOR","EACH","DELS&I"]
[null,"2564.602/00015","INSTALL SIGN","EACH"]
[null,"2564.602/00018","INSTALL STEEL POST","EACH"]
[null,"2564.602/00023","SALV & INST WILDLIFE WARNING REFLECTER","EACH"]
[null,"2564.602/00024","SALVAGE AND INSTALL OH SIGNS","EACH"]
[null,"2564.602/00025","SALVAGE, MOD & REINSTALL OH SIGN","EACH"]
[null,"2564.602/00026","SALVAGE AND REINSTALL OH SIGN","EACH"]
[null,"2564.602/00027","SALVAGE, MOD & REINSTALL TYPE A SIGN","EACH",null,"ABASRM","AEXTSA","AEXTRM"]
[null,"2564.602/00031","FOUNDATION SPECIAL OH","EACH"]
[null,"2564.602/00033","MEDIAN SIGN POST ANCHOR","EACH"]
[null,"2564.602/00035","REPAIR SIGN TYPE OH","EACH"]
[null,"2564.602/00036","REPAIR SIGN TYPE OH","EACH"]
[null,"2564.602/00037","SHORTEN PANEL MOUNTING POST","EACH"]
[null,"2564.602/00038","SHORTEN TYPE A SIGN POST","EACH","APSTMOD"]
[null,"2564.602/00042","EXTEND TYPE A SIGN POST","EACH","APSTMOD"]
[null,"2564.602/00046","EXTEND PANEL MOUNTING POST","EACH"]
[null,"2564.602/00049","F&I TRAFFIC WARNING SIGN","EACH"]
[null,"2564.602/00050","F&I MESSAGE BOARD","EACH"]
[null,"2564.602/00055","MICROPRISM BARRIER REFLECTOR","EACH"]
[null,"2564.602/00077","SIGN POST SUPPORT","EACH"]
[null,"2564.602/00079","INSTALL SIGN SUPPORT","EACH"]
[null,"2564.602/00080","SIGN SUPPORT SIGN OH","EACH"]
[null,"2564.602/00082","REPOSITION SIGN PANEL TYPE OH","EACH"]
[null,"2564.602/00083","REPOSITION SIGN PANEL","EACH"]
[null,"2564.602/00087","SIGN SUPPORT CANTILEVER","EACH"]
[null,"2564.602/00100","HIGHWAY ADVISORY RADIO SIGN","EACH"]
[null,"2564.602/00115","MODIFY SIGN TYPE OH (BR MTD)","EACH"]
[null,"2564.602/00120","MODIFY SIGN TYPE OH","EACH"]
[null,"2564.602/00121","MODIFY SIGN TYPE OH A","EACH",null,"AEXTSA","AEXTRM"]
[null,"2564.602/00122","MODIFY SIGN TYPE OH B","EACH"]
[null,"2564.602/00123","MODIFY SIGN TYPE OH C","EACH"]
[null,"2564.602/00140","INSTALL SIGN TRUSS","EACH"]
[null,"2564.602/00141","INSTALL SIGN TRUSS TYPE OH","EACH"]
[null,"2564.602/00151","FEED POINT IDENTIFICATION PLATE","EACH"]
[null,"2564.602/00170","TRAFFIC SIGN WITH POST","EACH"]
[null,"2564.602/00240","FURNISH OH CHANGEABLE MESSAGE SIGN","EACH"]
[null,"2564.602/00250","INSTALL OH CHANGEABLE MESSAGE SIGN","EACH"]
[null,"2564.602/00251","PORTABLE CHANGEABLE MESSAGE SIGN","EACH"]
[null,"2564.602/00252","RELOCATE OH CHANGEABLE MESSAGE SIGN","EACH"]
[null,"2564.602/00253","OH CHANGEABLE MESSAGE SIGN","EACH"]
[null,"2564.602/00255","SKID MOUNTED CHANGEABLE MESSAGE SIGN","EACH"]
[null,"2564.602/00280","ADJUST SIGN STRUCTURE","EACH"]
[null,"2564.602/00290","REFURBISH SIGN","EACH"]
[null,"2564.602/00300","RELOCATE SIGN","EACH"]
[null,"2564.602/00301","RELOCATE SIGN TYPE A","EACH",null,"ABASRM"]
[null,"2564.602/00302","RELOCATE SIGN TYPE B","EACH"]
[null,"2564.602/00303","RELOCATE SIGN TYPE C","EACH"]
[null,"2564.602/00320","INSTALL SIGN TYPE SPECIAL","EACH"]
[null,"2564.602/00370","FURNISH DELINEATOR","EACH"]
[null,"2564.602/00390","FURNISH MILE POST MARKER","EACH"]
[null,"2564.602/00395","FURNISH MARKER","EACH"]
[null,"2564.602/00403","FURNISH TYPE C SIGN","EACH"]
[null,"2564.602/00450","FURNISH SIGN POSTS","EACH"]
[null,"2564.602/00490","FURNISH SIGN PANEL (RR CROSSBUCK)","EACH"]
[null,"2564.602/00491","FURNISH SIGN PANEL (RR CROSSBUCK) SPEC","EACH"]
[null,"2564.602/00493","FURNISH SIGN PANEL (STOP SIGN)","EACH"]
[null,"2564.602/00495","FURNISH SIGN PANEL (TRACK NUMBER SIGN)","EACH"]
[null,"2564.602/00496","F SIGN PANEL(TRACKS OUT OF SERVICE SIGN)","EACH"]
[null,"2564.602/00498","FURNISH SIGN PANEL (EXEMPT SIGN)","EACH"]
[null,"2564.602/00500","F&I SIGN PANEL (RR CROSSBUCK)","EACH"]
[null,"2564.602/00501","F&I SIGN PANEL (RR CROSSBUCK) SPECIAL","EACH"]
[null,"2564.602/00503","F&I SIGN PANEL (STOP SIGN)","EACH"]
[null,"2564.602/00505","F&I SIGN PANEL (TRACK NUMBER SIGN)","EACH"]
[null,"2564.602/00506","F&I SIGN PANEL (__MPH SIGN)","EACH"]
[null,"2564.602/00508","F&I SIGN PANEL (EXEMPT SIGN)","EACH"]
[null,"2564.602/00514","F&I WOOD POST 4\"X6\"X14'","EACH"]
[null,"2564.602/00516","F&I WOOD POST 4\"X6\"X16'","EACH"]
[null,"2564.602/00536","FURNISH WOOD POST 4\"X6\"X16'","EACH"]
[null,"2564.602/00539","FURNISH WOOD POST 4\"X6\"X19'","EACH"]
[null,"2564.602/00550","RETROREFLECTIVE MARKER","EACH"]
[null,"2564.602/00566","F&I WOOD POST 4\"X4\"X16'","EACH"]
[null,"2564.602/00568","F&I WOOD POST 4\"X4\"X18'","EACH"]
[null,"2564.602/00580","CONCRETE FOOTINGS DESIGN SPECIAL","EACH"]
[null,"2564.602/00602","F&I SIGN PANEL TYPE B","EACH"]
[null,"2564.602/00603","F&I SIGN PANEL TYPE C","EACH"]
[null,"2564.602/00604","F&I SIGN PANEL TYPE D","EACH"]
[null,"2564.602/00618","F&I SIGN PANEL TYPE R","EACH"]
[null,"2564.602/00619","F&I SIGN PANEL TYPE S","EACH"]
[null,"2564.602/00621","F&I SIGN PANEL TYPE U","EACH"]
[null,"2564.602/00630","F&I SIGN PANEL TYPE SPECIAL","EACH"]
[null,"2564.602/00700","INTERNALLY LIT SIGN","EACH"]
[null,"2564.602/00704","INTERNALLY LIT SIGN TYPE D","EACH"]
[null,"2564.602/00720","INSTALL MARKER","EACH","DELS&I"]
[null,"2564.602/00825","END OF ROADWAY MARKER X4-11","EACH"]
[null,"2564.603/00005","STRUCTURAL STEEL U-POST","L F"]
[null,"2564.608/00010","STRUCTURAL STEEL 2.5# U-POST","LB"]
[null,"2564.608/00012","STRUCTURAL STEEL 3# U-POST","LB"]
["x","2564.608/00020","FURNISH STRUCTURAL STEEL 2.5# U-POST","LB"]
["x","2564.608/00022","FURNISH STRUCTURAL STEEL 3# U-POST","LB"]
["x","2564.618/00019","SIGN PANELS TYPE OH","S F"]
["x","2564.618/00020","SIGN PANELS TYPE OVERLAY","S F"]
["x","2564.618/00023","SIGN PANELS TYPE C","S F"]
["x","2564.618/00024","SIGN PANELS TYPE D","S F"]
["x","2564.618/00030","F&I SIGN PANEL OVERLAYS TYPE A","S F"]
["x","2564.618/00031","F&I SIGN PANEL OVERLAYS TYPE OH","S F"]
["x","2564.618/00032","F&I SIGN PANEL OVERLAYS TYPE EA","S F"]
["x","2564.618/00033","F&I SIGN PANEL OVERLAYS TYPE EO","S F"]
[null,"2565.602/00310","R9-3A SIGN","EACH"]
[null,"2565.602/00315","R3-2 SIGN (36\"X36\")","EACH"]
[null,"2565.602/00387","R10-12 SIGN (36\"X48\")","EACH"]
[null,"2565.602/00390","R10-12 SIGN (24\"X30\")","EACH"]
["x","2564.541/00010","FRICTION FUSE","EACH","AFF"]
["x","2564.542/00010","KEEPER PLATE","EACH","AKP"]
[null,"9999.999/99999","OTHER?","EACH","AEXTRM","AEXTSA"]
[null,"9999.999/99999","OTHER?","EACH","ANOTES"]
[]
[null,null,"AREM","NOTES"]
[null,null,"DREM","NOTES"]
[null,null,"CREM","COMMENTED OUT"]
[null,null,"DMS&I","NOTES"]

{"sheet":"ACTIVITIES","index":9,"n_rows":65,"n_cols":4,"rows_kept":65,"cut":false,"hidden":false,"merged":[]}
[]
[null,"IN\nPLAN","ACTIVITY\nNO","ACTIVITY DESCRIPTION"]
[null,"x",1,"FURNISH & INSTALL"]
[null,"x",2,"INPLACE"]
[null,null,3,"SALVAGE"]
[null,"x",4,"REMOVE"]
[null,"x",5,"REMOVE SIGN TYPE C"]
[null,"x",6,"INSTALL"]
[null,"x",{"$f":"SUBTOTAL(3,$D$9:D9)+6","v":7},"F & I  SIGN PANEL OVERLAY(S)"]
[null,"x",{"$f":"SUBTOTAL(3,$D$9:D10)+6","v":8},"F & I  SIGN PANEL(S)"]
[null,null,{"$f":"SUBTOTAL(3,$D$9:D11)+6","v":9},"F & I  LEFT SIGN PANEL"]
[null,null,{"$f":"SUBTOTAL(3,$D$9:D12)+6","v":10},"F & I  MIDDLE SIGN PANEL"]
[null,null,{"$f":"SUBTOTAL(3,$D$9:D13)+6","v":11},"F & I  RIGHT SIGN PANEL"]
[null,null,{"$f":"SUBTOTAL(3,$D$9:D14)+6","v":12},"F & I  SIGN PANEL(S) AND PANEL MOUNTING POSTS"]
[null,"x",{"$f":"SUBTOTAL(3,$D$9:D15)+6","v":13},"F & I  LEFT SIGN PANEL AND PANEL MOUNTING POSTS"]
[null,null,{"$f":"SUBTOTAL(3,$D$9:D16)+6","v":14},"F & I  MIDDLE SIGN PANEL AND PANEL MOUNTING POSTS"]
[null,null,{"$f":"SUBTOTAL(3,$D$9:D17)+6","v":15},"F & I  RIGHT SIGN PANEL AND PANEL MOUNTING POSTS"]
[null,"x",{"$f":"SUBTOTAL(3,$D$9:D18)+6","v":16},"F & I  SIGN PANEL OVERLAY(S)"]
[null,null,{"$f":"SUBTOTAL(3,$D$9:D19)+6","v":17},"F & I  SIGN PANEL OVERLAY LEFT SIGN PANEL"]
[null,"x",{"$f":"SUBTOTAL(3,$D$9:D20)+6","v":18},"F & I  SIGN PANEL OVERLAY MIDDLE SIGN PANEL"]
[null,null,{"$f":"SUBTOTAL(3,$D$9:D21)+6","v":19},"F & I  SIGN PANEL OVERLAY RIGHT SIGN PANEL"]
[null,null,{"$f":"SUBTOTAL(3,$D$9:D22)+6","v":20},"SIGN LEGEND REVISION"]
[null,null,{"$f":"SUBTOTAL(3,$D$9:D23)+6","v":21},"SIGN LEGEND REVISION LEFT SIGN PANEL"]
[null,null,{"$f":"SUBTOTAL(3,$D$9:D24)+6","v":22},"SIGN LEGEND REVISION MIDDLE SIGN PANEL"]
[null,null,{"$f":"SUBTOTAL(3,$D$9:D25)+6","v":23},"SIGN LEGEND REVISION RIGHT SIGN PANEL"]
[null,null,{"$f":"SUBTOTAL(3,$D$9:D26)+6","v":24},"SALVAGE SIGN PANEL(S)"]
[null,null,{"$f":"SUBTOTAL(3,$D$9:D27)+6","v":25},"SALVAGE LEFT SIGN PANEL"]
[null,null,{"$f":"SUBTOTAL(3,$D$9:D28)+6","v":26},"SALVAGE MIDDLE SIGN PANEL"]
[null,null,{"$f":"SUBTOTAL(3,$D$9:D29)+6","v":27},"SALVAGE RIGHT SIGN PANEL"]
[null,null,{"$f":"SUBTOTAL(3,$D$9:D30)+6","v":28},"REMOVE SIGN PANEL(S)"]
[null,null,{"$f":"SUBTOTAL(3,$D$9:D31)+6","v":29},"REMOVE LEFT SIGN PANEL"]
[null,null,{"$f":"SUBTOTAL(3,$D$9:D32)+6","v":30},"REMOVE MIDDLE SIGN PANEL"]
[null,null,{"$f":"SUBTOTAL(3,$D$9:D33)+6","v":31},"REMOVE RIGHT SIGN PANEL"]
[null,null,{"$f":"SUBTOTAL(3,$D$9:D34)+6","v":32},"MODIFY PANEL MOUNTING POSTS"]
[null,null,{"$f":"SUBTOTAL(3,$D$9:D35)+6","v":33},"MODIFY PANEL MOUNTING POSTS LEFT SIGN PANEL"]
[null,null,{"$f":"SUBTOTAL(3,$D$9:D36)+6","v":34},"MODIFY PANEL MOUNTING POSTS MIDDLE SIGN PANEL"]
[null,null,{"$f":"SUBTOTAL(3,$D$9:D37)+6","v":35},"MODIFY PANEL MOUNTING POSTS RIGHT SIGN PANEL"]
[null,null,{"$f":"SUBTOTAL(3,$D$9:D38)+6","v":36},"F & I  EXTRUDED PANEL SECTION(S)"]
[null,null,{"$f":"SUBTOTAL(3,$D$9:D39)+6","v":37},"F & I  EXTRUDED PANEL SECTION(S)  LEFT SIGN PANEL"]
[null,null,{"$f":"SUBTOTAL(3,$D$9:D40)+6","v":38},"F & I  EXTRUDED PANEL SECTION(S)  MIDDLE SIGN PANEL"]
[null,null,{"$f":"SUBTOTAL(3,$D$9:D41)+6","v":39},"F & I  EXTRUDED PANEL SECTION(S)  RIGHT SIGN PANEL"]
[null,null,{"$f":"SUBTOTAL(3,$D$9:D42)+6","v":40},"REMOVE EXTRUDED PANEL SECTION(S)"]
[null,null,{"$f":"SUBTOTAL(3,$D$9:D43)+6","v":41},"REMOVE EXTRUDED PANEL SECTION(S)  LEFT SIGN PANEL"]
[null,null,{"$f":"SUBTOTAL(3,$D$9:D44)+6","v":42},"REMOVE EXTRUDED PANEL SECTION(S)  MIDDLE SIGN PANEL"]
[null,null,{"$f":"SUBTOTAL(3,$D$9:D45)+6","v":43},"REMOVE EXTRUDED PANEL SECTION(S)  RIGHT SIGN PANEL"]
[null,null,{"$f":"SUBTOTAL(3,$D$9:D46)+6","v":44},"SAW SIGN PANEL(S)"]
[null,null,{"$f":"SUBTOTAL(3,$D$9:D47)+6","v":45},"SAW LEFT SIGN PANEL"]
[null,null,{"$f":"SUBTOTAL(3,$D$9:D48)+6","v":46},"SAW MIDDLE SIGN PANEL"]
[null,null,{"$f":"SUBTOTAL(3,$D$9:D49)+6","v":47},"SAW RIGHT SIGN PANEL"]
[null,null,{"$f":"SUBTOTAL(3,$D$9:D50)+6","v":48},"MODIFY SIGN STRUCTURE"]
[null,null,{"$f":"SUBTOTAL(3,$D$9:D51)+6","v":49},"REPOSITION LEFT SIGN PANEL"]
[null,null,{"$f":"SUBTOTAL(3,$D$9:D52)+6","v":50},"REPOSITION MIDDLE SIGN PANEL"]
[null,null,{"$f":"SUBTOTAL(3,$D$9:D53)+6","v":51},"REPOSITION RIGHT SIGN PANEL"]
[null,null,{"$f":"SUBTOTAL(3,$D$9:D54)+6","v":52},"RAISE SIGN PANEL(S)  8\""]
[null,null,{"$f":"SUBTOTAL(3,$D$9:D55)+6","v":53},"MODIFY SIGN LIGHTING SYSTEM"]
[null,null,{"$f":"SUBTOTAL(3,$D$9:D56)+6","v":54},"INSTALL SIGN PANEL(S)"]
[null,null,{"$f":"SUBTOTAL(3,$D$9:D57)+6","v":55},"INSTALL LEFT SIGN PANEL"]
[null,null,{"$f":"SUBTOTAL(3,$D$9:D58)+6","v":56},"INSTALL MIDDLE SIGN PANEL"]
[null,null,{"$f":"SUBTOTAL(3,$D$9:D59)+6","v":57},"INSTALL RIGHT SIGN PANEL"]
[null,null,{"$f":"SUBTOTAL(3,$D$9:D60)+6","v":58},"MODIFY POSTS"]
[null,null,{"$f":"SUBTOTAL(3,$D$9:D61)+6","v":59},"F & I  OVERHEAD SIGN IDENTIFICATION PLATE"]
[null,null,{"$f":"SUBTOTAL(3,$D$9:D62)+6","v":60},"F & I  FEED POINT IDENTIFICATION PLATE"]
[null,null,{"$f":"SUBTOTAL(3,$D$9:D63)+6","v":61},"F & I  NEW POST CLIPS ON ALL SIGN PANELS"]
[null,null,{"$f":"SUBTOTAL(3,$D$9:D64)+6","v":62},"REMOVE SIGN WALKWAY"]
[null,null,{"$f":"SUBTOTAL(3,$D$9:D65)+6","v":63},"REMOVE SIGN LIGHTING SYSTEM"]

{"sheet":"CS&I","index":10,"n_rows":26,"n_cols":18,"rows_kept":26,"cut":false,"hidden":false,"merged":[[2,2,4,2],[15,1,15,11],[16,1,16,11],[4,16,4,17],[12,1,12,11],[8,1,9,1],[3,5,4,5],[8,3,9,3],[14,1,14,11],[10,11,10,12],[7,11,7,12],[6,13,7,13],[6,1,7,1],[6,3,7,3],[6,4,7,4],[25,1,25,11],[18,1,18,11],[19,1,19,11],[20,1,20,11],[23,1,23,11],[24,1,24,11],[21,1,21,11],[22,1,22,11],[1,2,1,11],[8,2,9,2],[8,6,9,6],[2,7,2,10],[5,7,5,10],[3,7,4,10],[2,3,2,5],[8,5,9,5],[8,4,9,4],[2,11,2,12],[3,11,3,12],[4,11,4,12],[5,11,5,12],[6,11,6,12],[6,2,7,2],[6,5,7,5]]}
[]
[null,null,"SALVAGE & INSTALL SIGN TYPE C",null,null,null,null,null,null,null,null,null,"STA"]
[null,null,"QTY","POSTS",null,null,"MTG","PANEL"]
[null,"SIGN",null,"NO","KNEE","LENGTH","HT","SIZE",null,null,null,"PANEL"]
[null,"NO",null,"&","BRACES",null,"(1)",null,null,null,null,"LEGEND",null,null,null,null,"DEFAULT VALUES"]
[null,null,"EACH","TYPE","QTY","FEET","FEET","INCH",null,null,null,null,null,null,null,null,"POST LB","POST TYPE"]
[null,"C-201",1,{"$f":"postnumb(H7,J7,Q7,R7)","v":"2-U"}," ",{"$f":"ROUNDUP((J7/12)+G7+3.5+2,0)","v":16},7,36,"x",36,null,"NO U TURN",null,null,null,null,"2.5","U"]
[null,null,null,null,null,null,7,36,"x",36,null,"NO U TURN",null,null,null,null,"2.5","U"]
[null,"C-203",1,{"$f":"postnumb(MAX(H9,H10),J9+J10,Q9,R9)","v":"2-U"},{"$f":"postknee(MAX(H9,H10),J9+J10,Q9,R9)","v":"1"},{"$f":"ROUNDUP((SUM(J9:J10)/12)+G9+3.5+2,0)","v":17},7,30,"x",15,null,"NORTH",null,null,null,null,"3","U"]
[null,null,null,null,null,null,null,36,"x",36,null,"INTERSTATE 35",null,null,null,null,"3","U"]
[null,"TOTAL ",{"$f":"SUM(C9:C10)","v":1}]
[null,null,null,null,null,null,null,null," ",null," "]
[null,"SPECIFIC NOTES:"]
[null,{"$f":"\"(1)  MOUNTING HEIGHT IS MINIMUM (WITH A +6 INCH TOLERANCE)  SEE SHEET \" & TEXT(TOC!$B$20,\"0\") & \" FOR TYPICAL MOUNTING.\"","v":"(1)  MOUNTING HEIGHT IS MINIMUM (WITH A +6 INCH TOLERANCE)  SEE SHEET ST24 FOR TYPICAL MOUNTING."}]
[null,"(2)  FOR PUNCHING AND MOUNTING DETAILS, SEE MNDOT STANDARD SIGNS AND MARKINGS MANUAL PAGE 110."]
[null,"(3)  MOUNT BACK TO BACK."]
[null,{"$f":"\"(4)  MOUNT IN CONCRETE, SEE SHEET NO. \" & TEXT(TOC!B12,\"0\") & \".\"","v":"(4)  MOUNT IN CONCRETE, SEE SHEET NO. 0."}]
[null,{"$f":"\"(6)  MOUNT IN CONCRETE ON BRIDGE, SEE SHEET NO. \" & TEXT(TOC!B9, \"0\") & \".\"","v":"(6)  MOUNT IN CONCRETE ON BRIDGE, SEE SHEET NO. 58."}]
[]
[null,"GENERAL NOTES:"]
[null,"1.  POST LENGTHS ARE APPROXIMATE AND INCLUDE EMBEDMENT, BUT DO NOT INCLUDE"]
[null,"    ADDITIONAL LENGTH REQUIRED FOR SPLICE."]
[null,{"$f":"\"2.  SEE SHEET \" & TEXT(TOC!B7,\"0\") & \" FOR SIGN PLACEMENT DETAILS.\"","v":"2.  SEE SHEET ST13 FOR SIGN PLACEMENT DETAILS."}]
[null,{"$f":"\"3.  SEE SHEETS \" & TEXT(TOC!$B$19,\"0\") & \" TO \" & TEXT(TOC!$B$21,\"0\") & \" FOR STRUCTURAL DETAILS.\"","v":"3.  SEE SHEETS ST23 TO ST25 FOR STRUCTURAL DETAILS."}]
[null,"4.  SEE MNDOT STANDARD SIGNS AND MARKINGS MANUAL FOR PUNCHING CODE AND DETAILED DRAWINGS"]
[null,"    OF TYPE C SIGN PANELS."]

{"sheet":"CSIGN","index":11,"n_rows":53,"n_cols":24,"rows_kept":53,"cut":false,"hidden":false,"merged":[[36,1,36,15],[13,18,15,18],[22,16,22,17],[18,5,19,5],[38,1,38,11],[13,16,13,17],[14,16,14,17],[15,16,15,17],[16,16,16,17],[17,16,17,17],[18,16,18,17],[21,16,21,17],[20,16,20,17],[19,16,19,17],[18,6,19,6],[13,6,15,6],[13,3,15,3],[11,0,12,0],[16,0,17,0],[18,0,19,0],[13,1,15,1],[13,2,15,2],[18,1,19,1],[18,2,19,2],[11,1,12,1],[18,3,19,3],[16,4,19,4],[6,16,6,17],[7,16,7,17],[8,16,8,17],[11,16,11,17],[12,16,12,17],[9,16,9,17],[10,16,10,17],[3,7,4,10],[16,2,17,2],[16,3,17,3],[16,5,17,5],[16,6,17,6],[6,7,6,10],[11,4,12,4],[11,3,12,3],[13,4,15,4],[13,5,15,5],[43,1,43,11],[4,22,4,23],[37,1,37,11],[39,1,39,11],[24,1,24,11],[4,13,4,14],[5,11,5,12],[41,1,41,11],[28,1,28,11],[34,1,34,11],[35,1,35,11],[16,1,17,1],[27,1,27,11],[1,2,1,16],[11,2,12,2],[11,6,12,6],[2,7,2,14],[3,11,4,12],[5,13,5,14],[3,13,3,14],[3,5,4,5],[2,2,5,2],[11,5,12,5],[2,3,2,5],[5,7,5,10],[2,16,2,17],[3,16,3,17],[4,16,4,17],[5,16,5,17]]}
[]
[null,null,"SIGN PANELS TYPE C",null,null,null,null,null,null,null,null,null,null,null,null,null,null,{"$f":"'SEQ-PSTAB'!#REF!","v":{"$error":"#REF!"}}]
[null,null,"QTY","POSTS",null,null,"MTG","PANEL"]
[null,"SIGN",null,"NO\n&\nTYPE","KNEE","LENGTH","HT","SIZE",null,null,null,"AREA",null,"TOTAL",null,"CODE\nNO","PANEL"]
[null,"NO",null,"&","BRACES",null,"(1)",null,null,null,null,null,null,"AREA",null,"NO","LEGEND",null,null,null,null,null,"DEFAULT VALUES"]
[null,null,null,"TYPE","QTY","FEET","FEET","INCH",null,null,null,"SQ FT",null,"SQ FT",null,null,null,null,null,null,null,null,"POST #","POST TYPE"]
[null,"C-0",2,"2-U",1,{"$f":"ROUNDUP((J7/12)+G7+3.5+2,0)","v":13},7,"48 x 48 x 48",null,null,null,6.93,null,{"$f":"L7*C7","v":13.86},null,"R1-2",{"$f":"IF(P7<>\"\",IF(COUNTIF(Table2[CODE\nNO],CSIGN!P7)>0,LOOKUP(CSIGN!P7,Table2[CODE\nNO],Table2[PANEL LEGEND]),\"NOT FOUND\"),\"\")","v":"YIELD"},null,null,null,null,null,"2.5","U"]
["(5)","C-0",3,"1-ST"," ",13,7,48,"x",48,null,{"$f":"(H8*J8)/144","v":16},null,48,null,"W4-1R","MERGE",null,null,null,null,null,"2.5","U"]
[null,"C-0",2,{"$f":"postnumb(H9,J9,W9,X9)","v":"2-U"},{"$f":"postknee(H9,J9,W9,X9)","v":"1"},{"$f":"ROUNDUP((J9/12)+G9+3.5+2,0)","v":15},7,36,"x",30,null,7.5,null,15,null,"R3-30GA",{"$f":"IF(P9<>\"\",IF(COUNTIF(Table2[CODE\nNO],CSIGN!P9)>0,LOOKUP(CSIGN!P9,Table2[CODE\nNO],Table2[PANEL LEGEND]),\"NOT FOUND\"),\"\")","v":"LTR-R"},null,null,null,null,null,"2.5","U"]
["(4)","C-0",1,"1-ST"," ",12,7,24,"x",30,null,5,null,5,null,"R4-7",{"$f":"IF(P10<>\"\",IF(COUNTIF(Table2[CODE\nNO],CSIGN!P10)>0,LOOKUP(CSIGN!P10,Table2[CODE\nNO],Table2[PANEL LEGEND]),\"NOT FOUND\"),\"\")","v":"KEEP RIGHT"},null," ",null,null,null,"2.5","U"]
[null,"C-0",1,{"$f":"postnumb(H11,J11,W11,X11)","v":"2-U"},{"$f":"postknee(H11,J11,W11,X11)","v":"1"},{"$f":"ROUNDUP((J11/12)+G11+3.5+2,0)","v":14},7,54,"x",18,null,{"$f":"(H11*J11)/144","v":6.75},null,6.75,null,"R6-1L",{"$f":"IF(P11<>\"\",IF(COUNTIF(Table2[CODE\nNO],CSIGN!P11)>0,LOOKUP(CSIGN!P11,Table2[CODE\nNO],Table2[PANEL LEGEND]),\"NOT FOUND\"),\"\")","v":"ONE WAY LEFT"},null,"(2)",null,null,null,"2.5","U"]
[null,"C-0",1,{"$f":"postnumb(MAX(H12,H13),J12+J13,W12,X12)","v":"2-U"},{"$f":"postknee(H12,J12,W12,X12)","v":"1"},{"$f":"ROUNDUP((J12/12)+(J13/12)+G12+3.5+2,0)","v":18},7,36,"x",36,null,9,null,9,null,"W1-1R",{"$f":"IF(P12<>\"\",IF(COUNTIF(Table2[CODE\nNO],CSIGN!P12)>0,LOOKUP(CSIGN!P12,Table2[CODE\nNO],Table2[PANEL LEGEND]),\"NOT FOUND\"),\"\")","v":"TURN RIGHT"},null,null,null,null,null,"2.5","U"]
[null,null,null,null,null,null,null,24,"x",24,null,4,null,{"$f":"L13*C12","v":4},null,"W13-1P","35 MPH",null,null,null,null,null,"2.5","U"]
[null,"C-0",1,{"$f":"postnumb(MAX(H14,H15,H16),J14+J15+J16,W16,X16)","v":"2-U"},{"$f":"postknee(H14,J14,W14,X14)","v":"1"},{"$f":"ROUNDUP((J14/12)+(J15/12)+(J16/12)+G14+3.5+2,0)","v":19},7,54,"x",18,null,6.75,null,{"$f":"L14*C14","v":6.75},null,"R6-1L",{"$f":"IF(P14<>\"\",IF(COUNTIF(Table2[CODE\nNO],CSIGN!P14)>0,LOOKUP(CSIGN!P14,Table2[CODE\nNO],Table2[PANEL LEGEND]),\"NOT FOUND\"),\"\")","v":"ONE WAY LEFT"},null,"(2)",null,null,null,"2.5","U"]
[null,null,null,null,null,null,null,36,"x",36,null,9,null,{"$f":"L15*C14","v":9},null,"R1-1",{"$f":"IF(P15<>\"\",IF(COUNTIF(Table2[CODE\nNO],CSIGN!P15)>0,LOOKUP(CSIGN!P15,Table2[CODE\nNO],Table2[PANEL LEGEND]),\"NOT FOUND\"),\"\")","v":"STOP"},null,null,null,null,null,"2.5","U"]
[null,null,null,null,null,null,null,30,"x",24,null,5,null,{"$f":"L16*C14","v":5},null,"R6-3",{"$f":"IF(P16<>\"\",IF(COUNTIF(Table2[CODE\nNO],CSIGN!P16)>0,LOOKUP(CSIGN!P16,Table2[CODE\nNO],Table2[PANEL LEGEND]),\"NOT FOUND\"),\"\")","v":"DIVIDED HIGHWAY"},null,null,null,null,null,"2.5","U"]
[null,"C-1",1,"1-U",1,{"$f":"ROUNDUP((J17/12)+(J18/12)+G17+3.5+2,0)","v":16},7,24,"x",12,null,2,null,{"$f":"L17*C17","v":2},null,"M3-2A",{"$f":"IF(P17<>\"\",IF(COUNTIF(Table2[CODE\nNO],CSIGN!P17)>0,LOOKUP(CSIGN!P17,Table2[CODE\nNO],Table2[PANEL LEGEND]),\"NOT FOUND\"),\"\")","v":"EAST (BLUE)"},null,null,null,null,null,"2.5","U"]
[null,null,null,null,null,null,null,24,"x",24,null,4,null,{"$f":"L18*C17","v":4},null,"M1-5A",55,null,null,null,null,null,"2.5","U"]
[null,"C-2",1,"1-U",null,{"$f":"ROUNDUP((J19/12)+(J20/12)+G19+3.5+2,0)","v":16},7,24,"x",12,null,2,null,{"$f":"L19*C19","v":2},null,"M3-3A",{"$f":"IF(P19<>\"\",IF(COUNTIF(Table2[CODE\nNO],CSIGN!P19)>0,LOOKUP(CSIGN!P19,Table2[CODE\nNO],Table2[PANEL LEGEND]),\"NOT FOUND\"),\"\")","v":"SOUTH (BLUE)"},null,null,null,null,null,"2.5","U"]
[null,null,null,null,null,null,null,24,"x",24,null,4,null,{"$f":"L20*C19","v":4},null,"M1-5A","149\nNO],CSIGN!P15)>0,LOOKUP(CSIGN!P15,Table2[CODE\nNO],Table2[PANEL LEGEND]),\"NOT FOUND\"),\"\")",null,null,null,null,null,"2.5","U"]
[null,null,null,null,null,null,null,null,null,null,null,null,null,null,null,null,{"$f":"IF(P21<>\"\",IF(COUNTIF(Table2[CODE\nNO],CSIGN!P21)>0,LOOKUP(CSIGN!P21,Table2[CODE\nNO],Table2[PANEL LEGEND]),\"NOT FOUND\"),\"\")","v":""},null,null,null,null,null,"2.5","U"]
[null,null,null,null,null,null,null,null,null,null,null,null,null,null,null,null,{"$f":"IF(P22<>\"\",IF(COUNTIF(Table2[CODE\nNO],CSIGN!P22)>0,LOOKUP(CSIGN!P22,Table2[CODE\nNO],Table2[PANEL LEGEND]),\"NOT FOUND\"),\"\")","v":""},null,null,null,null,null,"2.5","U"]
[null,null,null,null,null,null,null,null,null,null,null,"TOTAL",null,{"$f":"SUM(N7:N13)","v":101.61}]
[null,null,null,null,null,null,null,null," ",null," "]
[null,"SPECIFIC NOTES:"]
[null,{"$f":"\"(1)  MOUNTING HEIGHT IS MINIMUM (WITH A +6 INCH TOLERANCE)  SEE SHEET NO. \" & TEXT(TOC!$B$20,\"0\") & \" FOR TYPICAL MOUNTING.\"","v":"(1)  MOUNTING HEIGHT IS MINIMUM (WITH A +6 INCH TOLERANCE)  SEE SHEET NO. ST24 FOR TYPICAL MOUNTING."}]
[null,"(2)  FOR PUNCHING AND MOUNTING DETAILS, SEE MNDOT STANDARD SIGNS AND MARKING MANUAL PAGE 110."]
[null,"(3)  MOUNT BACK TO BACK."]
[null,{"$f":"\"(4)  MOUNT IN CONCRETE, SEE SHEET NO. \" & TEXT(TOC!B24,\"0\") & \".\"","v":"(4)  MOUNT IN CONCRETE, SEE SHEET NO. 56."}]
[null,"(5)  PLACE PER MANUFACTURER'S DETAIL USING A 10 GAUGE, 2-1/2\" x 2-1/2\" PRE-PUNCHED, GALVANIZED STEEL,"]
[null,"     SQUARE TUBE POST WITH A 10 GAUGE, 2-3/16\" x 2-3/16\" x 8', PRE-PUNCHED GALVANIZED STEEL INTERNAL SQUARE"]
[null,"     TUBE INSERT. THIS ASSEMBLY REQUIRES STRINGERS AND SLIP BASES."]
[null,{"$f":"\"(6)  MOUNT IN CONCRETE ON BRIDGE, SEE SHEET NO. \" & TEXT(TOC!B23, \"0\") & \".\"","v":"(6)  MOUNT IN CONCRETE ON BRIDGE, SEE SHEET NO. 57."}]
[null,"(7)  MOUNT ON WALL, SEE SHEET NO.  "]
[]
[null,"GENERAL NOTES:"]
[null,"1.  POST LENGTHS ARE APPROXIMATE AND INCLUDE EMBEDMENT, BUT DO NOT INCLUDE"]
[null,"    ADDITIONAL LENGTH REQUIRED FOR SPLICE."]
[null,{"$f":"\"2.  SEE SHEET \" & TEXT(TOC!B7,\"0\") & \" FOR SIGN PLACEMENT DETAILS.\"","v":"2.  SEE SHEET ST13 FOR SIGN PLACEMENT DETAILS."}]
[null,{"$f":"\"3.  SEE SHEETS \" & TEXT(TOC!$B$19,\"0\") & \" TO \" & TEXT(TOC!$B$21,\"0\") & \" FOR STRUCTURAL DETAILS.\"","v":"3.  SEE SHEETS ST23 TO ST25 FOR STRUCTURAL DETAILS."}]
[null,"4.  SEE MNDOT STANDARD SIGNS AND MARKINGS MANUAL FOR PUNCHING CODE AND DETAILED DRAWINGS"]
[null,"    OF TYPE C SIGN PANELS."]
[]
[]
[]
[]
[]
[]
[]
[]
[null,"C-",1,{"$f":"postnumb(H51,J51,W51,X51)","v":""},{"$f":"postknee(H51,J51,W51,X51)","v":""},{"$f":"ROUNDUP((J51/12)+G51+3.5+2,0)","v":13},7,0,"x",0,null,{"$f":"(H51*J51)/144","v":0},null,{"$f":"L51*C51","v":0},null,"example","peds",null,null,null,null,null,"3","U"]
[null,"C-4",1,{"$f":"postnumb(H52,J52,W52,X52)","v":"2-U"},{"$f":"postknee(H52,J52,W52,X52)","v":"1"},{"$f":"ROUNDUP((J52/12)+G52+3.5+2,0)","v":15},7,48,"x",30,null,{"$f":"(H52*J52)/144","v":10},null,{"$f":"L52*C52","v":10},null,"R5-10b","peds",null,null,null,null,null,"3","U"]
[null,"C-41",2,{"$f":"postnumb(H53,J53,W53,X53)","v":"1-O"},{"$f":"postknee(H53,J53,W53,X53)","v":""},{"$f":"ROUNDUP((J53/12)+G53+3.5+2,0)","v":21},7,12,"x",102,null,{"$f":"(H53*J53)/144","v":8.5},null,{"$f":"L53*C53","v":17},null,"R5-1a","WRONG WAY",null,null,null,null,null,"2.5","O"]

{"sheet":"CINS","index":12,"n_rows":38,"n_cols":17,"rows_kept":38,"cut":false,"hidden":false,"merged":[[27,1,27,11],[6,11,6,12],[7,11,7,12],[13,11,13,12],[14,11,14,12],[8,11,8,12],[9,11,9,12],[10,11,10,12],[11,11,11,12],[12,11,12,12],[4,15,4,16],[28,1,28,11],[29,1,29,11],[30,1,30,11],[23,1,23,11],[16,1,16,11],[24,1,24,11],[25,1,25,11],[26,1,26,11],[18,1,18,11],[19,1,19,11],[20,1,20,11],[8,1,9,1],[4,11,4,12],[5,11,5,12],[2,2,4,2],[37,3,38,3],[37,5,38,5],[2,7,2,10],[1,2,1,11],[8,2,9,2],[8,6,9,6],[3,7,4,10],[5,7,5,10],[2,3,2,5],[8,5,9,5],[8,4,9,4],[8,3,9,3],[3,5,4,5],[2,11,2,12],[3,11,3,12],[31,1,31,11]]}
[]
[null,null,"INSTALL SIGN TYPE C",null,null,null,null,null,null,null,null,null,{"$f":"'SEQ-PSTAB'!B74","v":0}]
[null,null,"QTY","POSTS",null,null,"MTG","PANEL"]
[null,"SIGN",null,"NO\n&\nTYPE","KNEE","LENGTH","HT","SIZE",null,null,null,"PANEL"]
[null,"NO",null,"&","BRACES",null,"(1)",null,null,null,null,"LEGEND",null,null,null,"DEFAULT VALUES"]
[null,null,"EACH","TYPE","QTY","FEET","FEET","INCH",null,null,null,null,null,null,null,"POST #","POST TYPE"]
[null,"C-301",1,{"$f":"postnumb(H7,J7,P7,Q7)","v":"2-U"},{"$f":"postknee(H7,J7,P7,Q7)","v":"1"},{"$f":"ROUNDUP((J7/12)+G7+3.5+2,0)","v":18},7,48,"x",60,null,"EXIT 40 MPH",null,null,null,"2.5","U"]
[null,"C-302",2,{"$f":"postnumb(H8,J8,P8,Q8)","v":"2-U"},{"$f":"postknee(H8,J8,P8,Q8)","v":"1"},{"$f":"ROUNDUP((J8/12)+G8+3.5+2,0)","v":18},7,48,"x",60,null,"EXIT 25 MPH",null,null,null,"2.5","U"]
[null,"C-303",1,{"$f":"postnumb(MAX(H9,H10),J9+J10,P9,Q9)","v":"2-U"},{"$f":"postknee(MAX(H9,H10),J9+J10,P9,Q9)","v":"1"},{"$f":"ROUNDUP((SUM(J9:J10)/12)+G9+3.5+2,0)","v":16},7,24,"x",15,null,"NORTH",null,null,null,"2.5","U"]
[null,null,null,null,null,null,null,24,"x",24,null,"INTERSTATE 35",null,null,null,"2.5","U"]
[null,null,null,{"$f":"postnumb(H11,J11,P11,Q11)","v":""},{"$f":"postknee(H11,J11,P11,Q11)","v":""},{"$f":"ROUNDUP((J11/12)+G11+3.5+2,0)","v":6},null,null,"x",null,null,null,null,null,null,"2.5","U"]
[null,null,null,{"$f":"postnumb(H12,J12,P12,Q12)","v":""},{"$f":"postknee(H12,J12,P12,Q12)","v":""},{"$f":"ROUNDUP((J12/12)+G12+3.5+2,0)","v":6},null,null,"x",null,null,null,null,null,null,"2.5","U"]
[null,null,null,{"$f":"postnumb(H13,J13,P13,Q13)","v":""},{"$f":"postknee(H13,J13,P13,Q13)","v":""},{"$f":"ROUNDUP((J13/12)+G13+3.5+2,0)","v":6},null,null,"x",null,null,null,null,null,null,"2.5","U"]
[null,null,null,{"$f":"postnumb(H14,J14,P14,Q14)","v":""},{"$f":"postknee(H14,J14,P14,Q14)","v":""},{"$f":"ROUNDUP((J14/12)+G14+3.5+2,0)","v":6},null,null,"x",null,null,null,null,null,null,"2.5","U"]
[null,"TOTAL ",{"$f":"SUM(C7:C14)","v":4}]
[null,null,null,null,null,null,null,null," ",null," "]
[null,"SPECIFIC NOTES:"]
[null,{"$f":"\"(1)  MOUNTING HEIGHT IS MINIMUM (WITH A +6 INCH TOLERANCE)  SEE SHEET \" & TEXT(TOC!$B$20,\"0\") & \" FOR TYPICAL MOUNTING.\"","v":"(1)  MOUNTING HEIGHT IS MINIMUM (WITH A +6 INCH TOLERANCE)  SEE SHEET ST24 FOR TYPICAL MOUNTING."}]
[null,"(2)  FOR PUNCHING AND MOUNTING DETAILS, SEE MNDOT STANDARD SIGNS AND MARKINGS MANUAL PAGE 110."]
[null,"(3)  MOUNT BACK TO BACK."]
[null,{"$f":"\"(4)  MOUNT IN CONCRETE, SEE SHEET \" & TEXT(TOC!$B$9,\"0\") & \".\"","v":"(4)  MOUNT IN CONCRETE, SEE SHEET 58."}]
[null,"(5)  MOUNT ON WALL, SEE SHEET    "]
[null,{"$f":"\"(6)  MOUNT IN CONCRETE ON BRIDGE, SEE SHEET \" & TEXT(TOC!B25, \"0\") & \".\"","v":"(6)  MOUNT IN CONCRETE ON BRIDGE, SEE SHEET 59."}]
[]
[null,"GENERAL NOTES:"]
[null,"1.  POST LENGTHS ARE APPROXIMATE AND INCLUDE EMBEDMENT, BUT DO NOT INCLUDE"]
[null,"    ADDITIONAL LENGTH REQUIRED FOR SPLICE."]
[null,{"$f":"\"2.  SEE SHEET \" & TEXT(TOC!$B7,\"0\") & \" FOR SIGN PLACEMENT DETAILS.\"","v":"2.  SEE SHEET ST13 FOR SIGN PLACEMENT DETAILS."}]
[null,{"$f":"\"3.  SEE SHEETS \" & TEXT(TOC!$B$19,\"0\") & \" TO \" & TEXT(TOC!$B$21,\"0\") & \" FOR STRUCTURAL DETAILS.\"","v":"3.  SEE SHEETS ST23 TO ST25 FOR STRUCTURAL DETAILS."}]
[null,"4.  SEE MNDOT STANDARD SIGNS AND MARKINGS MANUAL FOR PUNCHING CODE AND DETAILED DRAWINGS"]
[null,"    OF TYPE C SIGN PANELS."]
[]
[]
[]
[]
[]
[]
[null,null,null,"LEN",null,"LENGTH"]

{"sheet":"CSAL","index":13,"n_rows":19,"n_cols":15,"rows_kept":19,"cut":false,"hidden":false,"merged":[[14,9,14,10],[9,9,9,10],[10,9,10,10],[11,9,11,10],[12,9,12,10],[13,9,13,10],[20,1,20,9],[21,1,21,9],[3,5,4,8],[18,1,18,9],[16,1,16,9],[17,1,17,9],[7,1,8,1],[7,2,8,2],[7,3,8,3],[7,4,8,4],[3,9,3,10],[4,9,4,10],[5,9,5,10],[6,9,6,10],[7,9,7,10],[8,9,8,10],[4,13,4,14],[1,2,1,9],[2,3,2,4],[5,5,5,8],[2,5,2,8],[2,9,2,10],[2,2,4,2]]}
[]
[null,null,"SALVAGE SIGN TYPE C",null,null,null,null,null,null,null,{"$f":"'SEQ-PSTAB'!B44","v":0}]
[null,null,"QTY","POSTS",null,"PANEL"]
[null,"SIGN",null,"NO","KNEE","SIZE",null,null,null,"PANEL"]
[null,"NO",null,"&","BRACES",null,null,null,null,"LEGEND",null,null,null,"DEFAULT VALUES"]
[null,null,"EACH","TYPE","QTY","INCH",null,null,null,null,null,null,null,"POST #","POST TYPE"]
[null,"C-101",0,{"$f":"postnumb(F7,H7,N7,O7)","v":"2-U"},{"$f":"postknee(F7,H7,N7,O7)","v":"1"},48,"x",60,null,"EXIT 40 MPH",null,null,null,"3","U"]
[null,"C-102",0,{"$f":"postnumb(MAX(F8,F9),H8+H9,N8,O8)","v":"2-U"},{"$f":"postknee(MAX(F8,F9),H8+H9,N8,O8)","v":"1"},24,"x",15,null,"NORTH",null,null,null,"3","U"]
[null,null,null,null,null,24,"x",24,null,"INTERSTATE 35",null,null,null,"3","U"]
[null,null,null,{"$f":"postnumb(F10,H10,N10,O10)","v":""},{"$f":"postknee(F10,H10,N10,O10)","v":""},null,"x",null,null,null,null,null,null,"3","U"]
[null,null,null,{"$f":"postnumb(F11,H11,N11,O11)","v":""},{"$f":"postknee(F11,H11,N11,O11)","v":""},null,"x",null,null,null,null,null,null,"3","U"]
[null,null,null,{"$f":"postnumb(F12,H12,N12,O12)","v":""},{"$f":"postknee(F12,H12,N12,O12)","v":""},null,"x",null,null,null,null,null,null,"3","U"]
[null,null,null,{"$f":"postnumb(F13,H13,N13,O13)","v":""},{"$f":"postknee(F13,H13,N13,O13)","v":""},null,"x",null,null,null,null,null,null,"3","U"]
[null,null,null,{"$f":"postnumb(F14,H14,N14,O14)","v":""},{"$f":"postknee(F14,H14,N14,O14)","v":""},null,"x",null,null,null,null,null,null,"3","U"]
[null,"TOTAL ",{"$f":"SUM(C7:C14)","v":0}]
[null,null,null,null,null,null," ",null," "]
[null,"SPECIFIC NOTES:"]
[null,"(1)  SIGN PANELS ARE TO BE SALVAGED AND RETURNED TO <County Name>."]
[null,"     PLEASE CONTACT <Name> AT <Phone Number> TO SCHEDULE PICKUP."]

{"sheet":"CREM","index":14,"n_rows":23,"n_cols":15,"rows_kept":23,"cut":false,"hidden":false,"merged":[[2,5,2,8],[1,2,1,9],[2,3,2,4],[2,2,5,2],[5,5,5,8],[4,13,4,14],[3,5,4,8],[22,3,22,11],[7,1,8,1],[7,2,8,2],[7,3,8,3],[7,4,8,4]]}
[]
[null,{"$f":"'SEQ-PSTAB'!#REF!","v":{"$error":"#REF!"}},"REMOVE SIGN TYPE C"]
[null,null,"QTY","POSTS",null,"PANEL"]
[null,"SIGN",null,"NO","KNEE","SIZE",null,null,null,"PANEL"]
[null,"NO",null,"&","BRACES",null,null,null,null,"LEGEND",null,null,null,"DEFAULT VALUES"]
[null,null,null,"TYPE","QTY","INCH",null,null,null,null,null,null,null,"POST #","POST TYPE"]
[null,"C-101",1,{"$f":"postnumb(F7,H7,N7,O7)","v":"2-U"},{"$f":"postknee(F7,H7,N7,O7)","v":"1"},48,"x",60,null,"EXIT 40 MPH",null,null,null,"3","U"]
[null,"C-102",2,{"$f":"postnumb(MAX(F8,F9),H8+H9,N9,O9)","v":"2-U"},{"$f":"postknee(MAX(F8,F9),H8+H9,N9,O9)","v":"1"},24,"x",15,null,"NORTH",null,null,null,"3","U"]
[null,null,null,null,null,36,"x",36,null,"INTERSTATE 35",null,null,null,"3","U"]
[null,null,null,{"$f":"postnumb(F10,H10,N10,O10)","v":""},{"$f":"postknee(F10,H10,N10,O10)","v":""},null,"x",null,null,null,null,null,null,"3","U"]
[null,null,null,{"$f":"postnumb(F11,H11,N11,O11)","v":""},{"$f":"postknee(F11,H11,N11,O11)","v":""},null,"x",null,null,null,null,null,null,"3","U"]
[null,null,null,{"$f":"postnumb(F12,H12,N12,O12)","v":""},{"$f":"postknee(F12,H12,N12,O12)","v":""},null,"x",null,null,null,null,null,null,"3","U"]
[null,null,null,{"$f":"postnumb(F13,H13,N13,O13)","v":""},{"$f":"postknee(F13,H13,N13,O13)","v":""},null,"x",null,null,null,null,null,null,"3","U"]
[null,null,null,{"$f":"postnumb(F14,H14,N14,O14)","v":""},{"$f":"postknee(F14,H14,N14,O14)","v":""},null,"x",null,null,null,null,null,null,"3","U"]
[null,"TOTAL ",{"$f":"SUM(C7:C14)","v":3}]
[null,null,null,null,null,null," ",null," "]
[]
[]
[]
[]
[]
[]
[null,null,null,"AS OF 2003 WE NO LONGER USE THIS CHART"]

{"sheet":"DREM","index":15,"n_rows":19,"n_cols":15,"rows_kept":19,"cut":false,"hidden":false,"merged":[[1,2,1,9],[2,3,2,4],[2,2,4,2],[14,9,14,10],[9,9,9,10],[10,9,10,10],[11,9,11,10],[12,9,12,10],[13,9,13,10],[2,9,2,10],[3,9,3,10],[4,9,4,10],[5,9,5,10],[3,5,3,8],[4,5,4,8],[2,5,2,8],[7,1,8,1],[7,2,8,2],[7,3,8,3],[7,4,8,4],[4,13,4,14],[6,9,6,10],[7,9,7,10],[8,9,8,10],[5,5,5,8]]}
[]
[null,null,"REMOVE SIGN TYPE D",null,null,null,null,null,null,null,{"$f":"'SEQ-PSTAB'!#REF!","v":{"$error":"#REF!"}}]
[null,null,"QTY","POSTS",null,"PANEL"]
[null,"SIGN",null,"NO","KNEE","SIZE ",null,null,null,"PANEL"]
[null,"NO",null,"&","BRACES","(1)",null,null,null,"LEGEND",null,null,null,"DEFAULT VALUES"]
[null,null,"EACH","TYPE","QTY","INCH",null,null,null,null,null,null,null,"POST #","POST TYPE"]
[null,"D-101",1,{"$f":"postnumb(F7,H7,N7,O7)","v":"2-U"},{"$f":"postknee(F7,H7,N7,O7)","v":"1"},48,"x",60,null,"EXIT 35B",null,null,null,"2.5","U"]
[null,"D-102",2,{"$f":"postnumb(MAX(F8,F9),H8+H9,N8,O8)","v":"2-U"},{"$f":"postknee(MAX(F8,F9),H8+H9,N8,O8)","v":"1"},24,"x",15,null,"NORTH",null,null,null,"2.5","U"]
[null,null,null,null,null,24,"x",24,null,"INTERSTATE 35",null,null,null,"2.5","U"]
[null,null,null,{"$f":"postnumb(F10,H10,N10,O10)","v":""},{"$f":"postknee(F10,H10,N10,O10)","v":""},null,"x",null,null,null,null,null,null,"2.5","U"]
[null,null,null,{"$f":"postnumb(F11,H11,N11,O11)","v":""},{"$f":"postknee(F11,H11,N11,O11)","v":""},null,"x",null,null,null,null,null,null,"2.5","U"]
[null,null,null,{"$f":"postnumb(F12,H12,N12,O12)","v":""},{"$f":"postknee(F12,H12,N12,O12)","v":""},null,"x",null,null,null,null,null,null,"2.5","U"]
[null,null,null,{"$f":"postnumb(F13,H13,N13,O13)","v":""},{"$f":"postknee(F13,H13,N13,O13)","v":""},null,"x",null,null,null,null,null,null,"2.5","U"]
[null,null,null,{"$f":"postnumb(F14,H14,N14,O14)","v":""},{"$f":"postknee(F14,H14,N14,O14)","v":""},null,"x",null,null,null,null,null,null,"2.5","U"]
[null,"TOTAL",{"$f":"SUM(C7:C14)","v":3}]
[null,null,null,null,null,null," ",null," "]
[]
[null,"SPECIFIC NOTE:"]
[null,"(1) SIZES ARE APPROXIMATE"]

{"sheet":"D REM PANEL","index":16,"n_rows":19,"n_cols":8,"rows_kept":19,"cut":false,"hidden":false,"merged":[[11,6,11,7],[12,6,12,7],[13,6,13,7],[14,6,14,7],[6,6,6,7],[7,6,7,7],[8,6,8,7],[9,6,9,7],[10,6,10,7],[1,1,1,6],[2,1,5,1],[2,6,5,7],[2,3,2,5],[3,3,3,5],[4,3,4,5],[5,3,5,5],[2,2,4,2]]}
[null,"DREMPAN"]
[null,"REMOVE SIGN PANEL TYPE D",null,null,null,null,null,{"$f":"'SEQ-PSTAB'!B30","v":0}]
[null,"SIGN\nNO","QTY","PANEL",null,null,"PANEL\nLEGEND"]
[null,null,null,"SIZE"]
[null,null,null,"(1)"]
[null,null,"EACH","INCHES"]
[null,"D-101",0,72,"x",60]
[null,"D-102",0,174,"x",84]
[null,"D-103",0,114,"x",48]
[null,"D-104",0,90,"x",54]
[null,"D-105",0,72,"x",72]
[null,"D-106",0,54,"x",66]
[null,"D-107",0,54,"x",66]
[null,"D-108",0,72,"x",72]
[null,"TOTAL",{"$f":"SUM(C7:C14)","v":0}]
[]
[]
[null,"SPECIFIC NOTE:"]
[null,"(1) SIZES ARE APPROXIMATE"]

{"sheet":"DSIGN","index":17,"n_rows":33,"n_cols":23,"rows_kept":33,"cut":false,"hidden":false,"merged":[[9,16,9,17],[10,16,10,17],[32,1,32,11],[11,16,11,17],[12,16,12,17],[13,16,13,17],[14,16,14,17],[15,16,15,17],[30,1,30,11],[27,1,27,14],[31,1,31,14],[4,21,4,22],[26,1,26,11],[28,1,28,11],[25,1,25,11],[5,8,5,11],[3,8,4,11],[19,1,19,11],[3,14,3,15],[3,5,4,5],[4,14,4,15],[5,14,5,15],[17,1,17,11],[6,16,6,17],[7,16,7,17],[8,16,8,17],[1,2,1,16],[2,3,2,6],[2,2,5,2],[2,8,2,15],[3,6,4,6],[3,12,4,13],[5,12,5,13],[2,16,2,17],[3,16,3,17],[4,16,4,17],[5,16,5,17]]}
[]
[null,null,"SIGN PANELS TYPE D",null,null,null,null,null,null,null,null,null,null,null,null,null,null,{"$f":"'SEQ-PSTAB'!#REF!","v":{"$error":"#REF!"}}]
[null,null,"QTY","POSTS",null,null,null,"MTG","PANEL"]
[null,"SIGN",null,"NO\n&\nTYPE","KNEE","LENGTH","SPACING","HT","SIZE",null,null,null,"AREA",null,"TOTAL",null,"PANEL"]
[null,"NO",null,"&","BRACES",null,null,"(1)",null,null,null,null,null,null,"AREA",null,"LEGEND",null,null,null,null,"DEFAULT VALUES"]
[null,null,null,"TYPE","QTY","FEET","INCH","FEET","INCH",null,null,null,"SQ FT",null,"SQ FT",null,null,null,null,null,null,"POST #","POST TYPE"]
[null,"D-1",2,{"$f":"postnumb(I7,K7,V7,W7)","v":"2-U"},{"$f":"postknee(I7,K7,V7,W7)","v":"2"},{"$f":"ROUNDUP((K7/12)+H7+3.5+2,0)","v":15},{"$f":"postspace(I7,K7,V7,W7)","v":"90"},7,144,"x",24,null,{"$f":"(I7*K7)/144","v":24},null,{"$f":"M7*C7","v":48},null,null,null,null,null,null,"2.5","U"]
[null,"D-2",1,{"$f":"postnumb(I8,K8,V8,W8)","v":"2-U"},"2",{"$f":"ROUNDUP((K8/12)+H8+3.5+2,0)","v":20},"42",7,72,"x",84,null,{"$f":"(I8*K8)/144","v":42},null,{"$f":"M8*C8","v":42},null,null,null,null,null,null,"2.5","U"]
[null,"D-3",3,{"$f":"postnumb(I9,K9,V9,W9)","v":"2-U"},"2",20,"42",7,72,"x",84,null,42,null,126,null,null,null,null,null,null,"2.5","U"]
[null,"D-4",1,{"$f":"postnumb(I10,K10,V10,W10)","v":"2-U"},"2",20,"42",7,72,"x",84,null,42,null,42,null,null,null,null,null,null,"2.5","U"]
[null,"D-4",1,{"$f":"postnumb(I11,K11,V11,W11)","v":"3-U"},"3",{"$f":"ROUNDUP((K11/12)+H11+3.5+2,0)","v":18},"45",7,126,"x",60,null,{"$f":"(I11*K11)/144","v":52.5},null,{"$f":"M11*C11","v":52.5},null,null,null,null,null,null,"2.5","U"]
[null,null,null,"","",6,"",null,null,"x",null,null,0,null,0,null,null,null,null,null,null,"2.5","U"]
[null,null,null,"","",6,"",null,null,"x",null,null,0,null,0,null,null,null,null,null,null,"2.5","U"]
[null,null,null,"","",6,"",null,null,"x",null,null,0,null,0,null,null,null,null,null,null,"2.5","U"]
[null,null,null,"","",6,"",null,null,"x",null,null,0,null,0,null,null,null,null,null,null,"2.5","U"]
[null,null,null,null,null,null,null,null,null,null,null,null,"TOTAL",null,{"$f":"SUM(O7:O15)","v":310.5}]
[null,null,null,null,null,null,null,null,null," ",null," "]
[null,"SPECIFIC NOTES:"]
[null,{"$f":"\"(1)  MOUNTING HEIGHT IS MINIMUM (WITH A +6 INCH TOLERANCE)  SEE SHEET \" & TEXT(TOC!$B$20,\"0\") & \" FOR TYPICAL MOUNTING.\"","v":"(1)  MOUNTING HEIGHT IS MINIMUM (WITH A +6 INCH TOLERANCE)  SEE SHEET ST24 FOR TYPICAL MOUNTING."}]
[null,"(2)  SEE MNDOT STANDARD SIGNS MANUAL (E5-1)."]
[null,{"$f":"\"(3)  RAIL MOUNTED, SEE DETAIL SHEET \" & TEXT(TOC!$B$27, \"0\") & \".\"","v":"(3)  RAIL MOUNTED, SEE DETAIL SHEET 32."}]
[null,{"$f":"\"(4)  BRIDGE MOUNTED, SEE DETAIL SHEET \" & TEXT(TOC!$B$32, \"0\") & \".\"","v":"(4)  BRIDGE MOUNTED, SEE DETAIL SHEET 36."}]
[null,"(5)  PLACE PER MANUFACTURER'S DETAIL USING A 10 GUAGE, 2-1/2\" x 2-1/2\" PRE-PUNCHED GALVANIZED STEEL, "]
[null,"     SQUARE TUBE POST WITH A 10 GAUGE, 2-3/16\" x 2-3/16\" x 8', PRE-PUNCHED GALVANIZED STEEL INTERNAL SQUARE"]
[null,"     TUBE INSERT. THIS ASSEMBLY REQUIRES STRINGERS AND SLIP BASES."]
[]
[null,"GENERAL NOTES:"]
[null,"1.  POST LENGTHS ARE APPROXIMATE AND INCLUDE EMBEDMENT, BUT DO NOT INCLUDE"]
[null,"    ADDITIONAL LENGTH REQUIRED FOR SPLICE."]
[null,{"$f":"\"2.  SEE SHEET \" & TEXT(TOC!$B7, \"0\") & \" FOR SIGN PLACEMENT DETAILS.\"","v":"2.  SEE SHEET ST13 FOR SIGN PLACEMENT DETAILS."}]
[null,{"$f":"\"3.  SEE SHEETS \" & TEXT(TOC!$B$19,\"0\") & \" TO \" & TEXT(TOC!$B$21,\"0\") & \" FOR STRUCTURAL DETAILS.\"","v":"3.  SEE SHEETS ST23 TO ST25 FOR STRUCTURAL DETAILS."}]
[null,"4.  SEE MNDOT STANDARD SIGNS AND MARKINGS MANUAL FOR TYPE D STRINGER AND PANEL JOINT DETAILS."]
[null,{"$f":"\"5.  SEE SHEETS \" & TEXT(TOC!$B60,\"0\") & \" TO \" & TEXT(TOC!$B61,\"0\") & \" FOR SIGN PANELS.\"","v":"5.  SEE SHEETS ST81 TO ST94 FOR SIGN PANELS."}]

{"sheet":"DINS","index":18,"n_rows":32,"n_cols":17,"rows_kept":32,"cut":false,"hidden":false,"merged":[[1,2,1,11],[9,2,10,2],[9,6,10,6],[3,5,4,5],[3,7,4,10],[2,3,2,5],[9,3,10,3],[9,4,10,4],[5,7,5,10],[2,7,2,10],[2,11,2,12],[3,11,3,12],[2,2,4,2],[4,15,4,16],[12,11,12,12],[4,11,4,12],[5,11,5,12],[6,11,6,12],[11,11,11,12],[7,11,7,12],[8,11,8,12],[32,1,32,11],[26,1,26,11],[27,1,27,11],[30,1,30,11],[17,1,17,11],[19,1,19,11],[28,1,28,11],[29,1,29,11],[14,11,14,12],[15,11,15,12],[31,1,31,11],[9,1,10,1],[13,11,13,12],[10,11,10,12],[9,11,9,12]]}
[]
[null,null,"INSTALL SIGN TYPE D",null,null,null,null,null,null,null,null,null,{"$f":"'SEQ-PSTAB'!#REF!","v":{"$error":"#REF!"}}]
[null,null,"QTY","POSTS",null,null,"MTG","PANEL"]
[null,"SIGN",null,"NO\n&\nTYPE","KNEE","LENGTH","HT","SIZE",null,null,null,"PANEL"]
[null,"NO",null,"&","BRACES",null,"(1)",null,null,null,null,"LEGEND",null,null,null,"DEFAULT VALUES"]
[null,null,"EACH","TYPE","QTY","FEET","FEET","INCH",null,null,null,null,null,null,null,"POST #","POST TYPE"]
[null,"D-301",0,{"$f":"postnumb(H7,J7,P7,Q7)","v":"2-U"},{"$f":"postknee(H7,J7,P7,Q7)","v":"1"},{"$f":"ROUNDUP((J7/12)+G7+5.5,0)","v":18},7,48,"x",60,null,null,null,null,null,"2.5","U"]
[null,"D-301",0,{"$f":"postnumb(H8,J8,P8,Q8)","v":"2-U"},{"$f":"postknee(H8,J8,P8,Q8)","v":"1"},{"$f":"ROUNDUP((J8/12)+G8+5.5,0)","v":18},7,48,"x",60,null,null,null,null,null,"2.5","U"]
[null,"D-302",0,{"$f":"postnumb(H9,J9,P9,Q9)","v":"2-U"},{"$f":"postknee(H9,J9,P9,Q9)","v":"1"},18,7,48,"x",60,null,null,null,null,null,"2.5","U"]
[null,"D-303",0,{"$f":"postnumb(MAX(H10,H11),J10+J11,P10,Q10)","v":"2-U"},{"$f":"postknee(MAX(H10,H11),J10+J11,P10,Q10)","v":"1"},14,7,30,"x",15,null,null,null,null,null,"2.5","U"]
[null,null,null,null,null,9,null,36,"x",36,null,null,null,null,null,"2.5","U"]
[null,null,0,{"$f":"postnumb(H12,J12,P12,Q12)","v":""},{"$f":"postknee(H12,J12,P12,Q12)","v":""},6,null,null,"x",null,null,null,null,null,null,"2.5","U"]
[null,null,null,{"$f":"postnumb(H13,J13,P13,Q13)","v":""},{"$f":"postknee(H13,J13,P13,Q13)","v":""},6,null,null,"x",null,null,null,null,null,null,"2.5","U"]
[null,null,null,{"$f":"postnumb(H14,J14,P14,Q14)","v":""},{"$f":"postknee(H14,J14,P14,Q14)","v":""},6,null,null,"x",null,null,null,null,null,null,"2.5","U"]
[null,null,null,{"$f":"postnumb(H15,J15,P15,Q15)","v":""},{"$f":"postknee(H15,J15,P15,Q15)","v":""},6,null,null,"x",null,null,null,null,null,null,"2.5","U"]
[null,"TOTAL",{"$f":"SUM(C7:C15)","v":0}]
[null,null,null,null,null,null,null,null," ",null," "]
[null,"SPECIFIC NOTES:"]
[null,{"$f":"\"(1)  MOUNTING HEIGHT IS MINIMUM (WITH A +6 INCH TOLERANCE)  SEE SHEET \" & TEXT(TOC!$B$20,\"0\") & \" FOR TYPICAL MOUNTING.\"","v":"(1)  MOUNTING HEIGHT IS MINIMUM (WITH A +6 INCH TOLERANCE)  SEE SHEET ST24 FOR TYPICAL MOUNTING."}]
[null,"(2)  SEE MNDOT STANDARD SIGNS MANUAL (E5-1)."]
[null,{"$f":"\"(3)  RAIL MOUNTED, SEE DETAIL SHEET \" & TEXT(TOC!$B$27, \"0\") & \".\"","v":"(3)  RAIL MOUNTED, SEE DETAIL SHEET 32."}]
[null,{"$f":"\"(4)  BRIDGE MOUNTED, SEE DETAIL SHEET \" & TEXT(TOC!$B$32, \"0\") & \".\"","v":"(4)  BRIDGE MOUNTED, SEE DETAIL SHEET 36."}]
[null,"(5)  2-1/2\" x 2-1/2\" 10 GAUGE PRE-PUNCHED GALVANIZED STEEL SQUARE TUBE POST WITH A 2-3/16\" x 2-3/16\" 10 GAUGE "]
[null,"     PRE-PUNCHED GALVANIZED STEEL SQUARE TUBE INTERNAL POST. THIS ASSEMBLY REQUIRES STRINGERS AND SLIP BASES. "]
[null,"     INSTALL PER MANUFACTURER'S DETAIL."]
[]
[null,"GENERAL NOTES:"]
[null,"1.  POST LENGTHS ARE APPROXIMATE AND INCLUDE EMBEDMENT, BUT DO NOT INCLUDE"]
[null,"    ADDITIONAL LENGTH REQUIRED FOR SPLICE."]
[null,{"$f":"\"2.  SEE SHEETS \" & TEXT(TOC!$B$19,\"0\") & \" TO \" & TEXT(TOC!$B$21,\"0\") & \" FOR STRUCTURAL DETAILS.\"","v":"2.  SEE SHEETS ST23 TO ST25 FOR STRUCTURAL DETAILS."}]
[null,"3.  SEE MNDOT STANDARD SIGNS AND MARKINGS MANUAL FOR TYPE D STRINGER AND PANEL JOINT DETAILS."]
[null,{"$f":"\"4.  SEE SHEETS \" & TEXT(TOC!$B60,\"0\") & \" TO \" & TEXT(TOC!$B61,\"0\") & \" FOR SIGN PANELS.\"","v":"4.  SEE SHEETS ST81 TO ST94 FOR SIGN PANELS."}]

{"sheet":"DS&I","index":19,"n_rows":25,"n_cols":19,"rows_kept":25,"cut":false,"hidden":false,"merged":[[4,17,4,18],[21,1,21,12],[22,1,22,12],[13,1,13,12],[14,1,14,12],[15,1,15,12],[8,1,9,1],[8,4,9,4],[3,5,4,5],[8,17,9,17],[8,6,9,6],[8,18,9,18],[3,12,3,13],[4,12,4,13],[5,12,5,13],[6,12,6,13],[25,1,25,12],[19,1,19,12],[20,1,20,12],[23,1,23,12],[8,3,9,3],[8,5,9,5],[8,12,8,13],[9,12,9,13],[10,12,10,13],[11,12,11,13],[24,1,24,12],[1,2,1,12],[8,2,9,2],[8,7,9,7],[2,8,2,11],[3,6,4,6],[3,8,4,11],[5,8,5,11],[2,3,2,6],[2,12,2,13],[7,12,7,13],[2,2,4,2]]}
[]
[null,null,"SALVAGE & INSTALL SIGN TYPE D",null,null,null,null,null,null,null,null,null,null,{"$f":"'SEQ-PSTAB'!#REF!","v":{"$error":"#REF!"}}]
[null,null,"QTY","POSTS",null,null,null,"MTG","PANEL"]
[null,"SIGN",null,"NO","KNEE","SPACING","LENGTH","HT","SIZE",null,null,null,"PANEL"]
[null,"NO",null,"&","BRACES",null,null,"(1)",null,null,null,null,"LEGEND",null,null,null,null,"DEFAULT VALUES"]
[null,null,"EACH","TYPE","QTY","INCH","FEET","FEET","INCH",null,null,null,null,null,null,null,null,"POST #","POST TYPE"]
[null,"D-201",1,{"$f":"postnumb(I7,K7,R7,S7)","v":"2-U"},{"$f":"postknee(I7,K7,R7,S7)","v":"1"},{"$f":"postspace(I7,K7,R7,S7)","v":"30"},{"$f":"ROUNDUP((K7/12)+H7+5.5,0)","v":18},7,48,"x",60,null,"EXIT 40 MPH",null,null,null,null,"2.5","U"]
[null,"D-202",2,{"$f":"postnumb(I8,K8,R8,S8)","v":"2-U"},{"$f":"postknee(I8,K8,R8,S8)","v":"1"},{"$f":"postspace(I8,K8,R8,S8)","v":"30"},{"$f":"ROUNDUP((K8/12)+H8+5.5,0)","v":18},7,48,"x",60,null,"EXIT 25 MPH",null,null,null,null,"2.5","U"]
[null,"D-203",1,{"$f":"postnumb(MAX(I9,I10),K9+K10,R9,S9)","v":"2-U"},{"$f":"postknee(MAX(I9,I10),K9+K10,R9,S9)","v":"1"},{"$f":"postspace(MAX(I9:I10),SUM(K9:K10),R9,S9)","v":"24"},{"$f":"ROUNDUP((SUM(K9:K10)/12)+H9+5.5,0)","v":17},7,30,"x",15,null,"NORTH",null,null,null,null,"2.5","U"]
[null,null,null,null,null,null,null,null,36,"x",36,null,"INTERSTATE 35"]
["(2)","D-204",1,{"$f":"postnumb(I11,K11,R11,S11)","v":"2-U"},{"$f":"postknee(I11,K11,R11,S11)","v":"2"},{"$f":"postspace(I11,K11,R11,S11)","v":"42"},{"$f":"ROUNDUP((K11/12)+H11+5.5,0)","v":18},7,72,"x",60,null,"Exit Panel 60 degree",null,null,null,null,"2.5","U"]
[null,"TOTAL",{"$f":"SUM(C7:C11)","v":5}]
[null,null,null,null,null,null,null,null,null," ",null," "]
[null,"SPECIFIC NOTES:"]
[null,{"$f":"\"(1)  MOUNTING HEIGHT IS MINIMUM (WITH A +6 INCH TOLERANCE)  SEE SHEET \" & TEXT(TOC!$B$20,\"0\") & \" FOR TYPICAL MOUNTING.\"","v":"(1)  MOUNTING HEIGHT IS MINIMUM (WITH A +6 INCH TOLERANCE)  SEE SHEET ST24 FOR TYPICAL MOUNTING."}]
[null,"(2)  SEE STANDARD SIGNS MANUAL (E5-1)."]
[null,{"$f":"\"(3)  RAIL MOUNTED, SEE DETAIL SHEET \" & TEXT(TOC!$B$27, \"0\") & \".\"","v":"(3)  RAIL MOUNTED, SEE DETAIL SHEET 32."}]
[null,{"$f":"\"(4)  BRIDGE MOUNTED, SEE DETAIL SHEET \" & TEXT(TOC!$B$32, \"0\") & \".\"","v":"(4)  BRIDGE MOUNTED, SEE DETAIL SHEET 36."}]
[]
[null,"GENERAL NOTES:"]
[null,"1.  POST LENGTHS ARE APPROXIMATE AND INCLUDE EMBEDMENT, BUT DO NOT INCLUDE"]
[null,"    ADDITIONAL LENGTH REQUIRED FOR SPLICE."]
[null,{"$f":"\"2.  SEE SHEETS \" & TEXT(TOC!$B$19,\"0\") & \" TO \" & TEXT(TOC!$B$21,\"0\") & \" FOR STRUCTURAL DETAILS.\"","v":"2.  SEE SHEETS ST23 TO ST25 FOR STRUCTURAL DETAILS."}]
[null,"3.  SEE MNDOT STANDARD SIGNS AND MARKINGS MANUAL FOR TYPE D STRINGER AND PANEL JOINT DETAILS."]
[null,{"$f":"\"4.  SEE SHEETS \" & TEXT(TOC!$B60,\"0\") & \" TO \" & TEXT(TOC!$B$61,\"0\") & \" FOR SIGN PANELS.\"","v":"4.  SEE SHEETS ST81 TO ST94 FOR SIGN PANELS."}]

{"sheet":"DSAL","index":20,"n_rows":19,"n_cols":15,"rows_kept":19,"cut":false,"hidden":false,"merged":[[6,9,6,10],[7,9,7,10],[8,9,8,10],[9,9,9,10],[10,9,10,10],[4,13,4,14],[3,5,4,8],[2,5,2,8],[1,2,1,9],[2,3,2,4],[2,2,4,2],[5,5,5,8],[2,9,2,10],[3,9,3,10],[4,9,4,10],[5,9,5,10],[7,2,8,2],[7,3,8,3],[7,4,8,4],[18,1,18,9],[16,1,16,9],[17,1,17,9],[7,1,8,1],[11,9,11,10],[12,9,12,10],[13,9,13,10],[14,9,14,10]]}
[]
[null,null,"SALVAGE SIGN TYPE D",null,null,null,null,null,null,null,{"$f":"'SEQ-PSTAB'!#REF!","v":{"$error":"#REF!"}}]
[null,null,"QTY","POSTS",null,"PANEL"]
[null,"SIGN",null,"NO","KNEE","SIZE",null,null,null,"PANEL"]
[null,"NO",null,"&","BRACES",null,null,null,null,"LEGEND",null,null,null,"DEFAULT VALUES"]
[null,null,"EACH","TYPE","QTY","INCH",null,null,null,null,null,null,null,"POST #","POST TYPE"]
[null,"D-101",1,{"$f":"postnumb(F7,H7,N7,O7)","v":"2-U"},{"$f":"postknee(F7,H7,N7,O7)","v":"1"},48,"x",60,null,"EXIT 40 MPH",null,null,null,"3","U"]
[null,"D-102",2,{"$f":"postnumb(MAX(F8,F9),H8+H9,N8,O8)","v":"2-U"},{"$f":"postknee(MAX(F8,F9),H8+H9,N8,O8)","v":"1"},24,"x",15,null,"NORTH",null,null,null,"3","U"]
[null,null,null,null,null,24,"x",24,null,"INTERSTATE 35",null,null,null,"3","U"]
[null,null,null,{"$f":"postnumb(F10,H10,N10,O10)","v":""},{"$f":"postknee(F10,H10,N10,O10)","v":""},null,"x",null,null,null,null,null,null,"3","U"]
[null,null,null,{"$f":"postnumb(F11,H11,N11,O11)","v":""},{"$f":"postknee(F11,H11,N11,O11)","v":""},null,"x",null,null,null,null,null,null,"3","U"]
[null,null,null,{"$f":"postnumb(F12,H12,N12,O12)","v":""},{"$f":"postknee(F12,H12,N12,O12)","v":""},null,"x",null,null,null,null,null,null,"3","U"]
[null,null,null,{"$f":"postnumb(F13,H13,N13,O13)","v":""},{"$f":"postknee(F13,H13,N13,O13)","v":""},null,"x",null,null,null,null,null,null,"3","U"]
[null,null,null,{"$f":"postnumb(F14,H14,N14,O14)","v":""},{"$f":"postknee(F14,H14,N14,O14)","v":""},null,"x",null,null,null,null,null,null,"3","U"]
[null,"TOTAL",{"$f":"SUM(C7:C14)","v":3}]
[null,null,null,null,null,null," ",null," "]
[null,"SPECIFIC NOTES:"]
[null,"(1)  SIGN PANELS ARE TO BE SALVAGED AND RETURNED TO <County Name>."]
[null,"     PLEASE CONTACT <Name> AT <Phone Number> TO SCHEDULE PICKUP."]

{"sheet":"MASTARM","index":21,"n_rows":21,"n_cols":18,"rows_kept":21,"cut":false,"hidden":false,"merged":[[5,16,5,17],[4,16,4,17],[3,16,3,17],[2,16,2,17],[6,16,6,17],[7,16,7,17],[8,16,8,17],[9,16,9,17],[10,16,10,17],[22,1,22,11],[16,1,16,11],[20,1,20,16],[19,1,19,16],[18,1,18,16],[1,2,1,16],[3,10,4,11],[2,6,2,13],[4,21,4,22],[17,1,17,16],[12,1,12,11],[5,10,5,11],[15,1,15,11],[2,4,5,4],[2,14,2,15],[5,6,5,9],[3,6,4,9],[3,14,5,14],[3,12,3,13],[4,12,4,13],[5,12,5,13]]}
[]
[null,null,"MAST ARM MOUNTED SIGNS",null,null,null,null,null,null,null,null,null,null,null,null,null,null,{"$f":"'SEQ-PSTAB'!#REF!","v":{"$error":"#REF!"}}]
[null,null,null,null,"QTY",null,"PANEL",null,null,null,null,null,null,null,"MOUNTING STIFFENERS"]
[null,"SIGN","SIGNAL","POLE",null,"a","SIZE",null,null,null,"AREA",null,"TOTAL",null,"NUMBER",null,"PANEL"]
[null,"NO","SYSTEM","NO",null,null,null,null,null,null,null,null,"AREA",null,null,"SPACING","LEGEND"]
[null,null,null,null,null,"FEET","INCH",null,null,null,"SQ FT",null,"SQ FT",null,null,"(1)"]
[null,"R10-2","A",null,1,null,24,"x",24,null,{"$f":"(G7*I7)/144","v":4},null,{"$f":"IF(E7<>\"\", K7*E7,\"\")","v":4},null,{"$f":"mastarmposts(I7,G7,MAH,MAW,MAQ)","v":"2"},{"$f":"mastarmposts(I7,G7,MAH,MAW,MAS)","v":"12"},"LEFT TURN YIELD ON GREEN"]
[null,"D-1","A",null,1,null,72,"x",24,null,{"$f":"(G8*I8)/144","v":12},null,{"$f":"IF(E8<>\"\", K8*E8,\"\")","v":12},null,{"$f":"mastarmposts(I8,G8,MAH,MAW,MAQ)","v":"3"},{"$f":"mastarmposts(I8,G8,MAH,MAW,MAS)","v":"30"},"MN101 LEFT ARROW"]
[null,"D-2","B",null,1,null,102,"x",24,null,{"$f":"(G9*I9)/144","v":17},null,{"$f":"IF(E9<>\"\", K9*E9,\"\")","v":17},null,{"$f":"mastarmposts(I9,G9,MAH,MAW,MAQ)","v":"4"},{"$f":"mastarmposts(I9,G9,MAH,MAW,MAS)","v":"30"},"MISSISSIPPI AVE"]
[null,null,null,null,null,null,null,null,null,null,null,null,{"$f":"IF(E10<>\"\", K10*E10,\"\")","v":""},null,{"$f":"mastarmposts(I10,G10,MAH,MAW,MAQ)","v":""},{"$f":"mastarmposts(I10,G10,MAH,MAW,MAS)","v":""}]
[null,null,null,null,null,null,null,null,null,null,null,null,{"$f":"IF(E11<>\"\", K11*E11,\"\")","v":""},null,{"$f":"mastarmposts(I11,G11,MAH,MAW,MAQ)","v":""},{"$f":"mastarmposts(I11,G11,MAH,MAW,MAS)","v":""}]
[]
[null,"SPECIFIC NOTES:"]
[null,{"$f":"\"(1)  SPACING BETWEEN STIFFENERS SHALL NOT EXCEED 36 INCHES AND SHALL BE UNIFORMLY SPACED.\"","v":"(1)  SPACING BETWEEN STIFFENERS SHALL NOT EXCEED 36 INCHES AND SHALL BE UNIFORMLY SPACED."}]
[null,"     SEE MNDOT STANDARD SIGNS AND MARKINGS MANUAL, PAGE 105A FOR STIFFENER SPACING REQUIREMENTS."]
[]
[null,"GENERAL NOTES:"]
[null,"1.  CORNERS OF STANDARD SIGN PANELS WITH MARGINS SHALL BE TRIMMED."]
[null,"2.  FOR STRUCTURAL DETAILS OF MAST ARM MOUNTED SIGNS SEE MNDOT STANDARD SIGNS AND MARKINGS MANUAL, PAGE 105A."]
[null,"3.  FOR TYPE D STRINGER AND PANEL JOINT DETAILS SEE MNDOT STANDARD SIGNS AND MARKINGS MANUAL, PAGE 105."]
[null,"4.  THE MAST ARM MOUNTED SIGNS ARE INCLUDED IN THE TRAFFIC CONTROL SIGNAL SYSTEM PAY ITEM."]

{"sheet":"DELINEATOR","index":22,"n_rows":17,"n_cols":6,"rows_kept":17,"cut":false,"hidden":false,"merged":[[1,1,1,4],[2,1,4,1],[8,4,8,5],[5,4,5,5],[6,4,6,5],[7,4,7,5],[3,2,3,3],[3,4,4,5],[2,2,2,5]]}
[]
[null,"DELINEATOR",null,null,null,{"$f":"'SEQ-PSTAB'!#REF!","v":{"$error":"#REF!"}}]
[null,"CODE NO","QUANTITY\nEACH"]
[null,null,"COLOR",null,"TOTAL"]
[null,null,"WHITE","YELLOW"]
["(1)","X3-1",null,null,{"$f":"SUM(C6:D6)","v":0}]
["(1)","X4-6",null,null,{"$f":"SUM(C7:D7)","v":0}]
["(1)","X4-8",null,null,{"$f":"SUM(C8:D8)","v":0}]
["(2)"," X4-13",null,null,{"$f":"SUM(C9:D9)","v":0}]
[]
[]
[null,"SPECIFIC NOTES:"]
[null,"(1)  MOUNT ON 3LB/FT POST (MNDOT 3401)."]
[null,"(2)  XX ARE MOUNTED BELOW TYPE C SIGNS. XX ARE MOUNTED ON 3 LB POSTS."]
[null,"GENERAL NOTES:"]
[null,{"$f":"\"1.  FOR DELINEATOR PLACEMENT, SEE SHEET NO. \" & TEXT(TOC!$B$8,\"0\") & \".\"","v":"1.  FOR DELINEATOR PLACEMENT, SEE SHEET NO. ST87."}]
[null,"2.  SEE MNDOT STANDARD SIGNS AND MARKINGS MANUAL FOR DELINEATOR DETAIL."]

{"sheet":"MARKER","index":23,"n_rows":32,"n_cols":7,"rows_kept":32,"cut":false,"hidden":false,"merged":[[15,2,15,3],[14,5,14,6],[5,2,5,5],[7,5,7,6],[8,5,8,6],[9,5,9,6],[10,5,10,6],[11,5,11,6],[13,5,13,6],[12,5,12,6],[6,4,7,4],[6,5,6,6]]}
[]
[]
[]
[]
[]
[null,null,"OBJECT MARKER",null,null,null,"AA"]
[null,null,"CODE","SIZE","COLOR","QUANTITY"]
[null,null,"NO","INCH",null,"EACH"]
[null,"(2)","X4-2","18 x 18","YELLOW ON BLACK",4]
[null,"(1)","X4-3","6 x 12","YELLOW",1]
[null,"(1)","X4-4(L)","18 x 36","BLACK ON YELLOW",2]
[null,"(1)","X4-4(C)","12 x 24","BLACK ON YELLOW",5]
[null,"(1)","X4-4(R)","12 x 36","BLACK ON YELLOW",2]
[null,"(1)","X4-5","6 x 12","BLACK ON YELLOW",1]
[null,"(1)","X4-11","18 x 18","RED ON BLACK",2]
[null,null,"TOTAL QUANTITIES"]
[null,null,"CODE","QUANTITY"]
[null,null,"NO","EACH"]
[null,null,"X4-2",{"$f":"F9","v":4}]
[null,null,"X4-3",{"$f":"F10","v":1}]
[null,null,"X4-4",{"$f":"F11+F12+F13","v":9}]
[null,null,"X4-5",{"$f":"F14","v":1}]
[null,null,"X4-11",{"$f":"F15","v":2}]
[]
[null,null,"SPECIFIC NOTES:"]
[null,null,"(1)  MOUNT ON 3LB/FT POST (MNDOT 3401)."]
[null,null,"(2)  XX ARE MOUNTED BELOW TYPE C SIGNS. XX ARE MOUNTED ON 3 LB POSTS."]
[null,null,"(3)  XX ARE MOUNTED BELOW TYPE C SIGNS. XX ARE MOUNTED ON 3 LB POSTS."]
[null,null,"(4)  XX ARE MOUNTED BELOW TYPE C SIGNS. XX ARE MOUNTED ON 3 LB POSTS."]
[null,null,"GENERAL NOTES:"]
[null,null,{"$f":"\"1.  FOR MARKER PLACEMENT, SEE SHEET NO. \" & TEXT(TOC!$B$8,\"0\") & \".\"","v":"1.  FOR MARKER PLACEMENT, SEE SHEET NO. ST87."}]
[null,null,"2.  SEE MNDOT STANDARD SIGNS AND MARKINGS MANUAL FOR MARKER DETAIL."]

{"sheet":"DELS&I","index":24,"n_rows":17,"n_cols":7,"rows_kept":17,"cut":false,"hidden":false,"merged":[[12,5,12,6],[1,2,1,5],[4,5,4,6],[5,5,5,6],[6,5,6,6],[2,2,3,2],[2,5,3,6]]}
[]
[null,null,"SALVAGE & INSTALL  MARKER  AND DELINEATOR(1)",null,null,null,"STF"]
[null,null,"CODE NO","QTY-MARKER","QTY-DELINEATOR","LOCATION"]
[null,null,null,"EACH","EACH"]
[null,null,"WHITE X4-6"," ",6,"EXIT NOSE"]
[null,"(1)","YELLOW X4-6"," ",8,"EXIT NOSE"]
[null,null,"OBJECT MARKER X4-2",2,null,"EXIT NOSE"]
[null,null,"HAZARD MARKER X4-2",0,null,"ISLAND"]
[null,null,"HAZARD MARKER X4-2",0,null,"MOUNT BELOW C-8"]
[null,null,"X4-4 L",0,null,"ISLAND"]
[]
[null,null,"SP 2785-364 TOTAL",{"$f":"SUM(D5:D11)","v":2}]
[null,null,"TOTAL",{"$f":"SUM(D5:D7)","v":2},{"$f":"SUM(E5:E7)","v":14}]
[]
[null,null,"(1)  SEE STANDARD SIGNS MANUAL FOR GUIDE DELINEATOR X4-6."]
[null,null,"SPECIFIC NOTES:"]
[null,null,{"$f":"\"(1)  FOR DELINEATOR AND MARKER PLACEMENT, SEE SHEET  \" & TEXT(TOC!$B$8,\"0\") & \" \"","v":"(1)  FOR DELINEATOR AND MARKER PLACEMENT, SEE SHEET  ST87 "}]

{"sheet":"DELREM","index":25,"n_rows":28,"n_cols":4,"rows_kept":28,"cut":false,"hidden":false,"merged":[[5,2,5,3],[3,1,3,4]]}
[]
["       Enter total number of delineators to be removed directly into the Statement of Estimated Quantities (SEQ)"]
[]
[null,"MnDOT no longer includes this chart in signing plans."]
[]
[null,{"$f":"'SEQ-PSTAB'!#REF!","v":{"$error":"#REF!"}},"REMOVE DELINEATORS & MARKERS"]
[null,"CODE NO","QTY","LOCATION"]
["(1)","X4-6",1,"EXIT NOSE"]
["(1)","X4-6",1,"EXIT NOSE"]
["(3)","X4-2",1,"EXIT NOSE"]
["(2)","X4-2",1,"ISLAND"]
["(4)","X4-4L",1,"ISLAND"]
[null,"TOTAL",{"$f":"SUM(C8:C12)","v":5}]
[]
[]
[]
[null,"this chart is no longer necesary"]
[null,"*Prior to 2010 this chart was included in Signing Plans. "]
[]
[null,"CURRENT PRACTICE:"]
[null," ENTER THE NUMBER OF DELINEATORS AND MARKERS TO BE REMOVED DIRECTLY INTO SEQ"]
[null," PAY ITEMS in SEQ are: 2104.502 REMOVE DELINEATOR & 2104.502 REMOVE MARKER"]
[]
[]
[null,"*LABEL NUMBER OF DELINEATORS & MARKERS TO BE REMOVED ON ROADWAY LAYOUT"]
[]
[]
[null,"SEQ = Statement of Estimated Quantities or Permanent Signing Tabulation if Plan is \"Stand Alone\""]

{"sheet":"REF SIGN","index":26,"n_rows":19,"n_cols":10,"rows_kept":19,"cut":false,"hidden":false,"merged":[[4,9,5,9],[4,7,4,8],[5,7,5,8],[6,7,6,8],[7,7,7,8],[3,3,3,6],[2,3,2,6],[2,7,3,8],[10,7,10,8],[1,1,1,7],[4,1,5,1],[4,2,5,2],[8,7,8,8],[9,7,9,8]]}
[]
[null,"REFERENCE LOCATION SIGN (1)",null,null,null,null,null,null,{"$f":"'SEQ-PSTAB'!#REF!","v":{"$error":"#REF!"}}]
[null,"CODE","QTY","SIZE",null,null,null,"LEGEND"]
[null,"NO","EACH","INCH"]
[null,"D10-1",1,10,"x",18,null,"MILE 1",null,"(2)"]
[null,null,null,10,"X",18,null,"MILE 1"]
[null,"D10-2",1,12,"x",36,null,"MILE 12"]
[null,"D10-3",1,12,"x",48,null,"MILE 123"]
[null,null,null,null,"x"]
[null,null,null,null,"x"]
[null,"TOTAL",{"$f":"SUM(C5:C10)","v":3}]
[]
[null,"SPECIFIC NOTES:"]
[null,"(1)  MOUNT ON 3 LB/FT POST (MNDOT 3401)."]
[null,"(2)  MOUNT BACK TO BACK."]
[]
[null,"GENERAL NOTE:"]
[null,"1. SEE MNDOT STANDARD SIGNS AND MARKINGS MANUAL FOR REFERENCE LOCATION SIGN DETAIL."]
[null,{"$f":"\"2. FOR REFERENCE LOCATION SIGN PLACEMENT, SEE SHEET NO. \" & TEXT(TOC!$B$8,\"0\") & \".\"","v":"2. FOR REFERENCE LOCATION SIGN PLACEMENT, SEE SHEET NO. ST87."}]

{"sheet":"SAL REF SIGN","index":27,"n_rows":19,"n_cols":10,"rows_kept":19,"cut":false,"hidden":false,"merged":[[1,1,1,7],[2,3,2,6],[2,7,3,8],[3,3,3,6],[4,1,5,1],[4,2,5,2],[4,7,4,8],[10,7,10,8],[4,9,5,9],[5,7,5,8],[6,7,6,8],[7,7,7,8],[8,7,8,8],[9,7,9,8]]}
[]
[null,"SALVAGE REFERENCE LOCATION SIGN (1)",null,null,null,null,null,null,{"$f":"'SEQ-PSTAB'!#REF!","v":{"$error":"#REF!"}}]
[null,"CODE","QTY","SIZE",null,null,null,"LEGEND"]
[null,"NO","EACH","INCH"]
[null,"D10-1",1,10,"x",18,null,"MILE 1",null,"(2)"]
[null,null,null,10,"X",18,null,"MILE 1"]
[null,"D10-2",1,12,"x",36,null,"MILE 12"]
[null,"D10-3",1,12,"x",48,null,"MILE 123"]
[null,null,null,null,"x"]
[null,null,null,null,"x"]
[null,"TOTAL",{"$f":"SUM(C5:C10)","v":3}]
[]
[null,"SPECIFIC NOTES:"]
[null,"(1)  MOUNT ON 3 LB/FT POST (MNDOT 3401)."]
[null,"(2)  MOUNT BACK TO BACK."]
[]
[null,"GENERAL NOTE:"]
[null,"1. SEE MNDOT STANDARD SIGNS AND MARKINGS MANUAL FOR REFERENCE LOCATION SIGN DETAIL."]
[null,{"$f":"\"2. FOR REFERENCE LOCATION SIGN PLACEMENT, SEE SHEET NO. \" & TEXT(TOC!$B$8,\"0\") & \".\"","v":"2. FOR REFERENCE LOCATION SIGN PLACEMENT, SEE SHEET NO. ST87."}]

{"sheet":"REF SIGN S&I","index":28,"n_rows":19,"n_cols":10,"rows_kept":19,"cut":false,"hidden":false,"merged":[[1,1,1,7],[2,3,2,6],[2,7,3,8],[3,3,3,6],[4,1,5,1],[4,2,5,2],[4,7,4,8],[10,7,10,8],[4,9,5,9],[5,7,5,8],[6,7,6,8],[7,7,7,8],[8,7,8,8],[9,7,9,8]]}
[]
[null,"SALVAGE & INSTALL REFERENCE LOCATION SIGN (1)",null,null,null,null,null,null,{"$f":"'SEQ-PSTAB'!#REF!","v":{"$error":"#REF!"}}]
[null,"CODE","QTY","SIZE",null,null,null,"LEGEND"]
[null,"NO","EACH","INCH"]
[null,"D10-1",1,10,"x",18,null,"MILE 1",null,"(2)"]
[null,null,null,10,"X",18,null,"MILE 1"]
[null,"D10-2",1,12,"x",36,null,"MILE 12"]
[null,"D10-3",1,12,"x",48,null,"MILE 123"]
[null,null,null,null,"x"]
[null,null,null,null,"x"]
[null,"TOTAL",{"$f":"SUM(C5:C10)","v":3}]
[]
[null,"SPECIFIC NOTES:"]
[null,"(1)  MOUNT ON 3 LB/FT POST (MNDOT 3401)."]
[null,"(2)  MOUNT BACK TO BACK."]
[]
[null,"GENERAL NOTE:"]
[null,"1. SEE MNDOT STANDARD SIGNS AND MARKINGS MANUAL FOR REFERENCE LOCATION SIGN DETAIL."]
[null,{"$f":"\"2. FOR REFERENCE LOCATION SIGN PLACEMENT, SEE SHEET NO. \" & TEXT(TOC!$B$8,\"0\") & \".\"","v":"2. FOR REFERENCE LOCATION SIGN PLACEMENT, SEE SHEET NO. ST87."}]

{"sheet":"BRIDGE NO","index":29,"n_rows":10,"n_cols":9,"rows_kept":10,"cut":false,"hidden":false,"merged":[[6,7,6,8],[9,1,9,13],[4,7,4,8],[5,7,5,8],[1,1,1,7],[2,3,2,6],[2,7,3,8],[3,3,3,6]]}
[]
[null,"BRIDGE NUMBER MARKER (1)",null,null,null,null,null,null,{"$f":"'SEQ-PSTAB'!#REF!","v":{"$error":"#REF!"}}]
[null,"CODE","QTY","SIZE",null,null,null,"LEGEND"]
[null,"NO","EACH","INCH"]
[null,"X4-12A",2,6,"x",15,null,1234]
[null,"X4-12A",2,6,"x",18,null,12345]
[null,"TOTAL",{"$f":"SUM(C5:C6)","v":4}]
[]
[null,"SPECIFIC NOTES:"]
[null,"(1)  SEE MNDOT STANDARD SIGNS AND MARKINGS MANUAL FOR BRIDGE NUMBER MARKER."]

{"sheet":"PU3LB","index":30,"n_rows":12,"n_cols":8,"rows_kept":12,"cut":false,"hidden":false,"merged":[[10,4,10,7],[11,4,11,7],[5,4,5,7],[6,4,6,7],[7,4,7,7],[8,4,8,7],[9,4,9,7],[2,2,4,2],[2,1,4,1],[1,2,1,6],[2,5,2,7],[3,5,3,7],[4,4,4,7]]}
[]
[null,"AA","STRUCTURAL STEEL 3# U-POST",null,null,null,null,"AA"]
[null,"DESCRIPTION","QTY","WEIGHT",null,"TOTAL"]
[null,null,null,"PER POST",null,"WEIGHT"]
[null,null,null,"(POUND)","(POUND)"]
[null,"6 FOOT",15,18,{"$f":"C6*D6","v":270}]
[null,"7 FOOT",55,21,1155]
[null,"8 FOOT",35,24,840]
[null,"10 FOOT",65,30,1950]
[null,"12 FOOT",55,36,1980]
[null,"14 FOOT",25,42,1050]
[null,null,null,"TOTAL ",{"$f":"SUM(E6:H11)","v":7245}]

{"sheet":"OL","index":31,"n_rows":17,"n_cols":17,"rows_kept":17,"cut":false,"hidden":false,"merged":[[19,1,19,11],[2,1,3,1],[1,2,1,11],[2,9,2,10],[3,9,3,10],[2,2,3,2],[2,11,3,12],[4,11,4,12],[5,11,5,12],[6,11,6,12],[7,11,7,12],[8,11,8,12],[9,11,9,12],[10,11,10,12],[11,11,11,12],[1,21,1,22],[16,3,16,5],[2,3,2,6],[3,3,3,6],[2,7,2,8],[3,7,3,8],[12,11,12,12],[13,11,13,12],[14,11,14,12],[15,11,15,12],[16,11,16,12]]}
[null,null,null,null,null,null,null,null,null,null,null,null,null,null,null,null," "]
[null,null,"SIGN PANELS TYPE OVERLAY",null,null,null,null,null,null,null,null,null,{"$f":"'SEQ-PSTAB'!#REF!","v":{"$error":"#REF!"}}]
[null,"CODE NO","QTY","SIZE",null,null,null,"AREA",null,"TOTAL",null,"LEGEND"]
[null,null,null,"INCH",null,null,null,"SQ FT",null,"SQ FT"]
[null,"M1-1",0,45,"x",36,null,{"$f":"D5*F5/144","v":11.25},null,{"$f":"C5*H5","v":0},null,"INTERSTATE 494"]
[null,"M1-1",0,30,"x",24,null,5,null,{"$f":"C6*H6","v":0},null,"INTERSTATE 494"]
[null,"M1-1",0,36,"x",36,null,9,null,0,null,"INTERSTATE 94"]
[null,"M1-1",0,24,"x",24,null,4,null,0,null,"INTERSTATE 94"]
[null,"M1-4A",0,45,"x",36,null,11.25,null,0,null,"US 212"]
[null,"M1-4A",0,36,"x",36,null,9,null,0,null,"US 52"]
[null,"M1-5B",0,45,"x",36,null,11.25,null,0,null,"MINNESOTA 100"]
[null,"M1-5B",0,24,"x",24,null,4,null,0,null,"MINNESOTA 5"]
[null,"M1-6",0,24,"x",24,null,4,null,0,null,"CSAH 42"]
[null,"M1-6A",0,45,"x",36,null,11.25,null,0,null,"COUNTY 101"]
[null,"M1-X4A",0,36,"x",36,null,9,null,0,null,"COUNTY 1"]
[null,"M1-X4A",0,24,"x",24,null,4,null,0,null,"COUNTY 11"]
[null,null,null,null,null,null,null,"TOTAL",null,{"$f":"SUM(J5:J16)","v":0}]

{"sheet":"S&I SPEC","index":32,"n_rows":15,"n_cols":13,"rows_kept":15,"cut":false,"hidden":false,"merged":[[1,2,1,6],[2,2,4,2],[2,3,2,4],[2,6,2,7],[3,4,4,4],[3,6,3,7],[4,6,4,7],[4,11,4,12],[5,6,5,7],[6,1,7,1],[6,2,7,2],[6,3,7,3],[6,4,7,4],[6,5,7,5],[6,6,6,7],[7,6,7,7],[16,1,16,6],[17,1,17,6],[18,1,18,6],[8,6,8,7],[10,1,10,6],[12,1,12,6],[13,1,13,6],[14,1,14,9],[15,1,15,6]]}
[]
[null,null,"SALVAGE & INSTALL SIGN TYPE SPECIAL",null,null,null,null,"AA"]
[null,null,"QTY","POSTS",null,"MTG"]
[null,"SIGN",null,"NO","LENGTH","HT","PANEL"]
[null,"NO",null,"&",null,"(1)","LEGEND",null,null,null,null,"DEFAULT VALUES"]
[null,null,"EACH","TYPE","FEET","FEET",null,null,null,null,null,"POST LB","POST TYPE"]
[null,"C-201",1,"1-O",11,7,"ROCHESTER BLVD",null,null,null,null,"2.5","U"]
[null,null,null,null,null,null,"250TH ST E",null,null,null,null,"2.5","U"]
[null,"TOTAL ",{"$f":"SUM(C7:C8)","v":1}]
[]
[null,"SPECIFIC NOTE:"]
[null,{"$f":"\"(1)  MOUNTING HEIGHT IS MINIMUM (WITH A +6 INCH TOLERANCE)\"","v":"(1)  MOUNTING HEIGHT IS MINIMUM (WITH A +6 INCH TOLERANCE)"}]
[]
[null,"GENERAL NOTE:"]
[null,"1.  POST LENGTHS ARE APPROXIMATE AND INCLUDE EMBEDMENT, BUT DO NOT ACCOUNT FOR DITCH GRADE."]

{"sheet":"A REM FOOT","index":33,"n_rows":26,"n_cols":5,"rows_kept":26,"cut":false,"hidden":false,"merged":[[15,3,15,4],[10,3,10,4],[11,3,11,4],[12,3,12,4],[13,3,13,4],[14,3,14,4],[5,3,5,4],[6,3,6,4],[7,3,7,4],[8,3,8,4],[9,3,9,4],[2,2,3,2],[1,2,1,3],[2,3,2,4],[3,3,3,4],[4,3,4,4]]}
[]
[null,null,"REMOVE SIGN FOOTING-TYPE A",null,{"$f":"'SEQ-PSTAB'!#REF!","v":{"$error":"#REF!"}}]
[null,"SIGN","LOCATION","FOOTING DEPTH"]
[null,"NO",null,"FEET"]
[null,"A I94-528","142+00 SB",6]
[null,"A I90-874","212+75 NB",7.5]
[null,null,null," "]
[null,null,null," "]
[null,null,null," "]
[null,null,null," "]
[null,null,null," "]
[null,null,null," "]
[null,null,null," "]
[null,null,null," "]
[null,null,null," "]
[null,null,null," "]
[]
[]
[null,"TOTAL",{"$f":"COUNTA(B5:B16)","v":2}]
[]
[]
[null,"USER NOTES:"]
[null,"Sign is crushed and the CONCRETE base is left sitting and needs "]
[null,"to be removed before new sign can be installed"]
[null,"INCLUDED IN 2104.509 REMOVE SIGN BASE (EACH)"]
[null,"Remember that there are two footings for each sign!!  "]

{"sheet":"SIGN PANELS TYPE A EXTRUDED","index":34,"n_rows":23,"n_cols":14,"rows_kept":23,"cut":false,"hidden":false,"merged":[[15,11,15,13],[6,9,6,13],[7,9,7,13],[2,2,5,2],[5,3,5,6],[1,2,1,12],[2,3,2,8],[3,3,3,8],[5,7,5,8],[4,3,4,6],[4,7,4,8],[2,9,2,13],[3,9,3,13],[4,9,4,13],[5,9,5,13]]}
[]
[null,null," SIGN PANELS TYPE A (EXTRUDED)",null,null,null,null,null,null,null,null,null,null,{"$f":"'SEQ-PSTAB'!#REF!","v":{"$error":"#REF!"}}]
[null,null,"LOCATION","F & I",null,null,null,null,null,"REQUIRED"]
[null,"SIGN",null,"PANEL SECTIONS",null,null,null,null,null,"PANEL"]
[null,"NO",null,"SIZE",null,null,null,"AREA",null,"SIZE"]
[null,null,null,"INCH",null,null,null,"SQ FT",null,"INCH"]
[null,"A I35-025","142+00 SB",0,"x",12,null,{"$f":"D7*F7/144","v":0},null,"132 x 102"]
[null,"A I35-026","212+75 NB",0,"x",12,null,{"$f":"D8*F8/144","v":0},null,"138 x 96"]
[null,null,null,null,"x",null,null,0,null,null,"x"]
[null,null,null,null,"x",null,null,0,null,null,"x"]
[null,null,null,null,"x",null,null,0,null,null,"x"]
[null,null,null,null,"x",null,null,0,null,null,"x"]
[null,null,null,null,"x",null,null,0,null,null,"x"]
[null,null,null,null,"x",null,null,0,null,null,"x"]
[null,null,null,null,"x",null,null,0,null,null,"x"]
[null,null,null,null,null,"TOTAL",null,{"$f":"SUM(H7:H15)","v":0}]
[null,null,null,null," ",null," ",null,null,null," ",null," "]
[null,"USER NOTES:"]
[null,"Paid for 2564.531 as Sign Panels Type A (sq. ft.)"]
[null,"wrong title; Rick to get us the correct title"]
[null,"roadway note will say : F and I extruded panel sections.  "]
[null,"this chart pays for the extruded panels but then the sign overlay is INCLUDED IN SIGN PANEL OVERLAY TYPE A."]
[null,"you'll then need a second chart for the whole sign called SIGN PANEL OVERLAY TYPE A."]

{"sheet":"AEXTRM","index":35,"n_rows":16,"n_cols":10,"rows_kept":16,"cut":false,"hidden":false,"merged":[[1,7,1,9],[3,7,3,9],[2,7,2,9],[1,1,1,6],[2,3,2,6],[2,2,4,2],[3,3,3,6],[4,3,4,9],[2,1,4,1]]}
[null,null," "]
[null,"REMOVE EXTRUDED PANEL SECTIONS TYPE A",null,null,null,null,null,"AA"]
[null,"SIGN\nNO","LOCATION","PANEL SIZE",null,null,null,"PANEL SIZE"]
[null,null,null,"EXISTING",null,null,null,"MODIFIED"]
[null,null,null,"INCH"]
[null,"A I94-587","142+00 SB",132,"x",12,null,"102","x","78"]
[null,"A I94-588","212+75 NB",186,"x",12,null,"186","x","102"]
[null,null,null,null,"x",null,null,null,"x"]
[null,null,null,null,"x",null,null,null,"x"]
[null,null,null,null,"x",null,null,null,"x"]
[null,null,null,null," ",null," "]
[null,"NOTE:"]
[null,"1. INCLUDED IN SIGN PANEL OVERLAY TYPE A.  "]
[]
[null,"USER NOTES:"]
[null,"No matching PAY ITEM.  This is incidental to SIGN PANEL OVERLAY TYPE A (thus you need to have a chart for the sign panel overlay type A)"]

{"sheet":"AEXTSA","index":36,"n_rows":20,"n_cols":11,"rows_kept":20,"cut":false,"hidden":false,"merged":[[1,9,1,10],[1,1,1,8],[3,3,3,6],[3,7,3,10],[2,2,4,2],[2,3,2,10],[4,3,4,10],[2,1,4,1]]}
[null,null," "]
[null,"SALVAGE EXTRUDED PANEL SECTIONS TYPE A",null,null,null,null,null,null,null,{"$f":"'SEQ-PSTAB'!#REF!","v":{"$error":"#REF!"}}]
[null,"SIGN\nNO","LOCATION","PANEL SIZE"]
[null,null,null,"EXISTING",null,null,null,"MODIFIED"]
[null,null,null,"INCH"]
[null,"A I94-587","142+00 SB",132,"x",12,null,102,"x",78]
[null,"A I94-588","212+75 NB",186,"x",12,null,186,"x",102]
[null,null,null,null,"x",null,null,null,"x"]
[null,null,null,null,"x",null,null,null,"x"]
[null,null,null,null,"x",null,null,null,"x"]
[null,null,null,null,"x",null,null,null,"x"]
[null,null,null,null,"x",null,null,null,"x"]
[null,null,null,null,"x",null,null,null,"x"]
[null,null,null,null,"x",null,null,null,"x"]
[null,null,null,null,"x",null,null,null,"x"]
[null,null,null,null,"x",null,null,null,"x"]
[null,null,null,null," ",null," ",null," ",null," "]
[null,"What total is transferred to the SEQ?"]
[null,"There is no pay item for this yet.  Haven't used this in years.  Could be incidental to "]
[null,"another pay item."]

{"sheet":"APSTMOD","index":37,"n_rows":26,"n_cols":12,"rows_kept":26,"cut":false,"hidden":false,"merged":[[1,1,1,10],[2,1,2,10],[1,11,2,12],[3,3,3,12],[3,2,6,2],[6,4,6,8],[4,4,4,8],[5,4,5,8],[5,9,5,10],[5,11,5,12],[4,11,4,12],[6,11,6,12],[6,9,6,10],[4,9,4,10]]}
[]
[null,"MODIFY TYPE A SIGN POST",null,null,null,null,null,null,null,null,null,{"$f":"IF('SEQ-PSTAB'!#REF!>0,'SEQ-PSTAB'!#REF!,'SEQ-PSTAB'!#REF!)","v":{"$error":"#REF!"}}]
[null,"SEE SHEETS     FOR DETAILS"]
[null,null,"LOCATION","POST "]
[null,"SIGN",null,null,null,null,null,null,null,"EXTEND",null,"SHORTEN"]
[null,"NO",null,"NO","EXISTING",null,null,null,null,"APPROX",null,"APPROX"]
[null,null,null,null,null,null,null,null,null,"FEET",null,"FEET"]
[null,"A I94-587","142+00 SB",2,"W",6,"x",20,null,1.5]
[null,"A I94-588","212+75 NB",2,"W",8,"x",24,null,null,null,2]
[null," ",null,null,null,null,"x"]
[null," ",null,null,null,null,"x"]
[null,null,null,null,null,null,"x"]
[null,null,null,null,null,null,"x"]
[null,null,null,null,null,null,"x"]
[null,null,null,null,null,null,"x"]
[null,null,null,null,null,null,"x"]
[]
[]
[null,"USER NOTES:"]
[null,"If you remove extruded panel sections you need to saw the posts then you use this chart."]
[null,"If you add extruded panel sections then you need to extend the posts and then you use this chart."]
[null,"Roadway note is going to be \"modify post.\""]
[null,"This chart is used for shortening or extending posts."]
[null,"There is no pay item for this chart, it is incidental to SIGN PANEL OVERLAY TYPE A"]
[]
[null,"TOTAL",{"$f":"COUNTIF(B10:B21,\"<>\"\"\")","v":5},"(this total should not appear on the chart in the plan, but should be automatic in the SEQ-PSTAB)"]

{"sheet":"AREM","index":38,"n_rows":18,"n_cols":25,"rows_kept":18,"cut":false,"hidden":false,"merged":[[1,1,1,22],[1,24,1,25],[4,4,4,7],[4,8,4,11],[2,3,5,3],[5,4,5,11],[5,22,5,23],[2,4,2,11],[2,12,2,25],[3,12,3,21],[4,12,5,16],[4,17,4,21],[5,17,5,21],[2,2,4,2],[3,22,4,23],[3,24,4,25],[5,24,5,25],[3,4,3,7],[3,8,3,11]]}
[]
[null,"REMOVE SIGN TYPE A",null,null,null,null,null,null,null,null,null,null,null,null,null,null,null,null,null,null,null,null,null,null,{"$f":"'SEQ-PSTAB'!#REF!","v":{"$error":"#REF!"}}]
[null,null,"QTY","LOCATION","PANEL SIZE",null,null,null,null,null,null,null,"POSTS"]
[null,"SIGN",null,null,"EXTRUDED",null,null,null,"FLAT",null,null,null,"SIZE",null,null,null,null,null,null,null,null,null,"L1",null,"L2"]
[null,"NO",null,null,"TYPE",null,null,null,"SHEET",null,null,null,"BREAK-AWAY",null,null,null,null,"NON"]
[null,null,"EACH",null,"INCH",null,null,null,null,null,null,null,null,null,null,null,null,"BREAK-AWAY",null,null,null,null,"FEET",null,"FEET"]
[null,"A I94-587",0,"142+00 SB",132,"x",78,null,null,"x",null,null,"W",6,"x",20,null,null,null,"x",null,null,13.5,null,14.5]
[null,"A I94-588",0,"212+75 NB",186,"x",102,null,null,"x",null,null,"W",8,"x",24,null,null,null,"x",null,null,14,null,15]
[null,"A MN65-144",0,null,null,"x",null,null,null,"x",null,null,null,null,"x",null,null,null,null,"x"]
[null,null,null,null,null,"x",null,null,null,"x",null,null,null,null,"x",null,null,null,null,"x"]
[null,null,null,null,null,"x",null,null,null,"x",null,null,null,null,"x",null,null,null,null,"x"]
[null,null,null,null,null,"x",null,null,null,"x",null,null,null,null,"x",null,null,null,null,"x"]
[null,null,null,null,null,"x",null,null,null,"x",null,null,null,null,"x",null,null,null,null,"x"]
[null,null,null,null,null,"x",null,null,null,"x",null,null,null,null,"x",null,null,null,null,"x"]
[null,null,null,null,null,"x",null,null,null,"x",null,null,null,null,"x",null,null,null,null,"x"]
[null,null,null,null,null,"x",null,null,null,"x",null,null,null,null,"x",null,null,null,null,"x"]
[null,null,null,null,null,"x",null,null,null,"x",null,null,null,null,"x",null,null,null,null,"x"]
[null,"TOTAL",{"$f":"SUM(C7:C17)","v":0}]

{"sheet":"AS&IHP","index":39,"n_rows":25,"n_cols":40,"rows_kept":25,"cut":false,"hidden":false,"merged":[[1,1,1,38],[1,39,1,40],[5,17,5,21],[6,39,6,40],[6,32,6,33],[4,32,5,33],[4,35,5,36],[6,35,6,36],[2,39,5,40],[2,37,5,38],[6,37,6,38],[6,30,6,31],[6,22,6,29],[5,22,5,23],[4,22,4,25],[4,30,5,31],[6,4,6,11],[6,12,6,21],[5,4,5,7],[5,8,5,11],[2,12,2,31],[5,12,5,16],[5,24,5,25],[5,26,5,27],[5,28,5,29],[2,32,2,36],[3,22,3,29],[3,12,4,21],[2,4,3,11],[4,4,4,11],[4,26,4,29]]}
[]
[null,"SALVAGE & INSTALL SIGN TYPE A  (H PILE FOOTINGS)",null,null,null,null,null,null,null,null,null,null,null,null,null,null,null,null,null,null,null,null,null,null,null,null,null,null,null,null,null,null,null,null,null,null,null,null,null,"AA"]
[null,null,null,null,"PANEL",null,null,null,null,null,null,null,"POST",null,null,null,null,null,null,null,null,null,null,null,null,null,null,null,null,null,null,null,"PILE",null,null,null,null,"\"X\"",null,"\"H\""]
[null,null,null,null,null,null,null,null,null,null,null,null,"SIZE",null,null,null,null,null,null,null,null,null,"LENGTH"]
[null,"SIGN","PRESENT","NEW","SIZE",null,null,null,null,null,null,null,null,null,null,null,null,null,null,null,null,null,"EXISTING",null,null,null,"REQUIRED",null,null,null,"d",null,"\"P\"",null,"ADDITIONAL","WEIGHT"]
[null,"NO","LOCATION","LOCATION","EXISTING",null,null,null,"REQUIRED",null,null,null,"EXISTING",null,null,null,null,"REQUIRED",null,null,null,null,"L1",null,"L2",null,"L1",null,"L2",null,null,null,null,null,"STEEL PER PILE"]
[null,null,null,null,"INCH",null,null,null,null,null,null,null,"INCH",null,null,null,null,null,null,null,null,null,"FEET",null,null,null,null,null,null,null,"INCH",null,"FEET",null,"POUND","POUND",null,"FEET",null,"FEET"]
[null,"A US10-154","142+00 SB","143+00 SB",132,"x",78,null,132,"x",78,null,"W",6,"x",20,null,null,null,"x",null,null,13.5,null,14.5,null,13,null,14,null,92,null,12,null,104,688,null,30,null,7]
[null,"A I94-872","212+75 NB","213+00 NB",186,"x",102,null,186,"x",102,null,"W",8,"x",24,null,null,null,"x",null,null,14,null,15,null,14,null,14.5,null,108,null,12,null,118,812,null,25,null,5]
[null,null,null,null,null,"x",null,null,null,"x",null,null,null,null,"x",null,null,null,null,"x"]
[null,null,null,null,null,"x",null,null,null,"x",null,null,null,null,"x",null,null,null,null,"x"]
[null,null,null,null,null,"x",null,null,null,"x",null,null,null,null,"x",null,null,null,null,"x"]
[null,null,null,null,null,"x",null,null,null,"x",null,null,null,null,"x",null,null,null,null,"x"]
[null,null,null,null,null,"x",null,null,null,"x",null,null,null,null,"x",null,null,null,null,"x"]
[null,null,null,null,null,"x",null,null,null,"x",null,null,null,null,"x",null,null,null,null,"x"]
[null,null,null,null,null,null,null,null,null,null,null,null,null,null,null,null,null,null,null,null,null,null,null,null,null,null,null,null,null,null,null,null,null,null,"TOTAL",{"$f":"SUM(AJ8:AJ15)","v":1500}]
[null,null,null,null,null," ",null," ",null," ",null," "]
[]
[null,"USER NOTES:"]
[null,"This chart is used to replace footings."]
[null,"This chart needs to be reviewed by Rick before we use it!!  In fact Rick promises that he will get us a new and BETTER box:)"]
[null,"Use pay items:"]
[null,"SALVAGE SIGN TYPE A"]
[null,"INSTALL SIGN TYPE A"]
[null,"STRUCTURAL STEEL POSTS FOR TYPE A SIGNS"]

{"sheet":"ASAL","index":40,"n_rows":23,"n_cols":24,"rows_kept":23,"cut":false,"hidden":false,"merged":[[5,3,5,10],[3,7,3,10],[2,3,2,10],[2,2,5,2],[1,1,1,22],[1,23,1,24],[3,3,3,6],[4,11,5,15],[3,11,3,20],[2,11,2,24],[4,16,4,20],[5,16,5,20],[4,3,4,6],[4,7,4,10],[5,21,5,22],[5,23,5,24],[3,23,4,24],[3,21,4,22]]}
[]
[null,"SALVAGE SIGN TYPE A",null,null,null,null,null,null,null,null,null,null,null,null,null,null,null,null,null,null,null,null,null,{"$f":"'SEQ-PSTAB'!#REF!","v":{"$error":"#REF!"}}]
[null,null,"LOCATION","PANEL SIZE",null,null,null,null,null,null,null,"POSTS"]
[null,"SIGN",null,"EXTRUDED\nTYPE",null,null,null,"FLAT\nSHEET",null,null,null,"SIZE",null,null,null,null,null,null,null,null,null,"L1",null,"L2"]
[null,"NO",null,"TYPE",null,null,null,"SHEET",null,null,null,"BREAK-AWAY",null,null,null,null,"NON"]
[null,null,null,"INCH",null,null,null,null,null,null,null,null,null,null,null,null,"BREAK-AWAY",null,null,null,null,"FEET",null,"FEET"]
[null,"A I90-458","142+00 SB",132,"x",78,null,null,"x",null,null,"W",6,"x",20,null,null,null,"x",null,null,13.5,null,14.5]
[null,"A I90-765","212+75 NB",186,"x",102,null,null,"x",null,null,"W",8,"x",24,null,null,null,"x",null,null,14,null,15]
[null,null,null,null,"x",null,null,null,"x",null,null,null,null,"x",null,null,null,null,"x"]
[null,null,null,null,"x",null,null,null,"x",null,null,null,null,"x",null,null,null,null,"x"]
[null,null,null,null,"x",null,null,null,"x",null,null,null,null,"x",null,null,null,null,"x"]
[null,null,null,null,"x",null,null,null,"x",null,null,null,null,"x",null,null,null,null,"x"]
[null,null,null,null,"x",null,null,null,"x",null,null,null,null,"x",null,null,null,null,"x"]
[null,null,null,null,"x",null,null,null,"x",null,null,null,null,"x",null,null,null,null,"x"]
[null,null,null,null,"x",null,null,null,"x",null,null,null,null,"x",null,null,null,null,"x"]
[null,null,null,null,"x",null,null,null,"x",null,null,null,null,"x",null,null,null,null,"x"]
[null,null,null,null,"x",null,null,null,"x",null,null,null,null,"x",null,null,null,null,"x"]
[null,null,null,null,"x",null,null,null,"x",null,null,null,null,"x",null,null,null,null,"x"]
[]
[null,"Pay item:"]
[null,"SALVAGE SIGN TYPE A"]
[null,"We don't expect that we would use this chart.  It is typically going to be under salvage and install.  "]
[null,"We could use this as a salvage only and not install the sign back."]

{"sheet":"ASIGNHP","index":41,"n_rows":23,"n_cols":35,"rows_kept":23,"cut":false,"hidden":false,"merged":[[1,1,1,33],[1,34,1,35],[4,30,4,31],[3,34,6,35],[7,15,7,18],[3,32,6,33],[3,30,3,31],[5,28,5,29],[7,32,7,33],[7,30,7,31],[7,26,7,27],[3,26,3,29],[6,26,6,27],[6,30,6,31],[4,15,4,18],[7,34,7,35],[3,9,3,25],[7,20,7,21],[4,7,6,8],[6,22,6,23],[7,24,7,25],[4,9,7,13],[5,17,6,18],[4,14,7,14],[6,24,6,25],[16,3,16,5],[2,2,2,35],[5,26,5,27],[5,30,5,31],[16,28,16,29],[7,7,7,8],[4,20,6,21],[4,3,6,6],[4,28,4,29],[7,28,7,29],[7,3,7,6],[5,15,6,16],[3,3,3,8],[5,24,5,25],[7,22,7,23],[5,22,5,23]]}
[]
[null,"SIGN TYPE A (H PILE FOOTINGS)",null,null,null,null,null,null,null,null,null,null,null,null,null,null,null,null,null,null,null,null,null,null,null,null,null,null,null,null,null,null,null,null,"XX"]
[null,null,"SEE SHEET       FOR PANELS"]
[null,null,null,"PANEL",null,null,null,null,null,"POST",null,null,null,null,null,null,null,null,null,null,null,null,null,null,null,null,"PILE",null,null,null,"TOTAL",null,"\"X\"",null,"\"H\""]
[null,null,null,"SIZE",null,null,null,"AREA",null,"SIZE",null,null,null,null,"QTY","LENGTH",null,null,null,"ADDITIONAL","WEIGHT",null,null,null,null,null,null,null,null,null,"WEIGHT"]
[null,"SIGN","LOCATION",null,null,null,null,null,null,null,null,null,null,null,null,"L1",null,"L2",null,"STEEL",null,null,"c",null,"d",null,"\"P\"",null,"WEIGHT",null,"STRUCTURAL"]
[null,"NO",null,null,null,null,null,null,null,null,null,null,null,null,null,null,null,null,null,"PER POST",null,null,null,null,null,null,null,null,null,null,"STEEL"]
[null,null,null,"INCH",null,null,null,"SQ FT",null,null,null,null,null,null,null,"FEET",null,null,null,"POUND","LBS",null,"INCH",null,"INCH",null,"FEET",null,"POUND",null,"POUND",null,"FEET",null,"FEET"]
[null,"A I94-528","142+00 SB",132,"x",78,null,{"$f":"D9*F9/144","v":71.5},null,"W",6,"x",20,null,0,13.5,null,14.5,null,104,{"$f":"((P9+R9)*M9)+(O9*T9)","v":560},null,20,null,92,null,12,null,{"$f":"(M9*O9*AA9)","v":0},null,{"$f":"(U9+AC9)","v":560},null,30,null,7]
[null,"A I90-874","212+75 NB",186,"x",102,null,{"$f":"D10*F10/144","v":131.75},null,"W",8,"x",24,null,0,14,null,15,null,118,696,null,39,null,108,null,12,null,{"$f":"(M10*O10*AA10)","v":0},null,696,null,25,null,5]
[null,null,null,null,"x",null,null,null,null,null,null,"x",null,null,null,null,null,null,null,null,0,null,null,null,null,null,null,null,0,null,0]
[null,null,null,null,"x",null,null,null,null,null,null,"x",null,null,null,null,null,null,null,null,0,null,null,null,null,null,null,null,0,null,0]
[null,null,null,null,"x",null,null,null,null,null,null,"x",null,null,null,null,null,null,null,null,0,null,null,null,null,null,null,null,0,null,0]
[null,null,null,null,"x",null,null,null,null,null,null,"x",null,null,null,null,null,null,null,null,0,null,null,null,null,null,null,null,0,null,0]
[null,null,null,null,"x",null,null,null,null,null,null,"x",null,null,null,null,null,null,null,null,0,null,null,null,null,null,null,null,0,null,0]
[null,null,null,null,"x",null,null,null,null,null,null,"x",null,null,null,null,null,null,null,null,0,null,null,null,null,null,null,null,0,null,0]
[null,null,null,"TOTAL",null,null,null,{"$f":"SUM(H9:H15)","v":203.25},null,null,null,null,null,null,null,null,null,null,null,null,null,null,null,null,null,null,null,null,"TOTAL",null,{"$f":"SUM(AE9:AE15)","v":1256}]
[null,null,null,null,null,null,null,null,null,null,null,null,null,null,null,null,null,null,null,null," "]
[null,"USER NOTES",null,null,null,null,null,null,null,null,null,null,null,null," "]
[null,"This is all new sign"]
[null,"pay items:"]
[null,"SIGN PANELS TYPE A"]
[null,"STRUCTURAL STEEL POSTS FOR TYPE A SIGN"]

{"sheet":"SIGN PANELS TYPE A","index":42,"n_rows":22,"n_cols":19,"rows_kept":22,"cut":false,"hidden":false,"merged":[[1,1,1,6],[2,1,2,6],[1,7,2,8],[2,10,3,17],[5,18,5,19],[5,15,5,16],[5,12,5,13],[1,10,1,17],[1,18,1,19],[2,18,3,18],[17,3,17,5],[3,3,3,6],[4,3,4,6],[3,2,4,2],[4,7,4,8],[3,7,3,8]]}
[]
[null,"SIGN PANELS TYPE A",null,null,null,null,null,{"$f":"'SEQ-PSTAB'!#REF!","v":{"$error":"#REF!"}}]
[null,"SEE SHEETS     FOR PANEL",null,null,null,null,null,null,null,null,"SIGN PANELS TYPE A",null,null,null,null,null,null,null,"AA"]
[null,"SIGN","LOCATION","SIZE",null,null,null,"AREA"]
[null,"NO",null,"INCH",null,null,null,"SQ FT",null,null,null,"SP XXXXX",null,null,"SP XXXXX",null,null,"SP XXXXX"]
[null,"A I94-528","142+00 SB",0,"x",78,null,{"$f":"D6*F6/144","v":0},null,null,"SIGN NO ","QTY","AREA\n(SQ FT)",null,"QTY","AREA\n(SQ FT)",null,"QTY","AREA"]
[null,"A I90-874","212+75 NB",0,"x",102,null,{"$f":"D7*F7/144","v":0},null,null,null,null,{"$f":"-G6*L7/144","v":0},null,null,{"$f":"-K7*O7/144","v":0},null,null,{"$f":"-N7*R7/144","v":0}]
[null,null,null,null,"x",null,null,0,null,null,null,null,0,null,null,0,null,null,0]
[null,null,null,null,"x",null,null,0,null,null,null," ",0,null,null,0,null,null,0]
[null,null,null,null,"x",null,null,0,null,null,null,null,0,null,null,0,null,null,0]
[null,null,null,null,"x",null,null,0,null,null,null,null,0,null,null,0,null,null,0]
[null,null,null,null,"x",null,null,0,null,null,null,null,0,null,null,0,null,null,0]
[null,null,null,null,"x",null,null,0,null,null,null,null,0,null,null,0,null,null,0]
[null,null,null,null,"x",null,null,0,null,null,null,null,0,null,null,0,null,null,0]
[null,null,null,null,"x",null,null,0,null,null,null,null,0,null,null,0,null,null,0]
[null,null,null,null,"x",null,null,0,null,null,null,null,0,null,null,0,null,null,0]
[null,null,null,null,"x",null,null,0,null,null,null,null,0,null,null,0,null,null,0]
[null,null,null,"TOTAL",null,null,null,{"$f":"SUM(H6:H17)","v":0},null,null,null,null,0,null,null,0,null,null,0]
[null,null,null,null,null,null,null,null,null,null,"TOTALS",null,0,null,null,0,null,null,0]
[]
[null,null,null,null,null,null,null,null,null,null,"Use this chart for split in quantities for several SP's.  "]
[null,"New sign panel on an inplace sign structure.  If the new panel is wider then make sure the structure can handle the new sign panel.  If not, you need new posts and not this chart anymore."]

{"sheet":"ASPNLIN","index":43,"n_rows":18,"n_cols":7,"rows_kept":18,"cut":false,"hidden":false,"merged":[[2,4,2,7],[3,4,3,7],[2,3,3,3],[1,1,1,5],[1,6,1,7]]}
[]
[null,"INSTALL SIGN PANEL TYPE A",null,null,null,null,{"$f":"'SEQ-PSTAB'!#REF!","v":{"$error":"#REF!"}}]
[null,"SIGN","QTY","LOCATION","SIZE"]
[null,"NO","EACH",null,"INCH"]
[null,"A I94-528",0,"142+00 SB",132,"x",78]
[null,"A I90-874",0,"212+75 NB",186,"x",102]
[null,null,null,null,null,"x"]
[null,null,null,null,null,"x"]
[null,null,null,null,null,"x"]
[null,null,null,null,null,"x"]
[null,null,null,null,null,"x"]
[null,"TOTAL",{"$f":"SUM(C5:C11)","v":0}]
[]
[]
[null,"Chances you won't use this chart.  A panel is usually salvaged and installed,"]
[null,"and in the salvage and install chart.  "]
[]
[null,"Rick needs to be contacted on this one….?????  "]

{"sheet":"ASPNLOL","index":44,"n_rows":22,"n_cols":19,"rows_kept":22,"cut":false,"hidden":false,"merged":[[1,1,2,6],[1,7,2,8],[2,10,3,17],[20,1,20,11],[4,11,5,11],[4,15,4,16],[3,3,3,6],[4,14,5,14],[17,3,17,5],[3,2,4,2],[4,7,4,8],[4,3,4,6],[3,7,3,8],[5,18,5,19],[4,18,4,19],[1,10,1,17],[1,18,1,19],[4,17,5,17],[5,15,5,16],[2,18,3,19]]}
[null,null,null,null,null,null,null,null,null,null,null,null,null," "]
[null,"SIGN PANEL OVERLAY TYPE A ",null,null,null,null,null,"AA"]
[null,null,null,null,null,null,null,null,null,null,"SIGN PANEL OVERLAY TYPE A",null,null,null,null,null,null,null,"AA"]
[null,"SIGN","LOCATION","OVERLAY",null,null,null,"AREA"]
[null,"NO",null,"INCH",null,null,null,"SQ FT",null,null,"SIGN","QTY","AREA",null,"QTY","AREA",null,"QTY","AREA"]
[null,"A I94-528","S",0,"x",78,null,{"$f":"D6*F6/144","v":0},null,null,"NO",null,"SQ FT",null,null,"SQ FT",null,null,"SQ FT"]
[null,"A I90-874","212+75 NB",0,"x",102,null,0,null,null,{"$f":"B6","v":"A I94-528"},2,{"$f":"(D6*F6)/144","v":0},null,null,{"$f":"-K7*O7/144","v":0},null,null,{"$f":"-N7*R7/144","v":0}]
[null,null,null,null,"x",null,null,0,null,null,{"$f":"B7","v":"A I90-874"},3,{"$f":"(D7*F7)/144","v":0},null,null,0,null,null,0]
[null,null,null,null,"x",null,null,0,null,null,0,null,0,null,null,0,null,null,0]
[null,null,null,null,"x",null,null,0,null,null,0," ",0,null,null,0,null,null,0]
[null,null,null,null,"x",null,null,0,null,null,0,null,0,null,null,0,null,null,0]
[null,null,null,null,"x",null,null,0,null,null,0,null,0,null,null,0,null,null,0]
[null,null,null,null,"x",null,null,0,null,null,0,null,0,null,null,0,null,null,0]
[null,null,null,null,"x",null,null,0,null,null,0,null,0,null,null,0,null,null,0]
[null,null,null,null,"x",null,null,0,null,null,0,null,0,null,null,0,null,null,0]
[null,null,null,null,"x",null,null,0,null,null,0,null,0,null,null,0,null,null,0]
[null,null,null,null,"x",null,null,0,null,null,0,null,0,null,null,0,null,null,0]
[null,null,null,"TOTAL",null,null,null,{"$f":"SUM(H6:H17)","v":0},null,null,0,null,0,null,null,0,null,null,0]
[null,null,null,null,null,null,null,null,null,null,"TOTALS",null,{"$f":"SUM(M7:M18)","v":0},null,null,0,null,null,0]
[null,"GENERAL NOTE:"]
[null,"1.  SEE SHEETS xxx TO xxx FOR SIGN PANEL OVERLAYS."]
[null,null,null,null,null,null,null,null,null,null,"this chart is for each SP"]

{"sheet":"ASPNLSAL","index":45,"n_rows":20,"n_cols":11,"rows_kept":20,"cut":false,"hidden":false,"merged":[[1,1,1,8],[1,9,1,10],[5,3,5,10],[4,3,4,6],[4,7,4,10],[2,3,2,10],[3,3,3,6],[3,7,3,10],[2,2,5,2]]}
[]
[null,"SALVAGE SIGN PANEL TYPE A",null,null,null,null,null,null,null,{"$f":"'SEQ-PSTAB'!#REF!","v":{"$error":"#REF!"}}]
[null,null,"LOCATION","PANEL SIZE"]
[null,"SIGN",null,"EXTRUDED",null,null,null,"FLAT"]
[null,"NO",null,"TYPE",null,null,null,"SHEET"]
[null,null,null,"INCH"]
[null,"A I94-100","142+00 SB",132,"x",78,null,102,"x",78]
[null,"A I90-887","212+75 NB",186,"x",102,null,174,"x",102]
[null,null,null,null,"x",null,null,null,"x"]
[null,null,null,null,"x",null,null,null,"x"]
[null,null,null,null,"x",null,null,null,"x"]
[null,null,null,null,"x",null,null,null,"x"]
[null,null,null,null,"x",null,null,null,"x"]
[null,null,null,null,"x",null,null,null,"x"]
[null,null,null,null,"x",null,null,null,"x"]
[null,null,null,null,"x",null,null,null,"x"]
[null,null,null,null," ",null," ",null," ",null," "]
[]
[]
[null,"Rick says to keep this chart but contact him for more info"]

{"sheet":"ASPNLSAW","index":46,"n_rows":20,"n_cols":12,"rows_kept":20,"cut":false,"hidden":false,"merged":[[1,11,1,12],[1,1,1,9],[2,2,4,2],[3,3,3,6],[2,11,2,12],[4,11,4,12],[3,7,3,10],[2,3,2,10],[4,3,4,10],[3,11,3,12],[2,1,4,1]]}
[]
[null,"SAW SIGN PANEL TYPE A",null,null,null,null,null,null,null,null,null,{"$f":"'SEQ-PSTAB'!#REF!","v":{"$error":"#REF!"}}]
[null,"SIGN\nNO","LOCATION","PANEL SIZE",null,null,null,null,null,null,null,"LENGTH"]
[null,null,null,"EXISTING",null,null,null,"MODIFIED",null,null,null,"OF CUT"]
[null,null,null,"INCH",null,null,null,null,null,null,null,"FEET"]
[null,"A MN23-132","142+00 SB",132,"x",78,null,102,"x",78,null,{"$f":"F6/12","v":6.5}]
[null,"A MN23-133","212+75 NB",186,"x",102,null,174,"x",102,null,{"$f":"F7/12","v":8.5}]
[null,null,null,null,"x",null,null,null,"x",null,null,0]
[null,null,null,null,"x",null,null,null,"x",null,null,0]
[null,null,null,null,"x",null,null,null,"x",null,null,0]
[null,null,null,null,"x",null,null,null,"x",null,null,0]
[null,null,null,null,"x",null,null,null,"x",null,null,0]
[null,null,null,null,"x",null,null,null,"x",null,null,0]
[null,null,null,null,"x",null,null,null,"x",null,null,0]
[null,null,null,null,"x",null,null,null,"x",null,null,0]
[null,null,null,null,null,null,null,null,null,"TOTAL",null,{"$f":"SUM(L6:L15)","v":15}]
[null,null,null,null," ",null," ",null," ",null," "]
[null,"just what it means, we need to saw it because it is too wide.  You will then have SIGN PANEL OVERLAY TYPE A"]
[null,"It would be incidental to SIGN PANEL OVERLAY TYPE A"]
[null,"But there is a pay item for it just as the title is."]

{"sheet":"ANOTES","index":47,"n_rows":10,"n_cols":4,"rows_kept":10,"cut":false,"hidden":false,"merged":[[1,1,1,3]]}
[]
[null,"GENERAL NOTES:"]
[null,"1.",null,"FOOTING DEPTH \"D\" IS MEASURED FROM THE LOW GROUND LINE TO THE BOTTOM OF"]
[null,null,null,"THE CONCRETE AND IS BASED ON ALLOWABLE SOIL PRESSURE OF 2000 P.S.F. THE"]
[null,null,null,"ENGINEER MAY INCREASE THE DEPTH WHERE POOR SOIL CONDITIONS ARE ENCOUNTERED."]
[null,"2.",null,"SEE SHEETS     AND     FOR STRUCTURAL DETAILS, TYPE \"A\" SIGNS (BREAKAWAY)."]
[null,"3.",null,"VOLUME OF CONCRETE IN FOOTINGS IS 0.1164 CU. YDS. PER FOOT OF DEPTH."]
[null,"4.",null,"POST LENGTHS ARE APPROXIMATE."]
[null,"5.",null,"\"X\" IS THE DISTANCE FROM THE EDGE OF THE THRU LANE TO THE FIRST POST."]
[null,"6.",null,"\"H\" IS THE HEIGHT ABOVE THE PAVEMENT EDGE TO THE BOTTOM EDGE OF THE PANEL."]

{"sheet":"AFF","index":48,"n_rows":17,"n_cols":5,"rows_kept":17,"cut":false,"hidden":false,"merged":[[1,1,1,3],[2,3,3,3]]}
[]
[null,"FRICTION FUSE",null,null,"SA"]
[null,"SIGN","QTY","LOCATION","POST "]
[null,"NO","EACH",null,"SIZE"]
[null,"A-1",2,"142+00 SB","W6X20"]
[null,"A-2",2,"212+75 NB","W8X24"]
[]
[]
[]
[]
[]
[]
[]
[]
[]
[]
[null,"TOTAL",{"$f":"SUM(C5:C16)","v":4}]

{"sheet":"A REM PANEL","index":49,"n_rows":20,"n_cols":5,"rows_kept":20,"cut":false,"hidden":false,"merged":[[1,1,1,3],[2,1,4,1],[2,2,4,2],[2,3,2,4],[3,3,4,3],[3,4,4,4]]}
[null,"AREMPAN"]
[null,"REMOVE SIGN PANEL TYPE A",null,null,"AA"]
[null,"SIGN\nNO","LOCATION","PANEL SIZE (INCH)"]
[null,null,null,"EXTRUDED\nTYPE","FLAT\nSHEET"]
[null,null,null,"TYPE"]
[null,"A MN23-132"," "," "]
[null,"A MN23-133"," "," "]
[]
[]
[]
[]
[]
[]
[]
[]
[]
[]
[]
[]
[null,"TOTAL",{"$f":"COUNTA(B6:B11)","v":2}]

{"sheet":"AKP","index":50,"n_rows":17,"n_cols":5,"rows_kept":17,"cut":false,"hidden":false,"merged":[[1,1,1,3],[2,3,3,3]]}
[]
[null,"KEEPER PLATE",null,null,"SA"]
[null,"SIGN","QTY","LOCATION","POST   "]
[null,"NO","EACH",null,"SIZE"]
[null,"A MN23-132",0,"142+00 SB","W6X20"]
[null,"A MN23-133",0,"212+75 NB","W8X24"]
[]
[]
[]
[]
[]
[]
[]
[]
[]
[]
[null,"TOTAL",{"$f":"SUM(C5:C16)","v":0}]

{"sheet":"EA","index":51,"n_rows":26,"n_cols":13,"rows_kept":26,"cut":false,"hidden":false,"merged":[[1,1,1,11],[21,1,21,11],[2,2,5,2],[2,3,5,3],[2,4,2,9],[3,8,5,8],[3,4,5,7],[2,10,2,11]]}
[]
[null,"SIGN PANELS TYPE EA ",null,null,null,null,null,null,null,null,null,null,"G"]
[null,null,"QTY","LOCATION","PANEL",null,null,null,null,null,"POSTS"]
[null,"SIGN",null,null,"SIZE\n(INCH)",null,null,null,"AREA\n(SQ FT)","TOTAL"]
[null,"NO",null,null,null,null,null,null,null,"AREA","NO","SPACING","LEGEND"]
[null,null,null,null,null,null,null,null,null,"(SQ FT)"]
[null,"EA-1",3,"A US75-246, A US75-247 & A US75-249",102,"x",0,null,{"$f":"E7*G7/144","v":0},{"$f":"I7*C7","v":0},3,36,"EXIT 157"]
[null,"EA-2",2,"A US75-247, US75-250",162,"x",0,null,{"$f":"E8*G8/144","v":0},{"$f":"I8*C8","v":0},4,42,"EXITS 159A&B"]
[null,"EA-3",1,"A I90-621",120,"x",0,null,0,0,3,42,"EXIT 159A"]
[null,null,null,null,null,"x",null,null,0,0]
[null,null,null,null,null,"x",null,null,0,0]
[null,null,null,null,null,"x",null,null,0,0]
[null,null,null,null,null,"x",null,null,0,0]
[null,null,null,null,null,"x",null,null,0,0]
[null,null,null,null,null,"x",null,null,0,0]
[null,null,null,null,null,"x",null,null,0,0]
[null,null,null,null,null,"x",null,null,0,0]
[null,null,null,null,null,"x",null,null,0,0]
[null," ",null,null,null,null,null,null,"TOTAL",{"$f":"SUM(J7:J18)","v":0}]
[]
[]
[]
[null,"GENERAL NOTES:"]
[null,"1. SEE SHEET ____ FOR STRUCTURAL DETAIL"]
[null,"2. POST SPACING MAY BE VARIED TO MISS MEMBERS OF A SIGN STRUCTURE"]
[null,"3. SEE SHEET ____ FOR  SIGN PANELS."]

{"sheet":"EAOL","index":52,"n_rows":15,"n_cols":13,"rows_kept":15,"cut":false,"hidden":false,"merged":[[1,1,1,11],[2,1,4,1],[4,10,4,11],[2,4,2,11],[3,10,3,11],[3,8,3,9],[3,4,3,7],[4,4,4,7],[4,8,4,9]]}
[]
[null,"SIGN PANEL OVERLAY TYPE EA",null,null,null,null,null,null,null,null,null,null,{"$f":"'SEQ-PSTAB'!#REF!","v":{"$error":"#REF!"}}]
[null,"SIGN\nNO",null,null,"PANEL OVERLAY",null,null,null,null,null,null,null,"LEGEND"]
[null,null,"QTY","LOCATION","SIZE",null,null,null,"AREA",null,"TOTAL"]
[null,null,null,null,"INCH",null,null,null,"SQ FT",null,"SQ FT"]
[null,"EA-1",2,"A I90-454, A I90-455",150,"x",0,null,{"$f":"(E6*G6)/144","v":0},null,{"$f":"I6*C6","v":0},null,"EXITS 52B&A"]
[null,"EA-2",1,"A I90-560",96,"x",0,null,{"$f":"(E7*G7)/144","v":0},null,{"$f":"I7*C7","v":0},null,"EXIT 48"]
[null,null,null,null,null,"x"]
[null,null,null,null,null,"x"]
[null,null,null,null,null,"x"]
[null,null,null,null,null,"x"]
[null,null,null,null,null,"x"]
[null,null,null,null,null,"x"]
[null,null,null,null,null,"x"]
[null,null," ",null,null,null,null,null,"TOTAL",null,{"$f":"SUM(K6:K14)","v":0}]

{"sheet":"EAREM","index":53,"n_rows":14,"n_cols":10,"rows_kept":14,"cut":false,"hidden":false,"merged":[[1,1,1,8],[2,1,4,1],[3,5,3,8],[4,5,4,8],[2,5,2,8],[2,4,4,4],[2,2,3,2]]}
[]
[null,"REMOVE SIGN TYPE EA",null,null,null,null,null,null,null,"AA"]
[null,"SIGN\nNO","QTY",null,"POSTS\nNO & TYPE","PANEL"]
[null,null,null,"LOCATION",null,"SIZE",null,null,null,"LEGEND"]
[null,null,"EACH",null,null,"(INCH)"]
[null,"EA-101",0,"A I35W-024","3-U",102,"x",24,null,"EXIT 157"]
[null,"EA-102",0,"A MN100-041","4-U",162,"x",24,null,"EXITS 159A&B"]
[null,null,null,null,null,null,"x"]
[null,null,null,null,null,null,"x"]
[null,null,null,null,null,null,"x"]
[null,null,null,null,null,null,"x"]
[null,null,null,null,null,null,"x"]
[null,null,null,null,null,null,"x"]
[null,"TOTAL",{"$f":"SUM(C6:C13)","v":0}]

{"sheet":"EAEXTFI","index":54,"n_rows":9,"n_cols":15,"rows_kept":9,"cut":false,"hidden":false,"merged":[[8,8,8,9],[5,12,5,15],[2,12,4,15],[5,8,5,9],[6,8,6,9],[7,8,7,9],[4,10,4,11],[3,10,3,11],[2,4,2,11],[5,10,5,11],[3,4,4,7],[3,8,4,9],[1,14,1,15],[1,1,1,13],[5,4,5,7],[2,2,5,2],[2,3,5,3]]}
[]
[null,"SIGN PANELS TYPE EA (EXTRUDED PANEL SECTIONS)",null,null,null,null,null,null,null,null,null,null,null,null,"AA"]
[null,null,"QTY","LOCATION","PANEL",null,null,null,null,null,null,null,"REQUIRED\nPANEL SIZE"]
[null,"SIGN",null,null,"SIZE",null,null,null,"AREA",null,"TOTAL"]
[null,"NO",null,null,null,null,null,null,null,null,"AREA"]
[null,null,null,null,"INCH",null,null,null,"SQ FT",null,"SQ FT",null,"INCH"]
[null,"EA-201",0,"A MN280-002",96,"x",6,null,{"$f":"E7*G7/144","v":4},null,{"$f":"C7*I7","v":0},null,96,"x",30]
[null,"EA-202",0,"A MN280-003, A MN280-004",96,"x",6,null,{"$f":"E8*G8/144","v":4},null,{"$f":"C8*I8","v":0},null,96,"x",30]
[null,null,null,null,null,null,null,null,"TOTAL ",null,{"$f":"SUM(K7:K8)","v":0}]

{"sheet":"EOREM","index":55,"n_rows":14,"n_cols":11,"rows_kept":14,"cut":false,"hidden":false,"merged":[[1,1,1,9],[2,6,2,9],[2,3,4,3],[2,1,4,1],[3,6,3,9],[4,6,4,9],[2,4,4,5],[2,2,3,2]]}
[]
[null,"REMOVE SIGN TYPE EO",null,null,null,null,null,null,null,null,"AA"]
[null,"SIGN\nNO","QTY","LOCATION","POSTS\nNO & TYPE",null,"PANEL"]
[null,null,null,null,null,null,"SIZE",null,null,null,"LEGEND"]
[null,null,"EACH",null,null,null,"(INCH)"]
[null,"EO-101",0,"OH I90-014",{"$f":"IF(G6>180.1,\"ERROR\",IF(G6>149.9,\"4\",IF(G6>101.9,\"3\",IF(G6>47.9,\"2\"))))","v":"3"},"-U",102,"x",24,null,"EXIT 157"]
[null,"EO-102",0,"OH I90-017(R), OH I90-018(M), OH I90-036",{"$f":"IF(G7>180.1,\"ERROR\",IF(G7>149.9,\"4\",IF(G7>101.9,\"3\",IF(G7>47.9,\"2\"))))","v":"3"},"-U",120,"x",24,null,"EXITS 159A"]
[null,null,null,null,"2","-U",84,"x"]
[null,null,null,null,false,"-U",null,"x"]
[null,null,null,null,false,"-U",null,"x"]
[null,null,null,null,null,null,null,"x"]
[null,null,null,null,null,null,null,"x"]
[null,null,null,null,null,null,null,"x"]
[null,"TOTAL",{"$f":"SUM(C6:C13)","v":0}]

{"sheet":"EO","index":56,"n_rows":25,"n_cols":17,"rows_kept":25,"cut":false,"hidden":false,"merged":[[21,1,21,11],[1,1,1,11],[3,4,5,7],[3,8,5,8],[3,2,4,2],[2,4,2,8],[2,10,2,11]]}
[]
[null,"SIGN PANELS TYPE EO  ",null,null,null,null,null,null,null,null,null,null,"AA"]
[null,null,null,null,"PANEL SIZE",null,null,null,null,null,"POSTS"]
[null,"SIGN","QTY",null,"SIZE\n(INCH)",null,null,null,"AREA\n(SQ FT)","TOTAL"]
[null,"NO",null,"LOCATION",null,null,null,null,null,"AREA","NO","SPACING","LEGEND"]
[null,null,null,null,null,null,null,null,null,"(SQ FT)"]
[null,"EO-1",0,"OH I90-014",108,"x",30,null,{"$f":"E7*G7/144","v":22.5},{"$f":"I7*C7","v":0},{"$f":"IF(E7>180.1,\"ERROR\",IF(E7>149.9,\"4\",IF(E7>101.9,\"3\",IF(E7>47.9,\"2\"))))","v":"3"},{"$f":"IF(E7>180.1,\"ERROR\",IF(E7>173.9,\"48\",IF(E7>149.9,\"42\",IF(E7>143.9,\"54\",IF(E7>131.9,\"48\", IF(E7>113.9,\"42\", IF(E7>101.9,\"36\",IF(E7>89.9,\"54\",IF(E7>77.9,\"48\",IF(E7>71.9,\"42\",IF(E7>59.9,\"36\",IF(E7>47.9,\"30\",IF(E7<47.89,\"ERROR\")))))))))))))","v":"36"},"EXIT 154"]
[null,"EO-2",0,"OH I90-017(R), OH I90-018(M) & OH I90-036",108,"x",30,null,22.5,0,"3",{"$f":"IF(E8>180.1,\"ERROR\",IF(E8>173.9,\"48\",IF(E8>149.9,\"42\",IF(E8>143.9,\"54\",IF(E8>131.9,\"48\",IF(E8>113.9,\"42\",IF(E8>101.9,\"36\",IF(E8>89.9,\"54\",IF(E7>180.1,\"ERROR\",IF(E7>173.9,\"48\",IF(E7>149.9,\"42\",IF(E7>143.9,\"54\",IF(E7>131.9,\"48\",IF(E7>113.9,\"42\",IF(E7>101.9,\"36\",IF(E7>89.9,\"54\",IF(E8>77.9,\"48\",IF(E8>71.9,\"42\",IF(E8>59.9,\"36\",IF(E8>47.9,\"30\",IF(E8<47.89,\"ERROR\")))))))))))))))))))))","v":"36"},"EXIT 159A"]
[null,"EO-3",0,"OH I90-017(M), OH I90-018(R) & OH I90-037(R)",108,"x",30,null,22.5,0,"3","36","EXIT 159B"]
[null,null,null,null,108,"x",null,null,0,0,{"$f":"IF(E10>180.1,\"ERROR\",IF(E10>149.9,\"4\",IF(E10>101.9,\"3\",IF(E10>47.9,\"2\"))))","v":"3"},{"$f":"IF(E10>180.1,\"ERROR\",IF(E10>173.9,\"48\",IF(E10>149.9,\"42\",IF(E10>143.9,\"54\",IF(E10>131.9,\"48\", IF(E10>113.9,\"42\", IF(E10>101.9,\"36\",IF(E10>89.9,\"54\",IF(E10>77.9,\"48\",IF(E10>71.9,\"42\",IF(E10>59.9,\"36\",IF(E10>47.9,\"30\",IF(E10<47.89,\"ERROR\")))))))))))))","v":"36"}]
[null,null,null,null,108,"x",null,null,0,0,"3",{"$f":"IF(E11>180.1,\"ERROR\",IF(E11>173.9,\"48\",IF(E11>149.9,\"42\",IF(E11>143.9,\"54\",IF(E11>131.9,\"48\", IF(E11>113.9,\"42\", IF(E11>101.9,\"36\",IF(E11>89.9,\"54\",IF(E11>77.9,\"48\",IF(E11>71.9,\"42\",IF(E11>59.9,\"36\",IF(E11>47.9,\"30\",IF(E11<47.89,\"ERROR\")))))))))))))","v":"36"}]
[null,null,null,null,108,"x",null,null,0,0,"3","36"]
[null,null,null,null,108,"x",null,null,0,0,"3","36"]
[null,null,null,null,108,"x",null,null,0,0,"3","36"]
[null,null,null,null,null,null,null,null,"TOTAL",{"$f":"SUM(J7:J14)","v":0}]
[]
[null,"SPECIFIC NOTES:"]
[]
[null,"GENERAL NOTES:"]
[null,{"$f":"\"1.  SEE SHEET \" & TEXT(TOC!$B$40, \"0\") & \" FOR STRUCTURAL DETAIL.\"","v":"1.  SEE SHEET 94 FOR STRUCTURAL DETAIL."}]
[null,"2.  POST SPACING MAY BE VARIED TO MISS MEMBERS OF OH SIGN STRUCTURES."]
[null,{"$f":"\"3.  SEE SHEETS \" & TEXT(TOC!$B63,\"0\") & \" TO \" & TEXT(TOC!$B64,\"0\") & \" FOR SIGN PANELS.\"","v":"3.  SEE SHEETS ST27 TO ST47 FOR SIGN PANELS."}]
[]
[]
[null,null,null,null,null,null,null,null,null,null,null,null,null,null,null,null,{"$f":"IF(J25>180.1,\"ERROR\",IF(J25>173.9,\"48\",IF(J25>149.9,\"42\",IF(J25>143.9,\"54\",IF(J25>131.9,\"48\", IF(J25>113.9,\"42\", IF(J25>101.9,\"36\",IF(J25>89.9,\"54\",IF(J25>77.9,\"48\",IF(J25>71.9,\"42\",IF(J25>59.9,\"36\",IF(J25>47.9,\"30\",IF(J25<47.89,\"ERROR\")))))))))))))","v":"ERROR"}]

{"sheet":"EOOL","index":57,"n_rows":15,"n_cols":13,"rows_kept":15,"cut":false,"hidden":false,"merged":[[1,1,1,11],[2,1,4,1],[4,10,4,11],[2,4,2,11],[3,10,3,11],[3,8,3,9],[3,4,3,7],[4,4,4,7],[4,8,4,9]]}
[]
[null,"SIGN PANEL OVERLAY TYPE EO",null,null,null,null,null,null,null,null,null,null,{"$f":"'SEQ-PSTAB'!B25","v":0}]
[null,"SIGN\nNO",null,null,"PANEL OVERLAY"]
[null,null,"QTY","LOCATION","SIZE",null,null,null,"AREA",null,"TOTAL",null,"LEGEND"]
[null,null,null,null,"INCH",null,null,null,"SQ FT",null,"SQ FT"]
[null,"EO-1",0,"OH I694-037",150,"x",30,null,{"$f":"(E6*G6)/144","v":31.25},null,{"$f":"I6*C6","v":0},null,"EXITS 52B&A"]
[null,"EO-2",0,"OH I694-066(R), OH I694-101(R)",96,"x",30,null,{"$f":"(E7*G7)/144","v":20},null,{"$f":"I7*C7","v":0},null,"EXIT 48"]
[null,null,null,null,null,"x"]
[null,null,null,null,null,"x"]
[null,null,null,null,null,"x"]
[null,null,null,null,null,"x"]
[null,null,null,null,null,"x"]
[null,null,null,null,null,"x"]
[null,null,null,null,null,"x"]
[null,null," ",null,null,null,null,null,"TOTAL",null,{"$f":"SUM(K6:K14)","v":0}]

{"sheet":"EO EXT PAN SECT","index":58,"n_rows":21,"n_cols":10,"rows_kept":21,"cut":false,"hidden":false,"merged":[[2,1,5,1],[2,2,5,2],[2,3,5,3],[2,4,2,8],[2,9,5,9],[3,4,5,6],[3,7,5,7],[3,8,5,8],[1,1,1,8],[7,7,8,7],[7,8,8,8],[7,9,8,9],[10,1,11,1],[10,2,11,2],[10,4,11,4],[10,5,11,5],[10,6,11,6],[10,7,11,7],[10,8,11,8],[10,9,11,9],[7,1,8,1],[7,2,8,2],[7,4,8,4],[7,5,8,5],[7,6,8,6],[12,7,13,7],[12,8,13,8],[12,9,13,9],[14,1,15,1],[14,2,15,2],[14,4,15,4],[14,5,15,5],[14,6,15,6],[14,7,15,7],[14,8,15,8],[14,9,15,9],[12,1,13,1],[12,2,13,2],[12,4,13,4],[12,5,13,5],[12,6,13,6],[16,8,17,8],[16,9,17,9],[16,1,17,1],[16,2,17,2],[16,4,17,4],[16,5,17,5],[16,6,17,6],[16,7,17,7]]}
[null,"EOEXTFI"]
[null,"   SIGN PANELS TYPE EO (EXTRUDED PANEL SECTIONS)",null,null,null,null,null,null,null,"SS"]
[null,"SIGN\nNO","QTY","LOCATION","PANEL",null,null,null,null,"REQUIRED\nPANEL SIZE\n(INCH)"]
[null,null,null,null,"SIZE \n(INCH) ",null,null,"AREA\n(SQ FT)","TOTAL\nAREA\n(SQ FT)"]
[]
[]
[null,"EA-201",0,"OH I94-0, OH I94-046, OH I94-056",108,"x",6,{"$f":"E7*G7/144","v":4.5},{"$f":"C7*H7","v":0},"108 x 30"]
[null,"EO-202",0,"OH I94-052-94  OH I94-055,  OH I94-488(R)",108,"x",6,4.5,0,"108 x 30"]
[null,null,null,"OH I94-489  OH I94-095(L)"]
[null,"EO-203",0,"OH I94-097(L)",126,"x",6,{"$f":"E10*G10/144","v":5.25},{"$f":"C10*H10","v":0},"126 x 30"]
[null,"EO-204",0,"OH I94-488(L)   OH I94-092",126,"x",6,{"$f":"E11*G11/144","v":5.25},0,"126 x 30"]
[null,null,null,"OH I94-094(R)  OH I94-095(R) OH I94-572(L)"]
[null," ",0," ",0,"x",0,{"$f":"E13*G13/144","v":0},0,"108 x 30"]
[null,null,null," "]
[null," ",0," ",0,"x",0,{"$f":"E15*G15/144","v":0},0,"126 x 30"]
[null,null,null," "]
[null," ",0," ",0,"x",0,{"$f":"E17*G17/144","v":0},0,"126 x 30"]
[null,null,null," "]
[null,"EO-208",0," ",126,"x",6,{"$f":"E19*G19/144","v":5.25},{"$f":"C19*H19","v":0}," 96 x 30"]
[null,"TOTAL",null,null,null,null,null,null,{"$f":"SUM(I7:I19)","v":0}]
[null," "]

{"sheet":"ESALINS","index":59,"n_rows":42,"n_cols":20,"rows_kept":42,"cut":false,"hidden":false,"merged":[[1,1,1,13],[30,1,31,1],[30,2,31,2],[30,12,31,12],[30,13,31,13],[30,14,31,14],[33,1,34,1],[33,2,34,2],[33,12,34,12],[24,12,25,12],[24,13,25,13],[33,13,34,13],[24,14,25,14],[24,1,25,1],[24,2,25,2],[24,4,25,4],[24,5,25,5],[30,4,31,4],[30,5,31,5],[30,6,31,6],[30,7,31,7],[33,4,34,4],[33,5,34,5],[33,6,34,6],[33,7,34,7],[18,1,20,1],[18,2,20,2],[18,12,20,12],[15,1,17,1],[15,2,17,2],[18,6,20,6],[18,7,20,7],[21,4,23,4],[21,5,23,5],[21,6,23,6],[21,7,23,7],[18,4,20,4],[18,5,20,5],[18,11,20,11],[21,1,23,1],[21,2,23,2],[21,12,23,12],[18,10,20,10],[24,6,25,6],[24,7,25,7],[18,8,20,8],[18,9,20,9],[33,9,34,9],[13,1,14,1],[13,2,14,2],[9,1,10,1],[9,2,10,2],[9,6,10,6],[9,7,10,7],[13,4,14,4],[9,8,10,8],[2,1,4,1],[9,4,10,4],[9,5,10,5],[3,4,3,7],[4,4,4,7],[3,8,3,11],[4,8,4,11],[2,2,3,2],[15,6,17,6],[15,7,17,7],[9,10,10,10],[9,11,10,11],[13,8,14,8],[13,9,14,9],[13,10,14,10],[13,11,14,11],[9,9,10,9],[15,8,17,8],[15,9,17,9],[15,10,17,10],[15,11,17,11],[30,8,31,8],[33,8,34,8],[21,8,23,8],[33,11,34,11],[21,9,23,9],[21,10,23,10],[21,11,23,11],[24,8,25,8],[2,14,4,14],[2,12,2,13],[13,12,14,12],[13,13,14,13],[9,14,10,14],[15,13,17,13],[3,12,4,12],[3,13,4,13],[9,12,10,12],[9,13,10,13],[2,4,2,11],[13,5,14,5],[13,6,14,6],[13,7,14,7],[15,4,17,4],[15,5,17,5],[33,18,34,18],[33,19,34,19],[30,9,31,9],[30,10,31,10],[30,11,31,11],[13,14,14,14],[18,13,20,13],[18,14,20,14],[24,11,25,11],[33,14,34,14],[21,13,23,13],[21,14,23,14],[24,9,25,9],[15,14,17,14],[15,12,17,12],[24,10,25,10],[33,10,34,10],[3,18,3,19],[24,18,25,18],[24,19,25,19],[30,18,31,18],[30,19,31,19],[18,18,20,18],[18,19,20,19],[21,18,23,18],[21,19,23,19],[13,18,14,18],[9,18,10,18],[9,19,10,19],[13,19,14,19],[15,18,17,18],[15,19,17,19]]}
[]
[null,"SALVAGE & INSTALL SIGN TYPE EO",null,null,null,null,null,null,null,null,null,null,null,null,{"$f":"'SEQ-PSTAB'!B41","v":0}]
[null,"SIGN\nNO","QTY",null,"PANEL SIZE",null,null,null,null,null,null,null,"POSTS",null,"LEGEND "]
[null,null,null,"INSTALL LOCATION","SALVAGE",null,null,null,"INSTALL",null,null,null,"NO. &\nTYPE","SPACING",null,null,null,null,"DEFAULT VALUES"]
[null,null,"EACH",null,"INCH",null,null,null,"INCH",null,null,null,null,null,null,null,null,null,"POST #","POST TYPE"]
[null,"EO-201",0,"OH I494-299(L)",96,"x",24,null,90,"x",30,null,{"$f":"Epostnumb(I6)&\"-\"&T6","v":"2-U"},{"$f":"epostspace(I6)","v":"54"},"EXIT 21",null,null,null,"3","U"]
[null,"EO-202",0,"OH 494-299(R)  OH I94-318(L)",96,"x",24,null,96,"x",30,null,{"$f":"Epostnumb(I7)&\"-\"&T7","v":"2-U"},{"$f":"epostspace(I7)","v":"54"},"EXIT 22",null,null,null,"3","U"]
[null,"EO-203",0,"OH I494-317     OH I494-318(R)",96,"x",24,null,96,"x",30,null,{"$f":"Epostnumb(I8)&\"-\"&T8","v":"2-U"},{"$f":"epostspace(I8)","v":"54"},"EXIT 23",null,null,null,"3","U"]
[null,"EO-204",0,"OH I494-101(R)  OH I494-124",96,"x",24,null,96,"x",30,null,{"$f":"Epostnumb(I9)&\"-\"&T9","v":"2-U"},{"$f":"epostspace(I9)","v":"54"},"EXIT 26",null,null,null,"3","U"]
[null,"EO-205",0," ",96,"x",24,null,96,"x",30,null,{"$f":"Epostnumb(I10)&\"-\"&T10","v":"2-U"},{"$f":"epostspace(I10)","v":"54"},"EXIT 27",null,null,null,"3","U"]
[null,null,null," "]
[null,"EO-206",0," ",114,"x",24,null,114,"x",30,null,{"$f":"Epostnumb(I12)&\"-\"&T12","v":"3-U"},{"$f":"epostspace(I12)","v":"42"},"EXIT 35A",null,null,null,"3","U"]
[null,"EO-207",0," ",114,"x",24,null,114,"x",30,null,{"$f":"Epostnumb(I13)&\"-\"&T13","v":"3-U"},{"$f":"epostspace(I13)","v":"42"},"EXIT 35B",null,null,null,"3","U"]
[null,"EO-208",0," ",114,"x",24,null,114,"x",30,null,{"$f":"Epostnumb(I14)&\"-\"&T14","v":"3-U"},"42","EXIT 35C",null,null,null,"3","U"]
[null,null,null," "]
[null,"EO-209",0," ",150,"x",24,null,150,"x",30,null,{"$f":"Epostnumb(I16)&\"-\"&T16","v":"4-U"},"42","EXITS 35C&B",null,null,null,"3","U"]
[null,null,null," "]
[null,null,null," "]
[null,"EO-210",0," ",96,"x",24,null,96,"x",30,null,{"$f":"Epostnumb(I19)&\"-\"&T19","v":"2-U"},"42","EXIT 36",null,null,null,"3","U"]
[null,null,null," "]
[null,null,null," "]
[null,"EO-211",0," ",96,"x",24,null,96,"x",30,null,{"$f":"Epostnumb(I22)&\"-\"&T22","v":"2-U"},"42","EXIT 37",null,null,null,"3","U"]
[null,null,null," "]
[null,null,null," "]
[null,"EO-212",0," ",114,"x",24,null,114,"x",30,null,{"$f":"Epostnumb(I25)&\"-\"&T25","v":"3-U"},"42","EXIT 38",null,null,null,"3","U"]
[null,null,null," "]
[null,"EO-213",0," ",114,"x",24,null,114,"x",30,null,{"$f":"Epostnumb(I27)&\"-\"&T27","v":"3-U"},{"$f":"epostspace(I27)","v":"42"},"EXIT 39",null,null,null,"3","U"]
[null,"EO-214",0," ",108,"x",24,null,108,"x",30,null,{"$f":"Epostnumb(I28)&\"-\"&T28","v":"3-U"},{"$f":"epostspace(I28)","v":"36"},"EXIT 41A",null,null,null,"3","U"]
[null,"EO-215",0," ",108,"x",24,null,108,"x",30,null,{"$f":"Epostnumb(I29)&\"-\"&T29","v":"3-U"},{"$f":"epostspace(I29)","v":"36"},"EXIT 41B",null,null,null,"3","U"]
[null,"EO-216",0," ",150,"x",24,null,150,"x",30,null,{"$f":"Epostnumb(I30)&\"-\"&T30","v":"4-U"},{"$f":"epostspace(I30)","v":"42"},"EXITS 41A&B",null,null,null,"3","U"]
[null,"EO-217",0," ",114,"x",24,null,114,"x",30,null,{"$f":"Epostnumb(I31)&\"-\"&T31","v":"3-U"},"42","EXIT 42A",null,null,null,"3","U"]
[null,null,null," "]
[null,"EO-218",0," ",114,"x",24,null,114,"x",30,null,{"$f":"Epostnumb(I33)&\"-\"&T33","v":"3-U"},{"$f":"epostspace(I33)","v":"42"},"EXIT 42B",null,null,null,"3","U"]
[null,"EO-219",0," ",114,"x",24,null,114,"x",30,null,{"$f":"Epostnumb(I34)&\"-\"&T34","v":"3-U"},"42","EXIT 43A",null,null,null,"3","U"]
[null,null,null," "]
[null,"EO-220",0," ",114,"x",24,null,114,"x",30,null,{"$f":"Epostnumb(I36)&\"-\"&T36","v":"3-U"},{"$f":"epostspace(I36)","v":"42"},"EXIT 43B",null,null,null,"3","U"]
[null,"EO-221",0," ",96,"x",24,null,96,"x",30,null,{"$f":"Epostnumb(I37)&\"-\"&T37","v":"2-U"},{"$f":"epostspace(I37)","v":"54"},"EXIT 45",null,null,null,"3","U"]
[null,"TOTAL ",{"$f":"SUM(C6:C37)","v":0}]
[null," "]
[null,"GENERAL NOTES:"]
[null,"1.  SEE SHEET XX FOR TYPE EO STRUCTURAL DETAIL."]
[null,"2.  TYPE EO POST SPACING MAY BE VARIED TO MISS MEMBERS OF OH SIGN STRUCTURES."]

{"sheet":"EO SAW","index":60,"n_rows":10,"n_cols":10,"rows_kept":10,"cut":false,"hidden":false,"merged":[[2,1,2,9],[3,1,5,1],[3,2,5,2],[3,3,3,8],[3,9,5,9],[4,3,5,5],[4,6,5,8]]}
[]
[]
[null,"SAW SIGN PANELS TYPE EO (1)"]
[null,"SIGN NO","LOCATION","PANEL SIZE (INCH)",null,null,null,null,null,"LENGTH\nOF\nCUT (FT)"]
[null,null,null,"EXISTING ",null,null,"MODIFIED"]
[]
[null,"EO-204","BR 6850",96,"x",30,78,"x",30,2.5]
[]
[null,"SPECIFIC NOTE:"]
[null,"(1) PAID FOR UNDER SIGN PANEL OVERLAY TYPE EO"]

{"sheet":"OH REM","index":61,"n_rows":14,"n_cols":10,"rows_kept":14,"cut":false,"hidden":false,"merged":[[1,4,1,8],[2,8,3,8],[2,9,3,9],[2,4,3,4],[2,5,3,5],[2,6,3,6],[2,7,3,7]]}
[]
[null,null,null,null,"REMOVE SIGN TYPE OH",null,null,null,null,"AA"]
[null,null,null,null,"SIGN NO","LOCATION","TYPE","POST\nTYPE","SPAN","REMARKS"]
[]
[null,null,null,null,"OH I35W-068"," ","SIGN BRIDGE","III-S","93'-0\"","SEE SPECIAL PROVISIONS"]
[null,null,null,null,null," ","CANTILEVER"]
[null,null,null,null,null,null,"BR MNTD"]
[null,null,null,null,null,null,"BR MNTD"]
[null,null,null,null,null,null,"CANTILEVER"]
[null,null,null,null,null,null,"SIGN BRIDGE"]
[null,null,null,null,null,null,"SIGN BRIDGE - CANTILEVER"]
[null,null,null,null,null,null,"BUTTERFLY CANTILEVER"]
[]
[null,null,null,null,"total",{"$f":"COUNTA(E5:E12)","v":1}]

{"sheet":"OH SAL PN","index":62,"n_rows":9,"n_cols":7,"rows_kept":9,"cut":false,"hidden":false,"merged":[[3,6,4,6],[2,1,2,5],[3,5,5,5],[3,1,5,1],[3,2,5,2],[3,3,5,3],[3,4,5,4]]}
[]
[]
[null,"SALVAGE SIGN PANEL TYPE OH",null,null,null,null,"AA"]
[null,"SIGN NO","LOCATION","PANEL\nSIZE\n(INCH)","PANEL\nSIZE\n(INCH)","PANEL\nSIZE\n(INCH)","TOTAL\nPANELS "]
[]
[null,null,null,null,null,null,"EACH"]
[null,"OH I90-046"]
[]
[null,"TOTAL"," ",null," ",null,{"$f":"SUM(G7:G8)","v":0}]

{"sheet":"OHREPOSPNL","index":63,"n_rows":14,"n_cols":30,"rows_kept":14,"cut":false,"hidden":false,"merged":[[2,15,3,15],[1,1,1,14],[2,1,4,1],[2,2,4,2],[2,11,2,14],[3,11,3,14],[4,3,4,6],[4,7,4,10],[4,11,4,14],[2,3,2,6],[3,3,3,6],[2,7,2,10],[3,7,3,10],[2,29,3,29],[1,18,1,28],[2,18,3,18],[2,19,3,19],[2,20,3,20],[2,21,3,21],[2,22,2,28]]}
[]
[null,"REPOSITION SIGN PANEL TYPE OH",null,null,null,null,null,null,null,null,null,null,null,null,null,{"$f":"'SEQ-PSTAB'!B160","v":0},null,null,"OH STRUCTURE REPOSITONED PANEL LOCATIONS"]
[null,"SIGN NO","LOCATION","PANEL",null,null,null,"PANEL",null,null,null,"PANEL",null,null,null,"TOTAL\nPANELS ",null,null,"SIGN\nNO","LOCATION","TYPE","SPAN","PANEL SIZES AND LOCATION",null,null,null,null,null,null,"REMARKS"]
[null,null,null,"SIZE",null,null,null,"SIZE",null,null,null,"SIZE",null,null,null,null,null,null,null,null,null,null,"E","F x W","G","H x W","J","K x W","L"]
[null,null,null,"INCH",null,null,null,"INCH",null,null,null,"INCH",null,null,null,"EACH",null,null,"OH MN55-025 FWBT","1590+00 NB","SPAN","42'-0'","60\"","120\"","36\"","144\"","48\"","96\"","54\""]
[null,"OH I494-043","695+35 NB",84,"x",102,null,132,"x",126,null,162,"x",108,null,3]
[null,"OH I694-512","705+60 SB",168,"x",84,null,null,null,null,null,null,null,null,null,1]
[]
[]
[]
[null,null," ",null,null,null,null,null,null,null,null,null,null,"TOTAL",null,{"$f":"SUM(P6:P10)","v":4}]
[]
[]
[null,null,null,null," ",null," ",null," ",null," ",null," ",null," "]

{"sheet":"OH BTQ","index":64,"n_rows":38,"n_cols":10,"rows_kept":38,"cut":false,"hidden":false,"merged":[[1,1,1,8],[2,3,2,8],[2,1,4,1],[2,2,4,2],[2,9,4,9]]}
[]
[null,"TABULATION OF OVERHEAD SIGN STRUCTURE QUANTITIES  (2)",null,null,null,null,null,null,null,"AA"]
[null,"ITEM","UNIT","OH SIGN NO.",null,null,null,null,null,"TOTAL\nQUANTITIES"]
[null,null,null,"OH I90-056","OH I90-057","OH I90-058","OH I90-059","OH I90-060","OH I90-061"]
[null,null,null,"QTY","QTY","QTY","QTY","QTY","QTY"]
[null," STRUCT. STEEL POSTS  ","POUND",0,0,0,0,0,0,{"$f":"SUM(D6+E6+F6+G6+H6+I6)","v":0}]
[null," STRUCT. STEEL TRUSSES","POUND",0,0,0,0,0,0,0]
[null," STRUCT. STEEL WALKWAY SUPPORTS","POUND",0,0,0,0,0,0,0]
[null," STRUCT. STEEL WALKWAY GRATING","POUND",0,0,0,0,0,0,0]
[null," STRUCT. STEEL PANEL MTG. POSTS","POUND",0,0,0,0,0,0,0]
["(3)"," CONCRETE FOOTINGS (SPREAD)","CU YD",0,0,0,0,0,0,0]
["(3)"," CONCRETE FOOTINGS (SHAFT)","CU YD"," "," "," "," "," "," "]
[]
[]
[null,"SPECIFIC NOTES:",null,null,null,"GENERAL NOTES:"]
[null,"(1) CENTER LINE ELEVATION IS FIELD ELEVATION.",null,null,null,"1. THE SUBSCRIPTION E ON THE POST TYPE DENOTES THE POST WHICH HAS"]
[null,"(2) BASED ON TABULATED ELEVATIONS AND DIMENSIONS.",null,null,null,"   THE HAND HOLE AND PROVISIONS FOR GROUNDING, I.E.POST TYPE 3E."]
[null,"    REVISE AS NECESSARY USING QUANTITY TABLES ON SHEET XX",null,null,null,"2. TABULATED ELEVATIONS AND DIMENSIONS ARE APPROXIMATE ONLY."]
[null,"(3) SEE DIVISION ST SPECIAL PROVISIONS FOR FOUNDATION SOILS INFORMATION.",null,null,null,"   FABRICATION DEPENDENT ON THESE ELEVATIONS AND DIMENSIONS SHALL"]
[null,"(4) DRILLED SHAFT FOOTING.",null,null,null,"   NOT BE STARTED UNTIL THE ENGINEER HAS MADE FINAL DETERMINATION"]
[null,null,null,null,null,"   OF THEM IN THE FIELD."]
[null,null,null,null,null,"3. LEFT AND RIGHT DESIGNATIONS ARE SHOWN IN DIRECTION OF"]
[null,null,null,null,null,"   TRAFFIC FLOW. WHEN TWO DIRECTIONS OF TRAFFIC ARE SPANNED THE"]
[null,null,null,null,null,"   DESIGNATIONS ARE SHOWN LOOKING UP STATIONING."]
[null,null,null,null,null,"4. SEE SHEETS XX-XX FOR DETAILS."]
[null,null,null,null,null,"5. SEE SHEET XXX-XX FOR CROSS SECTIONS."]
[]
[]
["* THIS chart is ALWAYS used together with \"OVERHEAD SIGN STRUCTURE\" or \"SALVAGE AND INSTALL OH SIGN STRUCTURE\" chart "]
[null,null," on the OH TAB sheet with the BRIDGE TYPE figure drawings"]
[]
[]
[null,"The SPECIFIC NOTES  are  COMBINED  on the two charts."]
[]
[]
[null,"NOTES (1) (4) are on the OVERHEAD SIGN STRUCTURE chart",null,null,null,null,"(SEE SAMPLE PLAN)"]
[]
[null,"NOTES (2) (3) are on the TABULATION OF OVERHEAD SIGN STRUCTURE QUANTITIES chart"]

{"sheet":"OH B","index":65,"n_rows":22,"n_cols":19,"rows_kept":22,"cut":false,"hidden":false,"merged":[[1,1,1,18],[2,1,5,1],[2,2,5,2],[2,3,5,3],[2,4,5,4],[2,5,2,8],[3,16,4,17],[3,18,5,18],[3,10,4,11],[3,12,5,12],[2,9,5,9],[2,10,2,12],[2,13,2,15],[2,16,2,18],[3,5,5,5],[3,6,5,6],[3,7,5,7],[3,8,5,8],[3,13,4,14],[3,15,5,15]]}
[]
[null,"OVERHEAD SIGN STRUCTURES"]
[null,"SIGN NO.","STATION","BRIDGE\nTYPE","TRUSS\nTYPE","SPAN LENGTHS",null,null,null,"LOW STEEL\nELEVATION\n(1)","LEFT POST",null,null,"CENTER POST",null,null,"RIGHT POST"]
[null,null,null,null,null,"LEFT\nCANT","RIGHT\nCANT","SPAN OR\nLEFT SPAN","RIGHT\nSPAN",null,"ELEVATION\n(1)",null,"TYPE","ELEVATION\n(1)",null,"TYPE","ELEVATION\n(1)",null,"TYPE"]
[]
[null,null,null,null,null,null,null,null,null,null,"A","B",null,"A","B",null,"A","B"]
[null,"OH I90-056",null,null,null,null,null,null,null,null," "]
[]
[]
[]
[]
[]
[]
[]
[null,"* THIS CHART is ALWAYS used along with \"TABULATION OF OVERHEAD SIGN STRUCTURE QUANTITIES\" chart on the OH tabulation sheet with the Bridge Type figure drawings"]
[]
[null,"The SPECIFIC NOTES  are  COMBINED  on the two charts."]
[]
[]
[null,"NOTES (1) (4) are on the OVERHEAD SIGN STRUCTURE chart"]
[]
[null,"NOTES (2) (3) are on the TABULATION OF OVERHEAD SIGN STRUCTURE QUANTITIES chart"]

{"sheet":"S & I_OH B","index":66,"n_rows":36,"n_cols":21,"rows_kept":36,"cut":false,"hidden":false,"merged":[[2,18,2,20],[2,6,5,6],[2,7,2,10],[2,11,5,11],[2,12,2,14],[2,15,2,17],[1,1,1,20],[3,15,4,16],[3,17,5,17],[3,18,4,19],[3,20,5,20],[2,1,5,1],[2,2,5,2],[3,7,5,7],[3,8,5,8],[3,9,5,9],[3,10,5,10],[3,12,4,13],[3,14,5,14],[2,3,5,3],[2,4,5,4],[2,5,5,5]]}
[]
[null,"SALVAGE AND INSTALL OVERHEAD SIGN STRUCTURES"]
[null,"INPLACE SIGN NO","INPLACE STATION","NEW SIGN NO.","NEW STATION","BRIDGE\nTYPE","TRUSS\nTYPE","SPAN LENGTHS",null,null,null,"LOW STEEL\nELEVATION\n(1)","LEFT POST",null,null,"CENTER POST",null,null,"RIGHT POST"]
[null,null,null,null,null,null,null,"LEFT\nCANT","RIGHT\nCANT","SPAN OR\nLEFT SPAN","RIGHT\nSPAN",null,"ELEVATION\n(1)",null,"TYPE","ELEVATION\n(1)",null,"TYPE","ELEVATION\n(1)",null,"TYPE"]
[]
[null,null,null,null,null,null,null,null,null,null,null,null,"A","B",null,"A","B",null,"A","B"]
[null,"OH I90-056",null,"OH I90-347",null,null,null,null,null,null,null,null," "]
[]
[]
[]
[]
[]
[null,null,null,"SPECIFIC NOTES:"]
[null,null,null,"(1)  CENTER LINE ELEVATION= 100.00"]
[null,null,null,"(2)  BASED ON TABULATED ELEVATIONS AND DIMENSIONS."]
[null,null,null,"     REVISE IF NECESSARY USING QUANTITY TABLES ON SHEET XX"]
[null,null,null,"(3)  SEE SHEET XX"]
[null,null,null,"(4)  DRILLED SHAFT FOOTING."]
[]
[]
[]
[]
[]
[]
[]
[]
[]
[]
[null,null,null,"* THIS CHART is ALWAYS used along with \"TABULATION OF OVERHEAD SIGN STRUCTURE QUANTITIES\" chart on the OH tabulation sheet with the Bridge Type figure drawings"]
[]
[null,null,null,"The SPECIFIC NOTES  are  COMBINED  on the two charts."]
[]
[]
[null,null,null,"NOTES (1) (4) are on the SALVAGE AND INSTALL OVERHEAD SIGN STRUCTURE chart"]
[]
[null,null,null,"NOTES (2) (3) are on the TABULATION OF OVERHEAD SIGN STRUCTURE QUANTITIES chart"]

{"sheet":"OH OL","index":67,"n_rows":21,"n_cols":16,"rows_kept":21,"cut":false,"hidden":false,"merged":[[20,1,20,11],[3,15,5,15],[2,1,2,14],[3,1,5,1],[3,2,5,2],[3,3,3,6],[3,7,3,10],[4,3,5,5],[4,6,5,6],[4,7,5,9],[4,10,5,10],[4,11,5,13],[4,14,5,14],[3,11,3,14]]}
[]
[]
[null,"SIGN PANEL OVERLAY TYPE OH ",null,null,null,null,null,null,null,null,null,null,null,null,null,"GG"]
[null,"SIGN NO","LOCATION","PANEL OVERLAY",null,null,null,"PANEL OVERLAY",null,null,null,"PANEL OVERLAY",null,null,null,"TOTAL\nAREA\n(SQ FT)"]
[null,null,null,"SIZE\n(INCH)",null,null,"AREA\n(SQ FT)","SIZE\n(INCH)",null,null,"AREA\n(SQ FT)","SIZE\n(INCH)",null,null,"AREA\n(SQ FT)"]
[]
[null,"OH I35W-314","39+00 NB",0,"x",114,{"$f":"D7*F7/144","v":0},0,"x",120,{"$f":"H7*J7/144","v":0},0,"x",90,{"$f":"L7*N7/144","v":0},{"$f":"SUM(G7+K7+O7)","v":0}]
[null,"OH I35W-315","40+80 NB",0,"x",120,{"$f":"D8*F8/144","v":0},null,null,null,null,null,null,null,null,{"$f":"SUM(G8+K8+O8)","v":0}]
[null,null," "]
[null,null," "]
[]
[]
[]
[]
[]
[]
[null,"TOTAL",null,null,null,null,null,null,null,null,null,null,null,null,null,{"$f":"SUM(P7:P16)","v":0}]
[]
[]
[null,"GENERAL NOTE:"]
[null,{"$f":"\"1.  SEE SHEETS \" & TEXT(TOC!$B69,\"0\") & \" TO \" & TEXT(TOC!$B70,\"0\") & \" FOR SIGN PANELS.\"","v":"1.  SEE SHEETS ST70 TO ST71 FOR SIGN PANELS."}]

{"sheet":"OH INSPN","index":68,"n_rows":9,"n_cols":7,"rows_kept":9,"cut":false,"hidden":false,"merged":[[3,6,4,6],[2,1,2,5],[3,5,5,5],[3,1,5,1],[3,2,5,2],[3,3,5,3],[3,4,5,4]]}
[]
[]
[null,"INSTALL SIGN PANEL TYPE OH",null,null,null,null,"AA"]
[null,"SIGN NO","LOCATION","PANEL\nSIZE\n(INCH)","PANEL\nSIZE\n(INCH)","PANEL\nSIZE\n(INCH)","TOTAL\nPANELS "]
[]
[null,null,null,null,null,null,"EACH"]
[null,"OH MN36-084","667+00 C D ROAD","114 x 126","126 x 126",null,0]
[]
[null,"TOTAL"," ",null," ",null,{"$f":"SUM(G7:G8)","v":0}]

{"sheet":"SIGN PANELS TYPE OH","index":69,"n_rows":23,"n_cols":16,"rows_kept":23,"cut":false,"hidden":false,"merged":[[24,1,24,11],[20,1,20,11],[2,1,2,14],[22,1,22,20],[4,7,5,9],[4,10,5,10],[4,11,5,13],[4,14,5,14],[3,11,3,14],[3,15,5,15],[4,3,5,5],[4,6,5,6],[3,1,5,1],[3,2,5,2],[3,3,3,6],[3,7,3,10]]}
[]
[]
[null,"SIGN PANELS TYPE OH ",null,null,null,null,null,null,null,null,null,null,null,null,null,"AA"]
[null,"SIGN NO","LOCATION","PANEL",null,null,null,"PANEL",null,null,null,"PANEL",null,null,null,"TOTAL\nAREA\n(SQ FT)"]
[null,null,null,"SIZE\n(INCH)",null,null,"AREA\n(SQ FT)","SIZE\n(INCH)",null,null,"AREA\n(SQ FT)","SIZE\n(INCH)",null,null,"AREA\n(SQ FT)"]
[]
[null,"OH I694-314","39+00 NB",0,"x",114,{"$f":"D7*F7/144","v":0},0,"x",120,{"$f":"H7*J7/144","v":0},0,"x",90,{"$f":"L7*N7/144","v":0},{"$f":"SUM(G7+K7+O7)","v":0}]
[null,"OH I694-315","40+80 NB",0,"x",120,{"$f":"D8*F8/144","v":0},null,null,null,null,null,null,null,null,{"$f":"SUM(G8+K8+O8)","v":0}]
[null,null," "]
[null,null," "]
[]
[]
[]
[]
[]
[]
[null,"TOTAL",null,null,null,null,null,null,null,null,null,null,null,null,null,{"$f":"SUM(P7:P16)","v":0}]
[]
[]
[null,"GENERAL NOTE:"]
[null,{"$f":"\"1.  SEE SHEETS \" & TEXT(TOC!$B66,\"0\") & \" TO \" & TEXT(TOC!$B67,\"0\") & \" FOR SIGN PANELS.\"","v":"1.  SEE SHEETS ST67 TO ST68 FOR SIGN PANELS."}]
[]
[null,"* THIS QUANTITY GETS COMBINED WITH  \"SIGN PANEL TYPE OH (EXTRUDED PANEL)\" QUANTITY ON THE SEQ(STATEMENT OF EST. QUANTITIES)"]

{"sheet":"OH ID ","index":70,"n_rows":19,"n_cols":5,"rows_kept":19,"cut":false,"hidden":false,"merged":[[1,1,1,3],[2,1,3,1],[2,3,3,3],[2,4,3,4]]}
[]
[null,"OH SIGN IDENTIFICATION PLATE",null,null,"KO"]
[null,"SIGN NO","QTY","LOCATION","IDENTIFICATION\nPLATE NO"]
[null,null,"EACH"]
[null,"OH MN610-045",0,"39+00 NB","610-045"]
[null,"OH MN280-035",0,"40+80 NB","280-035"]
[]
[]
[]
[]
[]
[]
[]
[null,"TOTAL ",{"$f":" SUM(C5:C13)","v":0}]
[]
[]
[null,"GENERAL NOTES:"]
[null,"1. SEE MNDOT STANDARD SIGNS AND MARKINGS MANUAL FOR OH SIGN IDENTIFICATION PLATE (X5-1) "]
[null,"2. SEE SHEET ____ FOR MOUNTING DETAILS."]

{"sheet":"OH EXT REM","index":71,"n_rows":17,"n_cols":5,"rows_kept":17,"cut":false,"hidden":false,"merged":[[1,1,1,3],[26,2,26,3],[2,1,3,1],[2,2,3,2],[2,3,2,4],[18,2,18,5],[19,2,20,2],[19,3,20,3],[19,4,19,5]]}
[null,"OHEXTREM"]
[null,"REMOVE EXTRUDED PANEL SECTIONS TYPE OH (1)",null,null,"XX"]
[null,"SIGN NO","LOCATION","PANEL SIZE  (INCH)"]
[null,null,null,"REMOVE"," MODIFIED"]
[null,"OH I35W-64 (R)","35+00 SB","162 x 24","162 x 90"]
[null,"OH I35W-314 (L)","39+00 NB","204 x 24","204 x 90"]
[]
[]
[]
[]
[]
[]
[]
[]
[]
[]
[null,"(1) INCLUDED IN SIGN PANEL OVERLAY TYPE OH"]

{"sheet":"OH REMPAN","index":72,"n_rows":14,"n_cols":7,"rows_kept":14,"cut":false,"hidden":false,"merged":[[2,6,3,6],[1,1,1,5],[2,5,4,5],[2,1,4,1],[2,2,4,2],[2,3,4,3],[2,4,4,4]]}
[]
[null,"REMOVE SIGN PANEL TYPE OH",null,null,null,null,"AA"]
[null,"SIGN NO","LOCATION","PANEL\nSIZE\n(INCH)","PANEL\nSIZE\n(INCH)","PANEL\nSIZE\n(INCH)","TOTAL\nPANELS "]
[]
[null,null,null,null,null,null,"EACH"]
[null,"OH I494-043","695+35 NB","  84 x 102","132 x 126","162 x 108",3]
[null,"OH I494-045","705+60 SB","168 x   84",null,null,1]
[]
[]
[]
[]
[]
[]
[null,null," ",null," ","TOTAL",{"$f":"SUM(G6:G13)","v":4}]

{"sheet":"OH SAW","index":73,"n_rows":11,"n_cols":10,"rows_kept":11,"cut":false,"hidden":false,"merged":[[2,1,2,9],[3,1,5,1],[3,2,5,2],[3,3,3,8],[3,9,5,9],[4,3,5,5],[4,6,5,8]]}
[]
[]
[null,"SAW SIGN PANELS TYPE OH (1)"]
[null,"SIGN NO","LOCATION","PANEL SIZE (INCH)",null,null,null,null,null,"LENGTH\nOF\nCUT (FT)"]
[null,null,null,"EXISTING ",null,null,"MODIFIED"]
[]
[null,"OH US61-007",null,156,"x",96,132,"x",96,{"$f":"(I7)/12","v":8}]
[null,null,null,null,"x",null,null,"x",null,{"$f":"(I8)/12","v":0}]
[]
[null,"SPECIFIC NOTE:"]
[null,"(1) PAID FOR UNDER SIGN PANEL OVERLAY TYPE OH"]

{"sheet":"OH PMP","index":74,"n_rows":8,"n_cols":7,"rows_kept":8,"cut":false,"hidden":false,"merged":[[1,1,1,5],[2,5,4,5],[2,6,4,6],[2,1,4,1],[2,2,4,2],[2,3,4,3],[2,4,4,4]]}
[]
[null,"PANEL MOUNTING POSTS (S4x7.7)",null,null,null,null,"AA"]
[null,"SIGN NO","TRUSS\nDEPTH\n(INCH)","CHORD \nANGLES\n(INCH)","NO.\nOF\nPOSTS","LENGTH\nAPPROX\n(INCH)","WEIGHT\n(POUND)"]
[]
[]
[null,"OH US7-015",72,"6 x 6 x 1/2",2,88,148]
[]
[null,null,null,null," ","TOTAL",{"$f":"SUM(G6:G7)","v":148}]

{"sheet":"OH PMP MOD","index":75,"n_rows":24,"n_cols":6,"rows_kept":24,"cut":false,"hidden":false,"merged":[[21,2,21,7],[2,1,2,5],[3,1,6,1],[3,2,3,5],[4,2,6,2],[4,3,6,3],[4,4,6,4],[4,5,6,5],[20,2,20,8]]}
[]
[]
[null,"MODIFY POST    (1) (2)"]
[null,"SIGN NO","PANEL MOUNTING POSTS   "]
[null,null," NO.","SIZE","EXTEND\nAPPROX.\n(INCH)","SHORTEN\nAPPROX.\n(INCH)"]
[null,null,null,null,null," "]
[]
[null,"OH I35E-139 (L)",2,"S4x7.7",18]
[null,"OH I35E-139 (R)",3,"S4x7.7",18]
[null,"OH I35E-238 (R)",2,"S4x7.7",12]
[]
[null,"SPECIFIC NOTES:"]
[null," (1)  SEE SHEET XX FOR DETAIL.  "]
[null," (2)  INCLUDED IN SIGN PANEL OVERLAY TYPE OH."]
[]
[]
[]
[]
[]
[]
[null,null,"* Panel Mounting Post SIZES (FROM NOTE 3 ON ST-10)"]
[null,null,"PANEL HEIGHT DETERMINES PMP SIZE."]
[null,null,"SIZE","S4x7.7","IF PANEL HEIGHT IS 11'-0\" OR LESS"]
[null,null,"SIZE","W6x12","IF PANEL HEIGHT IS 11'-6\" OR GREATER "]

{"sheet":"BMST","index":76,"n_rows":13,"n_cols":4,"rows_kept":13,"cut":false,"hidden":false,"merged":[[1,1,1,2]]}
[]
[null,"STRUCT. STEEL TRUSSES TYPE OH BR. MTD (1)",null,"AA"]
[null,"SIGN NO","BRIDGE NO","POUND"]
[null,"OH MN22-014",52007,0]
[]
[]
[]
[]
[null,"TOTAL",null,{"$f":"SUM(D4:D8)","v":0}]
[]
[]
[null,"SPECIFIC NOTES:"]
[null,"(1) INCLUDES F & I OH SIGN IDENTIFICATION PLATE (X5-1)"]

{"sheet":"SIGN PANELS TYPE OH (EXT PAN )","index":77,"n_rows":15,"n_cols":10,"rows_kept":15,"cut":false,"hidden":false,"merged":[[1,1,1,6],[14,1,14,18],[4,9,7,10],[2,1,5,1],[2,2,5,2],[2,3,3,6],[2,7,5,7],[4,3,5,5],[4,6,5,6]]}
[null,"OHEXTFI"]
[null," SIGN PANELS TYPE OH (EXTRUDED PANEL SECTIONS)",null,null,null,null,null,"AA"]
[null,"SIGN NO","LOCATION","EXTRUDED\nPANEL SECTIONS",null,null,null,"REQUIRED\nPANEL \nSIZE\n(INCH)"]
[]
[null,null,null,"SIZE\n(INCH)",null,null,"AREA\n(SQ FT)",null,null,"used for adding extruded panel sections to an OH sign panel."]
[]
[null,"OH I94-100 (L)","EB TH 94 STA 228+40",0,"x",6,{"$f":"D7*F7/144","v":0},"144 x 102"]
[null,"TOTAL",null,null,null,null,{"$f":"SUM(G7:G7)","v":0}]
[]
[]
[]
[]
[]
[]
[null,"* THIS QUANTITY GETS COMBINED WITH  \"SIGN PANEL TYPE OH\" QUANTITY ON THE SEQ(STATEMENT OF EST. QUANTITIES)"]

{"sheet":"REMOVE EXT PANEL SECT","index":78,"n_rows":10,"n_cols":8,"rows_kept":10,"cut":false,"hidden":false,"merged":[[1,1,1,6],[2,1,5,1],[2,2,5,2],[2,3,3,6],[2,7,5,7],[4,3,5,5],[4,6,5,6]]}
[null,"OHEXTFI"]
[null,"REMOVE (EXTRUDED PANEL SECTIONS)(1)",null,null,null,null,null,"TAA"]
[null,"SIGN NO","LOCATION","EXTRUDED\nPANEL SECTIONS",null,null,null,"REQUIRED\nPANEL \nSIZE\n(INCH)"]
[]
[null,null,null,"SIZE\n(INCH)",null,null,"AREA\n(SQ FT)"]
[]
[null,"OH I94-468(R)","EB TH 94 STA 95+00",0,"x",12,{"$f":"D7*F7/144","v":0},"150 x 96"]
[null,"TOTAL",null,null,null,null,{"$f":"SUM(G7)","v":0}]
[]
[null,"(1) INCLUDED IN SIGN PANEL OVERLAY TYPE OH"]

{"sheet":"OH REM FOOT","index":79,"n_rows":15,"n_cols":4,"rows_kept":15,"cut":false,"hidden":false,"merged":[[2,1,3,1],[2,2,3,2],[2,3,3,3],[1,1,1,2]]}
[null,"OHREMFTG"]
[null,"REMOVE SIGN FOOTING - TYPE OH",null,"AA"]
[null,"SIGN NO","LOCATION","FOOTING DEPTH\n(FT)"]
[]
[null,"OH MN100-053"," "," "]
[null,null," "," "]
[null,null,null," "]
[null,null,null," "]
[null,null,null," "]
[null,null,null," "]
[]
[]
[]
[]
[null,"TOTAL",{"$f":"COUNTA(B5:B10)","v":1}]

{"sheet":"OH SGN SUP CANT","index":80,"n_rows":14,"n_cols":6,"rows_kept":14,"cut":false,"hidden":false,"merged":[[3,1,4,1],[3,2,4,2],[3,3,4,3],[2,1,2,4]]}
[]
[]
[null,"CANTILEVER SIGN SUPPORT",null,null,null,"STZ"]
[null,"SIGN NO","LOCATION","SPAN","PANEL","POST"]
[null,null,null,null," ELEV. A"," ELEV. B"]
[null,"OH MN65-024","208+85 NB","30'-0\"",117.46,101.55]
[null,null,"208+85 NB","13'-0\"",117.11,100.39]
[]
[]
[]
[]
[]
[]
["TOTAL",{"$f":"COUNTA(B6:B11)","v":1}]

{"sheet":"OH SIGN SUP BRIDGE","index":81,"n_rows":18,"n_cols":7,"rows_kept":18,"cut":false,"hidden":false,"merged":[[2,6,3,6],[1,1,1,5],[2,1,4,1],[2,2,4,2],[2,3,4,3],[2,4,3,4],[2,5,3,5]]}
["","OHSSSB"]
[null,"SIGN BRIDGE SIGN SUPPORT",null,null,null,null,"PIL"]
[null,"SIGN\nNO","LOCATION","SPAN","PANEL","LEFT\nPOST","RIGHT\nPOST"]
[]
[null,null,null,null," Elev A"," Elev B"," Elev B"]
[null,"OH MN47-008","1590+00 NB","67'-0\"",117.33,98.5,99.5]
[]
[]
[]
[]
[]
[]
[]
[]
[]
[]
[]
[null,"TOTAL",{"$f":"COUNTA(B6:B13)","v":1}]

{"sheet":"OH REM WKWY","index":82,"n_rows":12,"n_cols":5,"rows_kept":12,"cut":false,"hidden":false,"merged":[[2,1,3,1],[2,2,3,2],[2,3,3,3],[2,4,3,4],[1,1,1,3]]}
[]
[null,"REMOVE SIGN WALKWAY   (1)(2)",null,null,"AA"]
[null,"SIGN NO","LOCATION","LENGTH\n(FT)","NUMBER OF FIXTURES"]
[]
[null,"OHI 35E-164"]
[]
[]
[null,null,"TOTAL ",{"$f":"SUM(D5:D7)","v":0}]
[]
[null,"SPECIFIC NOTES:"]
[null,"(1)  INCLUDES SIGN LIGHTING SYSTEM"]
[null,"(2)  REMOVE FEED POINT IDENTIFICATION PLATE NUMBER."]

{"sheet":"OH REM LT SYS","index":83,"n_rows":15,"n_cols":7,"rows_kept":15,"cut":false,"hidden":false,"merged":[[1,1,1,5],[2,1,4,1],[2,2,4,2],[2,5,4,5],[2,6,4,6],[2,3,3,4]]}
[]
[null,"REMOVE SIGN LIGHTING SYSTEM",null,null,null,null,"AA"]
[null,"SIGN NO","OH DESIGN","FIXTURES",null,"SOURCE OF    POWER    VOLTAGE","FEED POINT ID          PLATE NO "]
[]
[null,null,null,"125 W","250 W"]
[null,"OH I35W-025","BR # ",null,4,"240/480","N2L/P"]
[null,null,null,null,null," "]
[]
[]
[]
[null,null,null,null,null," "]
[null,null,null,null,null," "]
[]
[]
[null,"TOTAL",{"$f":"COUNTA(B6:B12)","v":1}]

{"sheet":"safety cable","index":84,"n_rows":15,"n_cols":5,"rows_kept":15,"cut":false,"hidden":false,"merged":[[2,1,3,1],[2,2,3,2],[2,3,3,3],[1,1,1,3]]}
[]
[null,"SAFETY CABLE",null,null,{"$f":"'SEQ-PSTAB'!B148","v":0}]
[null,"SIGN NO","LOCATION","DESIGN","LENGTH"]
[null,null,null,null,"FEET"]
[null,"OH MN101-016","1079+80 WB","BR MTD",33]
[null,"OH MN101-024","21+50 LOOP B","B",33]
[null,"OH MN101-037","9+00 LEG A","A",30]
[null,null,null,"CANT"]
[]
[]
[]
[]
[]
[]
[null,null,null,"TOTAL ",{"$f":"SUM(E5:E14)","v":96}]

{"sheet":"REMOVE BRIDGE MTD OH LIGHT SYST","index":85,"n_rows":12,"n_cols":5,"rows_kept":12,"cut":false,"hidden":false,"merged":[[2,1,3,1],[2,2,3,2],[2,3,3,3],[2,4,3,4],[1,1,1,3]]}
[]
[null,"REMOVE SIGN LIGHTING SYSTEM   (1)",null,null,"TQ"]
[null,"SIGN NO","LOCATION","TYPE","NUMBER OF FIXTURES"]
[]
[null,"OH I94-458","BR 62878","BRIDGE MOUNTED",4]
[null,"OH I94-459","BR 62878","BRIDGE MOUNTED",4]
[null,"OH I94-459","BR 62878","BRIDGE MOUNTED",3]
[null,"TOTAL (EACH)",3]
[]
[null,"SPECIFIC NOTES:"]
[]
[null,"(1)  REMOVE FEED POINT IDENTIFICATION NUMBER."]

{"sheet":"SIGN CODES","index":86,"n_rows":435,"n_cols":3,"rows_kept":435,"cut":false,"hidden":false,"merged":[]}
["CODE\nNO","PANEL LEGEND","NOTES"]
["D9-2AL","HOSPITAL TRAILBLAZER LEFT"]
["D9-2AR","HOSPITAL TRAILBLAZER RIGHT"]
["D9-2AT","HOSPITAL TRAILBLAZER THRU"]
["D9-2BL","HOSPITAL LEFT"]
["D9-2BR","HOSPITAL RIGHT"]
["E10-10L","DIESEL LEFT"]
["E10-10LR","DIESEL LEFT AND RIGHT"]
["E10-10R","DIESEL RIGHT"]
["E10-10T","DIESEL THRU"]
["E10-11L","LP-GAS LEFT"]
["E10-11LR","LP-GAS LEFT AND RIGHT"]
["E10-11R","LP-GAS RIGHT"]
["E10-11T","LP-GAS THRU"]
["E10-12L","E85 LEFT"]
["E10-12LR","E85 LEFT AND RIGHT"]
["E10-12R","E85 RIGHT"]
["E10-12T","E85 THRU"]
["E10-4L","HOSPITAL LEFT"]
["E10-4R","HOSPITAL RIGHT"]
["E10-4T","HOSPITAL THRU"]
["E10-5L","GAS LEFT"]
["E10-5LR","GAS LEFT AND RIGHT"]
["E10-5R","GAS RIGHT"]
["E10-5T","GAS THRU"]
["E10-6L","FOOD LEFT"]
["E10-6LR","FOOD LEFT AND RIGHT"]
["E10-6R","FOOD RIGHT"]
["E10-6T","FOOD THRU"]
["E10-7L","LODGING LEFT"]
["E10-7LR","LODGING LEFT AND RIGHT"]
["E10-7R","LODGING RIGHT"]
["E10-7T","LODGING THRU"]
["E1-6","FREEWAY ENTRANCE"]
["E3-X1","HOSPITAL"]
["M1-1","INTERSTATE XX"]
["M1-10A","EISENHOWER INTERSTATE SYSTEM"]
["M1-2","INTERSTATE XX BUSINESS LOOP"]
["M1-3","INTERSTATE XX BUSINESS SPUR"]
["M1-4","US XX"]
["M1-4a","OVERLAY USE ONLY"]
["M1-4AB","OVERLAY USE ONLY"]
["M1-4B","US XX BUSINESS"]
["M1-5a","MINNESOTA HWY XX"]
["M1-5AB","MINNESOTA HWY XX BUSINESS"]
["M1-5B","OVERLAY USE ONLY"]
["M1-5BB","OVERLAY USE ONLY"]
["M1-6","XX COUNTY XX"]
["M1-6A","OVERLAY USE ONLY"]
["M1-X1","GREAT RIVER ROAD"]
["M1-X1P","NATIONAL ROUTE"]
["M1-X2","HIAWATHA PIONEER TR"]
["M1-X3","TOWNSHIP XX"]
["M1-X4","XX COUNTY XX"]
["M1-X4A","OVERLAY USE ONLY"]
["M2-1","JCT (WHITE)"]
["M2-1a","JCT (BLUE)"]
["M2-X1","BEGIN (WHITE)"]
["M2-X1A","BEGIN (BLUE)"]
["M3-1","NORTH (WHITE)"]
["M3-1a","NORTH (BLUE)"]
["M3-2","EAST (WHITE)"]
["M3-2a","EAST (BLUE)"]
["M3-3","SOUTH (WHITE)"]
["M3-3a","SOUTH (BLUE)"]
["M3-4","WEST (WHITE)"]
["M3-4a","WEST (BLUE)"]
["M4-1","ALTERNATE (WHITE)"]
["M4-1A","ALT (WHITE)"]
["M4-2A","BYPASS (WHITE)"]
["M4-3","BUSINESS (WHITE)"]
["M4-4","TRUCK (WHITE)"]
["M4-5","TO (WHITE)"]
["M4-5a","TO (BLUE)"]
["M4-6","END (WHITE)"]
["M4-6A","END (BLUE)"]
["M4-7","TEMPORARY (WHITE)"]
["M4-X1","OLD (WHITE)"]
["M4-X1A","OLD (BLUE)"]
["M5-1AL","ADVANCE TURN LEFT (BLUE)"]
["M5-1AR","ADVANCE TURN RIGHT (BLUE)"]
["M5-1L","ADVANCE TURN LEFT (WHITE)"]
["M5-1R","ADVANCE TURN RIGHT (WHITE)"]
["M5-2AL","ADVANCE TURN 45° LEFT (BLUE)"]
["M5-2AR","ADVANCE TURN 45° RIGHT (BLUE)"]
["M5-2L","ADVANCE TURN 45° LEFT (WHITE)"]
["M5-2R","ADVANCE TURN 45° RIGHT (WHITE)"]
["M5-3","CURVED STEM (WHITE)"]
["M5-3A","CURVED STEM (BLUE)"]
["M6-1","ARROW (WHITE)"]
["M6-1a","ARROW (BLUE)"]
["M6-1aL","ARROW LEFT (BLUE)"]
["M6-1aR","ARROW RIGHT (BLUE)"]
["M6-1L","ARROW LEFT (WHITE)"]
["M6-1R","ARROW RIGHT (WHITE)"]
["M6-2AL","ARROW LEFT (BLUE)"]
["M6-2AR","ARROW RIGHT (BLUE)"]
["M6-2L","ARROW LEFT (WHITE)"]
["M6-2R","ARROW RIGHT (WHITE)"]
["M6-3","ARROW UP (WHITE)"]
["M6-3A","ARROW UP (BLUE)"]
["M6-4","DOUBLE ARROW (WHITE)"]
["M6-4A","DOUBLE ARROW (BLUE)"]
["M6-5AL","DOUBLE ARROW 45° LEFT (BLUE)"]
["M6-5AR","DOUBLE ARROW 45° RIGHT (BLUE)"]
["M6-5L","DOUBLE ARROW 45° LEFT (WHITE)"]
["M6-5R","DOUBLE ARROW 45° RIGHT (WHITE)"]
["M6-6AL","ARROW UP LEFT (BLUE)"]
["M6-6AR","ARROW UP RIGHT (BLUE)"]
["M6-6L","ARROW UP LEFT (WHITE)"]
["M6-6R","ARROW UP RIGHT (WHITE)"]
["M6-7AL","ARROW UP 45° LEFT (BLUE)"]
["M6-7AR","ARROW UP 45° RIGHT (BLUE)"]
["M6-7L","ARROW UP 45° LEFT (WHITE)"]
["M6-7R","ARROW UP 45° RIGHT (WHITE)"]
["M6-8AL","ADVANCE ARROW UP LEFT (WHITE)"]
["M6-8AR","ADVANCE ARROW UP RIGHT (WHITE)"]
["M6-8BL","ADVANCE ARROW UP LEFT (BLUE)"]
["M6-8BR","ADVANCE ARROW UP RIGHT (BLUE)"]
["R10-10L","LEFT TURN SIGNAL"]
["R10-10R","RIGHT TURN SIGNAL"]
["R10-11B","NO TURN ON RED"]
["R10-12","LEFT TURN YIELD ON GREEN BALL"]
["R10-5","LEFT ON GREEN ARROW ONLY"]
["R10-6L","WAIT/STOP HERE ON RED LEFT"]
["R10-6R","STOP HERE ON RED"]
["R10-6R","WAIT/STOP HERE ON RED RIGHT"]
["R10-7","DO NOT BLOCK INTERSECTION"]
["R10-7A","DO NOT BLOCK CROSSWALK"]
["R10-X10","HOV LANE"]
["R10-X11","HOV LANE"]
["R10-X12","LEFT TURN YIELD ON FLASHING YELLOW ARROW"]
["R10-X6","1 CAR ON GREEN"]
["R10-X7","FORM TWO LANES"]
["R1-1","STOP"]
["R11-1","KEEP OFF MEDIAN"]
["R1-2","YIELD"]
["R12-1A","BRIDGE WEIGHT LIMIT XX TONS"]
["R12-2","AXLE WEIGHT LIMIT XX TONS"]
["R12-5","WEIGHT LIMIT XXT, XXT, XXT"]
["R1-2AP","TO ONCOMING TRAFFIC PLAQUE"]
["R1-3P","ALL WAY PLAQUE"]
["R14-1","TRUCK ROUTE"]
["R15-3P","EXEMPT PLAQUE"]
["R1-5B","STOP HERE FOR PED SYMBOL"]
["R1-5C","STOP HERE FOR PEDESTRIANS"]
["R1-6B","STATE LAW STOP FOR PED W/I X-WALK"]
["R16-X11","STATE LAW SEAT BELT"]
["R16-X12","FASTENED?"]
["R16-X13","VEHICLE NOISE LAWS ENFORCED"]
["R16-X15","STATE LAW MOVE OVER"]
["R16-X16","DO NOT CROSS DOUBLE WHITE LINE"]
["R16-X33","CHECK YOUR TURN SIGNAL"]
["R16-X4","EMERGENCY STOPPING ONLY"]
["R16-X6","SIGNAL YOUR TURN"]
["R16-X7L","LEFT LANE MUST EXIT"]
["R16-X7R","RIGHT LANE MUST EXIT"]
["R16-X9","STATE LAW UNLAWFUL TO PASS ON SHOULDER"]
["R1-X1","STOP FOR PED IN CROSSWALK"]
["R1-X2","CROSS TRAFFIC DOES NOT STOP"]
["R1-X3","TAKE TURNS"]
["R1-X4","LOOK BOTH WAYS"]
["R2-1","SPEED LIMIT XX"]
["R2-3P","NIGHT SPEED XX"]
["R2-4","MINIMUM SPEED XX"]
["R2-4B","SPEED LIMIT XX MINIMUM XX"]
["R2-X5","BRIDGE SPEED LIMIT XX"]
["R3-1","NO RIGHT TURN"]
["R3-17","BIKE LANE"]
["R3-17A","AHEAD PLAQUE"]
["R3-17B","END PLAQUE"]
["R3-18","NO LEFT NO U-TURN"]
["R3-2","NO LEFT TURN"]
["R3-3","NO TURNS"]
["R3-30AA","L-R"]
["R3-30AB","L-L"]
["R3-30ABBA","L-L-R-R"]
["R3-30ABC","L-L-T"]
["R3-30ABCA","L-L-T-R"]
["R3-30ABD","L-L-TR"]
["R3-30ABEA","L-L-TR-R"]
["R3-30ABELA","L-L-LT-R"]
["R3-30ABLA","L-L-R"]
["R3-30ABRA","L-R-R"]
["R3-30AC","L-T"]
["R3-30ACA","L-T-R"]
["R3-30ACCA","L-T-T-R"]
["R3-30ACD","L-T-TR"]
["R3-30AD","L-TR"]
["R3-30AE","L-LT"]
["R3-30AEBA","L-LT-R-R"]
["R3-30AEBUS","L-LT BUSES ONLY"]
["R3-30AEC","L-LT-T"]
["R3-30AECA","L-LT-T-R"]
["R3-30AED","L-LT-TR"]
["R3-30AELA","L-LT-R"]
["R3-30AELABUS","L-LT BUSES ONLY-R"]
["R3-30AERA","L-TR-R"]
["R3-30AF","L-LR"]
["R3-30AG","L-LTR"]
["R3-30AGA","L-LTR-R"]
["R3-30AHA","L-LR-R"]
["R3-30AJ","L-LTR"]
["R3-30AJA","L-LTR-R"]
["R3-30BA","R-R"]
["R3-30CA","T-R"]
["R3-30CBA","T-R-R"]
["R3-30CC","T-T"]
["R3-30CD","T-TR"]
["R3-30CEA","T-TR-R"]
["R3-30DA","LT-R"]
["R3-30DAA","LT-R-R"]
["R3-30DBA","LT-R-R"]
["R3-30DCA","LT-T-R"]
["R3-30EA","TR-R"]
["R3-30EBA","LT-R-R"]
["R3-30ECA","LT-T-R"]
["R3-30ELA","LT-R"]
["R3-30GA","LTR-R"]
["R3-30H","LR"]
["R3-4","NO U-TURN"]
["R3-5A","THRU ONLY"]
["R3-5L","LEFT ONLY"]
["R3-5R","RIGHT ONLY"]
["R3-6L","THRU-LEFT"]
["R3-6R","THRU-RIGHT"]
["R3-7A","ALL TRAFFIC MUST TURN RIGHT"]
["R3-7L","LEFT LANE MUST TURN LEFT"]
["R3-7R","RIGHT LANE MUST TURN RIGHT"]
["R3-9B","CENTER LEFT TURN LANE"]
["R3-X3","DIAMOND LANE CAR POOL"]
["R4-1","DO NOT PASS"]
["R4-17A","NO DRIVING ON SHOULDER"]
["R4-18A","NO PASSING ON SHOULDER"]
["R4-2","PASS WITH CARE"]
["R4-3","SLOWER TRAFFIC KEEP RIGHT"]
["R4-3A","SLOWER TRAFFIC KEEP RIGHT"]
["R4-4","RIGHT TURN YIELD TO BIKES "]
["R4-5","TRUCKS USE RIGHT LANE"]
["R4-6","TRUCK LANE XX FEET"]
["R4-7","KEEP RIGHT"]
["R4-8","KEEP LEFT"]
["R4-X1","THRU TRAFFIC KEEP RIGHT"]
["R4-X4","TRUCK STOPPING LANE"]
["R4-X5","STATE LAW"]
["R4-X6","PASSING LANE X MILE(S) AHEAD"]
["R4-X7","SHOULDER AUTHORIZED BUSES ONLY"]
["R4-X7p","XX END OR BEGIN PLAQUE"]
["R4-X8","BYPASS LANE"]
["R4-X8A","BYPASS & TURN LANE"]
["R5-1","DO NOT ENTER"]
["R5-10d","PEDS PROHIBITED"]
["R5-1A","WRONG WAY"]
["R5-1a","WRONG WAY"]
["R5-2","NO TRUCKS"]
["R5-3","NO MOTOR VEHICLES"]
["R5-6","NO BICYCLES"]
["R5-X1","NO SNOWMOBILES"]
["R5-X2","STATE PROPERTY KEEP OFF OR OUT"]
["R5-X3","NO TRESSPASSING/CROSSING/ETC."]
["R5-X4","NO THRU TRAFFIC"]
["R6-1L","ONE WAY LEFT"]
["R6-1R","ONE WAY RIGHT"]
["R6-2L","ONE WAY LEFT"]
["R6-2R","ONE WAY RIGHT"]
["R6-3","DIVIDED HIGHWAY"]
["R6-3A","DIVIDED HIGHWAY (UPPER ARROW IS FLAT)"]
["R6-4","ROUNDABOUT DIRECTIONAL (2 ARROWS)"]
["R6-4A","ROUNDABOUT DIRECTIONAL (3 ARROWS)"]
["R6-4B","ROUNDABOUT DIRECTIONAL (4 ARROWS)"]
["R6-6","BEGIN ONE WAY"]
["R6-7","END ONE WAY"]
["R7-8B","VAN ACCESSIBLE PLAQUE"]
["R7-8M","DISABLED PARKING (WITH SYMBOL)"]
["R7-X2","NO TRUCK PARKING"]
["R8-3","NO PARKING"]
["R8-4","EMERGENCY PARKING ONLY"]
["R8-41","PARK & RIDE PARKING ONLY"]
["R8-7","EMERGENCY STOPPING ONLY"]
["R8-8","DO NOT STOP ON TRACKS"]
["R9-1","WALK ON LEFT FACING TRAFFIC"]
["R9-2","CROSS ONLY AT CROSS WALKS"]
["R9-3","NO PEDESTRIANS"]
["S1-1","SCHOOL XING"]
["S3-1","SCHOOL BUS STOP AHEAD"]
["S3-2A","SCHOOL BUS TURN AROUND"]
["S3-X1","SCHOOL BUS LOADING AREA"]
["S4-2P","WHEN CHILDREN ARE PRESENT PLAQUE"]
["S4-3P","SCHOOL PLAQUE"]
["S4-4P","WHEN FLASHING PLAQUE"]
["S4-5","SCHOOL ZONE AHEAD SPEED LIMIT XX"]
["S5-2","END SCHOOL ZONE"]
["W10-1","RR ADVANCE WARNING"]
["W10-11","STORAGE SPACE"]
["W10-11A","XX FEET BETWEEN TRACKS & HIGHWAY"]
["W10-11B","XX FEET BETWEEN HIGHWAY & TRACK BEHIND YOU"]
["W10-1A","EXEMPT"]
["W10-2L","RR PARALLEL TRACKS LEFT"]
["W10-2R","RR PARALLEL TRACKS RIGHT"]
["W10-3L","RR PARALLEL TRACKS LEFT"]
["W10-3R","RR PARALLEL TRACKS RIGHT"]
["W10-5","LOW GROUND CLEARANCE RR X-ING"]
["W10-9","NO TRAIN HORN"]
["W10-X1L","TRACK ANGLE LEFT"]
["W10-X1R","TRACK ANGLE RIGHT"]
["W10-X2","HIDDEN CROSSING"]
["W10-X3","LOOK FOR TRAINS"]
["W1-10L","HORIZONTAL ALIGNMENT LEFT"]
["W1-10R","HORIZONTAL ALIGNMENT RIGHT"]
["W11-1","BICYCLE CROSSING"]
["W11-10","TRUCK CROSSING"]
["W11-15","COMBINED BICYCLE/PEDESTRIAN CROSSING"]
["W11-15A","TRAIL CROSSING"]
["W1-11AL","SHARP CURVE LEFT"]
["W1-11AR","SHARP CURVE RIGHT"]
["W1-11L","HAIRPIN TURN LEFT"]
["W1-11R","HAIRPIN TURN RIGHT"]
["W11-2","PEDESTRIAN CROSSING"]
["W11-3","DEER CROSSING"]
["W11-4","CATTLE CROSSING"]
["W11-5","FARM MACHINERY"]
["W11-6","SNOWMOBILE CROSSING"]
["W11-7","EQUESTRIAN CROSSING"]
["W11-8","FIRE STATION"]
["W11-9","DISABLED CROSSING"]
["W1-1AL","TURN LEFT XX ADVISORY SPEED"]
["W1-1AR","TURN RIGHT XX ADVISORY SPEED"]
["W1-1L","TURN LEFT"]
["W1-1R","TURN RIGHT"]
["W11-X2","HORSE AND BUGGY"]
["W11-X21","DUCK CROSSING"]
["W11-X22","MOOSE CROSSING"]
["W11-X23","TURTLE CROSSING"]
["W11-X23p","RARE TURTLE CROSSING PLAQUE"]
["W11-X3","TRUCKS ENTERING"]
["W12-1","DOUBLE ARROW"]
["W12-2","LOW CLEARANCE XX'-X\""]
["W1-2L","CURVE LEFT"]
["W1-2R","CURVE RIGHT"]
["W13-1","XX MPH"]
["W13-2","EXIT XX MPH"]
["W1-3L","REVERSE TURN LEFT"]
["W1-3R","REVERSE TURN RIGHT"]
["W14-1","DEAD END"]
["W14-1","DEAD END"]
["W14-2","NO OUTLET"]
["W14-3","NO PASSING ZONE"]
["W1-4L","REVERSE CURVE LEFT"]
["W1-4L","REVERSE CURVE LEFT"]
["W1-4R","REVERSE CURVE RIGHT"]
["W1-4R","REVERSE CURVE RIGHT"]
["W14-X10","BUS ON SHOULDER WARNING (SYMBOL)"]
["W14-X2","WATCH FOR SLOW TRAFFIC"]
["W14-X3","WEIGHT RESTRICTION AHEAD"]
["W14-X9","WATCH FOR BUSES"]
["W14-X9","WATCH FOR BUSES ON SHOULDER"]
["W15-1","PLAYGROUND"]
["W1-5L","WINDING ROAD LEFT"]
["W1-5R","WINDING ROAD RIGHT"]
["W1-6","ARROW"]
["W16-1AP","SHARE THE ROAD"]
["W16-7MPL","DOWN ARROW PLAQUE LEFT"]
["W16-7MPR","DOWN ARROW PLAQUE RIGHT"]
["W16-9P","AHEAD"]
["W1-6L","ARROW LEFT"]
["W1-6R","ARROW RIGHT"]
["W1-7","DOUBLE ARROW"]
["W1-8","CHEVRON"]
["W20-100p","XX FEET MILE MILES PLAQUE"]
["W20-X3L","MERGE LEFT"]
["W20-X3R","MERGE RIGHT"]
["W2-1","CROSS ROAD"]
["W2-1AL","OFFSET CROSSROAD LEFT"]
["W2-1AR","OFFSET CROSSROAD RIGHT"]
["W2-2","SIDE ROAD 90°"]
["W2-2L","SIDE ROAD 90° LEFT"]
["W2-2R","SIDE ROAD 90° RIGHT"]
["W2-3L","SIDE ROAD 45° LEFT"]
["W2-3R","SIDE ROAD 45° RIGHT"]
["W2-4","T INTERSECTION"]
["W2-5","Y INTERSECTION"]
["W2-6A","ROUNDABOUT"]
["W2-6AP","ROUNDABOUT PLAQUE"]
["W2-X1","HIDDEN INTERSECTION AHEAD"]
["W2-X12","HIDDEN ENTRANCE"]
["W3-1","STOP AHEAD"]
["W3-2","YIELD AHEAD"]
["W3-3","SIGNAL AHEAD"]
["W3-5","SPEED REDUCTION XX"]
["W3-X1","RAMP METER AHEAD"]
["W3-X5","TRAFFIC CONTROL CHANGE AHEAD"]
["W4-1L","MERGE LEFT"]
["W4-1R","MERGE RIGHT"]
["W4-2L","LANE TRANSITION LEFT"]
["W4-2R","LANE TRANSITION RIGHT"]
["W4-3L","ADDED LANE LEFT"]
["W4-3R","ADDED LANE RIGHT"]
["W4-6L","ADDED LANE LEFT"]
["W4-6R","ADDED LANE RIGHT"]
["W4-X1L","TRAFFIC MERGING FROM LEFT"]
["W4-X1R","TRAFFIC MERGING FROM RIGHT"]
["W5-1","ROAD NARROWS"]
["W5-2","NARROW BRIDGE"]
["W5-3","ONE LANE BRIDGE"]
["W5-4A","BIKEWAY NARROWS"]
["W6-1","DIVIDED HIGHWAY BEGIN"]
["W6-2","DIVIDED HIGHWAY ENDS"]
["W6-3","TWO WAY TRAFFIC"]
["W6-X1L","LEFT ACCELERATION LANE"]
["W6-X1R","RIGHT ACCELERATION LANE"]
["W6-X2","ACCELERATION LANE ENDS"]
["W7-1","HILL"]
["W7-1A","HILL WITH GRADE XX%"]
["W7-2BP","TRUCKS USE LOWER GEAR PLAQUE"]
["W7-3AP","NEXT XX MILES PLAQUE"]
["W7-3BP","XX% GRADE XX MILES PLAQUE"]
["W7-3P","XX% GRADE PLAQUE"]
["W7-5","HILL BIKE"]
["W8-10","SLIPPERY WHEN WET BIKE"]
["W8-1AL","BUMP AHEAD OR ARROW LEFT XX"]
["W8-1AR","BUMP AHEAD OR ARROW RIGHT XX"]
["W8-1B","BUMPS"]
["W8-2","DIP"]
["W8-23","NO SHOULDER"]
["W8-3","PAVEMENT ENDS"]
["W8-4","SOFT SHOULDER"]
["W8-5","SLIPPERY WHEN WET"]
["W8-7","LOOSE GRAVEL"]
["W8-8","ROUGH ROAD"]
["W8-X13","ROUGH CROSSING"]
["W8-X2","ROAD SUBJECT TO FLOODING"]
["W9-1L","LEFT LANE ENDS"]
["W9-1R","RIGHT LANE ENDS"]
["W9-2L","LANE ENDS MERGE LEFT"]
["W9-2R","LANE ENDS MERGE RIGHT"]

{"sheet":"SEQ-4Copy","index":87,"n_rows":10,"n_cols":10,"rows_kept":10,"cut":false,"hidden":false,"merged":[[4,1,4,6],[4,7,4,8],[5,2,7,2],[5,7,5,8],[6,7,6,8],[7,7,7,8]]}
[]
[]
[]
[]
[null,{"$f":"IF('SEQ-PSTAB'!F1<>\"\",'SEQ-PSTAB'!G1,IF('SEQ-PSTAB'!F2<>\"\",'SEQ-PSTAB'!G2,'SEQ-PSTAB'!G3))","v":"PERMANENT SIGNING TABULATION"},null,null,null,null,null,"X"]
[null,null,"SHEET\nNO",null,null,null,null,"TOTAL"]
[null,"TAB",null,"ITEM NO",null,"ITEM","UNIT","ESTIMATED"]
[null,null,null,null,null,null,null,"QUANTITIES"]
[null,null,null,null,null,null,null,null,null,"x"]
[null,null,null,null,null,null,null,null,null,"x"]

{"sheet":"OLD DELIN-retired","index":88,"n_rows":20,"n_cols":5,"rows_kept":20,"cut":false,"hidden":false,"merged":[[13,3,13,4],[9,3,9,4],[7,3,7,4],[8,3,8,4],[10,3,10,4],[11,3,11,4],[12,3,12,4],[1,1,1,3],[4,3,4,4],[5,3,5,4],[6,3,6,4],[2,1,3,1],[2,3,3,4]]}
[]
[null,"DELINEATORS & MARKERS",null,null,{"$f":"'SEQ-PSTAB'!#REF!","v":{"$error":"#REF!"}}]
[null,"CODE NO","QTY","LOCATION"]
[null,null,"EACH"]
["(1)","WHITE X4-6",1,"EXIT NOSE"]
["(1)","YELLOW X4-6",1,"EXIT NOSE"]
["(1)","OBJECT MARKER X4-2",1,"EXIT NOSE"]
["(1)","OBJECT MARKER X4-2",1,"ISLAND"]
[null,"OBJECT MARKER X4-2",1,"MOUNT BELOW C-8"]
["(2)","X4-4 L",1,"ISLAND"]
[null,"X4-13",1,"LEFT POST BELOW C-12"]
["(1)","X4-4 L",1,"ISLAND"]
[]
[]
[null,"SPECIFIC NOTES:"]
[null,"(1)  PLACE ON 3LB/FT POST (MNDOT 3401)."]
[null,"(2)  SIZE SHALL BE 18 INCH BY 36 INCH."]
[null,"GENERAL NOTES:"]
[null,{"$f":"\"1.  FOR DELINEATOR AND MARKER PLACEMENT, SEE SHEET NO. \" & TEXT(TOC!$B$8,\"0\") & \".\"","v":"1.  FOR DELINEATOR AND MARKER PLACEMENT, SEE SHEET NO. ST87."}]
[null,"2.  SEE MNDOT STANDARD SIGNS MANUAL FOR DELINEATOR AND MARKER SIGN DESIGN."]

{"sheet":"Sheet3","index":89,"n_rows":0,"n_cols":0,"rows_kept":0,"cut":false,"hidden":false,"merged":[]}

{"sheet":"Sheet1","index":90,"n_rows":0,"n_cols":0,"rows_kept":0,"cut":false,"hidden":false,"merged":[]}