{"text_format":"1","workbook":"xlsx","n_sheets":10,"sheets":["TA","Seasonal Adj Factors","SUMMARY","Chart","Overlay Design","Introduction","FWD Data","CALC","MAPPING","Sheet2"],"not_rendered":{"charts":7,"images":5,"macros":1,"external_links":1,"defined_names":18,"comments":0,"pivot_tables":0},"unopened":[],"bounds":{"document_bytes":16777216,"sheet_cells":100000,"rows_first":2000,"rows_last":500,"rows_between":2000,"halvings":0,"cell_chars":16384,"cell_head_chars":4096},"cells_cut":0,"cells_raw":0,"read":"whole","date_system":"1900"}

{"sheet":"TA","index":0,"n_rows":15,"n_cols":7,"rows_kept":15,"cut":false,"hidden":true,"merged":[[5,1,5,2],[5,3,5,6],[6,1,6,2],[7,1,7,2],[8,1,8,2]]}
[null,null,null,0,25,50,150.01]
[1,2,3,4,5,6,7]
[null,null,"One-way ESALs","< 25","25 - 50","50 - 150","> 150"]
[null,"Traffic","two-way ADT","< 500","500 - 1000","1000 - 3000","> 3000"]
[null,null,"two-way HCADT","< 25","25 - 50","50 - 150","> 150"]
[null,"Surface Thickness, in.",null,"Allowable Deflections, inches"]
[0,"less than 3 in.",null,7.4999999999999997E-2,7.0000000000000007E-2,0.06,4.4999999999999998E-2]
[3,"3 to 6 in.",null,6.5000000000000002E-2,0.06,0.05,0.04]
{"$rows_left_out":8}
{"sheet":"Seasonal Adj Factors","index":1,"n_rows":28,"n_cols":17,"rows_kept":28,"cut":false,"hidden":true,"merged":[[1,4,1,12]]}
[]
[null,null,null,null,"BENKELMAN BEAM SEASONAL CORRECTION FACTORS"]
[]
[null,null,null,null,"2006-12-31",null,null,null,null,null,null,null,null,null,"bit",2,{"$f":"VLOOKUP(P4,C10:D14,2)","v":1}]
[null,null,"Date",null,"2007-05-01","2007-05-16","2007-06-01","2007-06-16","2007-07-01","2007-07-16","2007-08-01","2007-08-16","2007-09-01",null,"julian",137,{"$f":"HLOOKUP(P5,E6:M7,2)","v":2}]
[null,null,"Julian",null,{"$f":"YEARFRAC($E$4,E5,3)*365-1","v":120.00000000000001},{"$f":"YEARFRAC($E$4,F5,3)*365","v":136},152,167,182,197,213.00000000000003,228,244]
[null,null,null,"Index",1,2,3,4,5,6,7,8,9]
[null,null,null,null,"2001-05-01","2001-05-16","2001-06-01","2001-06-16","2001-07-01","2001-07-16","2001-08-01","2001-08-16"]
{"$rows_left_out":21}
{"sheet":"SUMMARY","index":2,"n_rows":1011,"n_cols":34,"rows_kept":1011,"cut":false,"hidden":false,"merged":[[4,16,4,19],[8,16,8,19],[3,19,3,21],[2,19,2,21]]}
[" Version TONN2010 - 1.06",null,null,"Test Date",null,null,null,"Pave. Temp.","Segments (20 max)",null,null,null,null,null,null,null,null,null,null,null,null,null,null,null,null,null,null,"Plastic",null,"Conventional",null,"1 - ADT <500              HCADT <25"]
[null,null,null,{"$f":"'FWD Data'!C4","v":"2013-05-28"},null,null,null,{"$f":"AVERAGE(CALC!C6:C1001)","v":65.091666889190677},{"$f":"AH8","v":1},null,null,null,null,null,null,{"$f":"IF(I2>20,\"TOO MANY SEGMENTS. REDUCE CHANGES TO HMA OR BASE THICKNESS\",\"\")","v":""},null,null,null,null,null,null,null,null,null,null,null,"Semi-Plastic",null,"Full Depth",null,"2 - ADT 500-1000       HCADT 25-50"]
[null,null,null,"Roadway","From Station","State","State","To Statiion","District",null,"            TONN ANALYSIS",null,null,null,"State","Control Section",null,"Lane","Direction","Lat. and Long.",null,null,"State",null,null,null,null,"Non-Plastic",null,null,null,"3 - ADT 1000-3000     HCADT 50-150"]
[null,null,null,{"$f":"'FWD Data'!A2","v":"JACKSON CSAH 23"},{"$f":"D11","v":0.1},"Aid","Aid",{"$f":"OFFSET(D11:D1184,B11-1,0,1,1)","v":1.2},{"$f":"'FWD Data'!C6","v":"7B"},"Calculated","Reported",null,null,null,"Aid",{"$f":"'FWD Data'!B2","v":"903223"},null,{"$f":"'FWD Data'!E6","v":"Driving"},{"$f":"IF('FWD Data'!D6>0,\"Increasing\",IF('FWD Data'!D6<0,\"Decreasing\",0))","v":"Increasing"},{"$f":"ROUND('FWD Data'!AB6,4)&\", \"&ROUND('FWD Data'!AC6,4)","v":"43.6439, -94.9745"},null,null,"Aid",null,null,null,null,"ENTER TYPE",1,1,null,"4 - ADT >3000            HCADT >150"]
["Previous Day's",null,null,null,null,null,null,null,null,"Capacity, Tons",null,"Overlay, in.","Life, ESALs","R-value","GE","Capacity, Tons","Moduli Statistics",null,null,null,"Depth to","#1 Defl.","R-value",null,null,null,4,4,null,null,null,null,"ENTER TRAFFIC"]
["Max. Temp. ⁰F",null,null,null,null,null,null,null,"85% Percentile",{"$f":"PERCENTILE(J11:J1001,0.15)","v":{"$error":"#NUM!"}},null,{"$f":"PERCENTILE(L11:L1001,0.85)","v":{"$error":"#NUM!"}},{"$f":"PERCENTILE(M11:M1001,0.15)","v":{"$error":"#NUM!"}},{"$f":"PERCENTILE(N11:N1001,0.15)","v":12.308428187759917},{"$f":"IFERROR(PERCENTILE(O11:O1001,0.15),\"\")","v":""},{"$f":"VLOOKUP(I6,AB26:AC27,2)","v":{"$error":"#NUM!"}},"AC","HMA (72° F)","Base","Subgrade","Stiff Layer","(mils)",{"$f":"IFERROR(PERCENTILE(W11:W1001,0.15),\"\")","v":""}]
["Min. Temp. ⁰F",null,null,null,null,null,null,null,"Average",{"$f":"AVERAGE(J11:J1001)","v":{"$error":"#DIV/0!"}},null,{"$f":"AVERAGE(L11:L1001)","v":{"$error":"#DIV/0!"}},{"$f":"AVERAGE(M11:M1001)","v":{"$error":"#DIV/0!"}},{"$f":"AVERAGE(N11:N1001)","v":17.565388282475585},{"$f":"IFERROR(AVERAGE(O11:O1001),\"\")","v":""},{"$f":"AVERAGE(P11:P1001)","v":{"$error":"#DIV/0!"}},{"$f":"AVERAGE(Q11:Q1001)","v":{"$error":"#DIV/0!"}},{"$error":"#DIV/0!"},{"$error":"#DIV/0!"},{"$f":"AVERAGE(T11:T1001)","v":{"$error":"#DIV/0!"}},{"$error":"#DIV/0!"},{"$f":"AVERAGE(V11:V1001)","v":9.5233335422887944},{"$f":"IFERROR(AVERAGE(W11:W1001),\"\")","v":""},null,null,null,null,null,null,null,5,5]
["Avg. Temp. ⁰ F",{"$f":"(B6+B7)/2","v":0},null,null,null,null,null,null,"Std. Dev.",{"$f":"STDEV(J11:J1001)","v":{"$error":"#DIV/0!"}},null,{"$f":"STDEV(L11:L1001)","v":{"$error":"#DIV/0!"}},{"$f":"STDEV(M11:M1001)","v":{"$error":"#DIV/0!"}},{"$f":"STDEV(N11:N1001)","v":7.4774814384294661},{"$f":"IFERROR(STDEV(O11:O1001),\"\")","v":""},{"$f":"STDEV(P11:P1001)","v":{"$error":"#DIV/0!"}},{"$f":"STDEV(Q11:Q1001)","v":{"$error":"#DIV/0!"}},{"$error":"#DIV/0!"},{"$error":"#DIV/0!"},{"$error":"#DIV/0!"},{"$error":"#DIV/0!"},{"$f":"STDEV(V11:V1001)","v":4.1755400862697192},{"$f":"IFERROR(STDEV(W11:W1001),\"\")","v":""},null,null,null,null,"Daily ESALs",{"$f":"IF(AF7=1,20,IF(AF7=2,35,IF(AF7=3,100,200)))","v":200},null,null,null,null,{"$f":"OFFSET(AH11:AH1011,B11-1,0,1,1)","v":1}]
{"$rows_left_out":1004}
{"sheet":"Chart","index":3,"n_rows":55,"n_cols":16,"rows_kept":55,"cut":false,"hidden":false,"merged":[]}
[]
[null,null,null,null,null,26]
[]
[]
[]
[]
[]
[]
{"$rows_left_out":48}
{"sheet":"Overlay Design","index":4,"n_rows":1099,"n_cols":51,"rows_kept":1099,"cut":false,"hidden":true,"merged":[[28,1,30,4],[983,15,983,18],[983,19,983,22],[983,23,983,26],[984,8,984,9]]}
[null,{"$f":"\"TONN2010 Overlay Worksheet - \" & SUMMARY!A1","v":"TONN2010 Overlay Worksheet -  Version TONN2010 - 1.06"}]
[]
[null,null,null,null,null,"User-Defined Overlay Goals"]
[null,null,null,null,"Overlay increment",0.27]
[null,null,null,null,"Desired rating, tons ",10]
[null,null,null,null,"Expected Future Design ESALs",500000]
[null,null,null,null,"Desired Perecentile Level ","95"]
[]
{"$rows_left_out":1092}
{"sheet":"Introduction","index":5,"n_rows":0,"n_cols":0,"rows_kept":0,"cut":false,"hidden":false,"merged":[]}

{"sheet":"FWD Data","index":6,"n_rows":77,"n_cols":30,"rows_kept":77,"cut":false,"hidden":false,"merged":[]}
["Facility Name","Control Section","Pavement Type","Trailer ID","Test Date","X1","X2","X3","X4","X5","X6","X7","X8","X9","X10","Units","# of sensors"]
["JACKSON CSAH 23","903223","Asphalt","8002-377","2013-05-28T13:16:24",0,8,12,18,24,36,48,60,72,-12,"Metric",{"$f":"COUNTIF(F2:O2,\">0\")+1","v":9}]
["LV CELL 31","31",null,"8002-005","2004-10-07T11:03:17",0,203.19999694824219,304.79998779296875,457.20001220703125,609.5999755859375,914.4000244140625,1219.199951171875,1524,1828.800048828125,0,"Metric"]
[{"$f":"AB6","v":43.643929999999997},{"$f":"AC6","v":-94.974490000000003},{"$f":"TRUNC(E2)","v":"2013-05-28"},{"$f":"INT(C4)-DATE(YEAR(C4)-1,12,31)","v":148},null,{"$f":"F3-F2","v":0},{"$f":"G3-G2","v":195.19999694824219},292.79998779296875,439.20001220703125,585.5999755859375,878.4000244140625,1171.199951171875,1464,1756.800048828125,{"$f":"SUM(F4:N4)","v":6783.1999969482422}]
["FacilityName","SectionName","District","StationDirection","Lane","Station","StationID","DropID","DropNumber","SurfaceTemperature","AirTemperature","PreviousDayAirTemp","Time","Stress","Force","D1","D2","D3","D4","D5","D6","D7","D8","D9","D10","Radius","GPSStatus","Latitude","Longitude","Comment"]
["JACKSON CSAH 23","903223","7B",1,"Driving",0.1,1,1,1,65.200000381469721,60.700000381469728,0,"2013-05-28T12:59:52",56.702244178466209,6211.9998886108406,8.8000001592311232,7.6100002421455262,6.8999997766956982,6.0900001764130769,4.9699999540802988,3.3799998932251669,2.2799999484137423,1.4999999383960274,1.0900000313281453,8.65000025550248,5.9049999747532285,2,43.643929999999997,-94.974490000000003,"JCT CSAH 23 & CSAH 34 = M.P. 0.000"]
["JACKSON CSAH 23","903223","7B",1,"Driving",0.1,1,2,2,65.200000381469721,60.700000381469728,0,"2013-05-28T12:59:52",54.002137945139317,5917.9999511718752,8.6399997412794729,7.4299999972273172,6.7399999594837752,5.9299997584614275,4.8399998773182134,3.2999999846192054,2.2200000169592711,1.4500000706097671,1.0300000247812082,8.4999997510341085,5.9049999747532285,2,43.643929999999997,-94.974490000000003,"JCT CSAH 23 & CSAH 34 = M.P. 0.000"]
["JACKSON CSAH 23","903223","7B",1,"Driving",0.1,1,3,3,65.200000381469721,60.700000381469728,0,"2013-05-28T12:59:52",52.402070893722929,5739.9999832153326,8.4400002701344334,7.2399998388258293,6.5599997145655671,5.7699999412495036,4.7200000144092709,3.2099998621601014,2.1699999989880792,1.4299999432733452,1.0200000362054631,8.3200001068556269,5.9049999747532285,2,43.643929999999997,-94.974490000000003,"JCT CSAH 23 & CSAH 34 = M.P. 0.000"]
{"$rows_left_out":70}
{"sheet":"CALC","index":7,"n_rows":179,"n_cols":35,"rows_kept":179,"cut":false,"hidden":false,"merged":[[3,30,3,31]]}
[null,null,null,null,null,null,null,null,null,null,null,null,null,null,null,null,null,null,null,"TONN",null,null,null,null,null,null,"Lukenan's Analyses"]
[null,null,null,null,null,null,null,null,null,null,null,null,null,null,null,null,null,null,null,null,null,null,null,null,null,null,null,"Peak",null,"Spring"]
[null,null,null,null,null,null,null,null,null,null,null,null,null,null,null,null,"Pvm't.",null,null,null,null,null,null,null,null,null,"Temp.","Spring","Radius to","Subgrade"]
[null,null,null,null,null,null,null,null,null,null,null,null,null,null,null,null,"Temp.",null,null,null,"Calculated","Reported","Calculated","Reported",null,null,"Adj","Defl.","1/2 peak","Modulus","Effective Values"]
["Station","DropNumber","SurfaceTemperature","PreviousDayAirTemp","Time","Force","D1","D2","D3","D4","D5","D6","D7","D8","D9","D10","°F","BB 9000","Temp Adj","BB80","Tonn","Tonn","overlay","Overlay","Life","Allowable","Fact.","mils","Inches","psi","R-value","G.E., in.","Tons","seasonal","ESALs"]
[0.1,6,65.200000381469721,{"$f":"SUMMARY!B8","v":0},"12:59:52",8651.0002227783207,12.850000563603137,11.060000430863239,9.9499998216438765,8.7099997364021551,7.1599999302198682,4.8399998773182134,3.2399999029798026,2.100000003865397,1.5900000608551315,12.919999957986093,{"$f":"BELLS3(C6,E6,SUMMARY!E11/2,SUMMARY!$B$8)","v":-999},{"$f":"IF(SUMMARY!$B$37=\"F\",3.8+9000/F6*G6,9000/F6*G6*1.05+5.15)","v":19.186816807184279},{"$f":"(R6^(-0.1)+(80^0.69-(Q6)^0.69)*(-0.00824082*SUMMARY!E11^0.23+0.00782112))^(1/(-0.1))","v":{"$error":"#NUM!"}},{"$f":"S6*AH6","v":{"$error":"#NUM!"}},{"$f":"10*(0.9*Z6)/T6","v":{"$error":"#N/A"}},{"$f":"IF(U6>10,10,U6)","v":{"$error":"#N/A"}},{"$f":"IF(LN((T6/(0.9*Z6))^8.5812)<0,0,LN((T6/(0.9*(VLOOKUP(SUMMARY!E11+LN((T6/(0.9*Z6))^8.5812),TA!$A$7:'TA'!$G$9,HLOOKUP(AI6,TA!$D$1:'TA'!$G$2,2))*1000)))^8.5812))","v":{"$error":"#NUM!"}},{"$f":"IF(W6<0,0,W6)","v":{"$error":"#NUM!"}},{"$f":"114815362149.67/(T6^3.2499999)","v":{"$error":"#NUM!"}},{"$f":"VLOOKUP(SUMMARY!E11,TA!$A$7:'TA'!$G$9,HLOOKUP(AI6,TA!$D$1:'TA'!$G$2,2))*1000","v":{"$error":"#N/A"}},{"$f":"TAFDefl(80,Q6,SUMMARY!E11,IF('FWD Data'!K2=36,CALC!L6,CALC!$M$6)*9000/CALC!F6,45)","v":{"$error":"#VALUE!"}},{"$f":"ssbb80(G6,F6,AA6,AH6)","v":{"$error":"#VALUE!"}},{"$f":"radius5('FWD Data'!$Q$2,'FWD Data'!$F$2:$O$2,G6:P6)","v":27.584986856920292},{"$f":"hogg(F6,G6,G6/2,AC6,2)*1.3/((AH6-1)/2+1)","v":8723.7314817816386},{"$f":"(0.41+0.873*AD6/1000)^1.28","v":14.379582745364754},{"$f":"xEffSN(T6,AD6)/0.14","v":{"$error":"#VALUE!"}},{"$f":"9*Z6/T6","v":{"$error":"#N/A"}},{"$f":"IF(SUMMARY!$F11=\"P\",INDEX('Seasonal Adj Factors'!$E$10:$M$15,IF(AND(SUMMARY!$B$37=\"f\",VLOOKUP(SUMMARY!E11,'Seasonal Adj Factors'!$C$10:$D$14,2)=5),6,VLOOKUP(SUMMARY!E11,'Seasonal Adj Factors'!$C$10:$D$14,2)),HLOOKUP('FWD Data'!$D$4,'Seasonal Adj Factors'!$E$6:$M$7,2)),IF(SUMMARY!$F11=\"S\",INDEX('Seasonal Adj Factors'!$E$20:$M$21,VLOOKUP(SUMMARY!E11,'Seasonal Adj Factors'!$C$20:$D$21,2),HLOOKUP('FWD Data'!$D$4,'Seasonal Adj Factors'!$E$6:$M$7,2)),INDEX('Seasonal Adj Factors'!$E$26:$M$28,VLOOKUP(SUMMARY!E11,'Seasonal Adj Factors'!$C$26:$D$28,2),HLOOKUP('FWD Data'!$D$4,'Seasonal Adj Factors'!$E$6:$M$7,2))))","v":1.41},{"$f":"IF(SUMMARY!G11>0,IF(SUMMARY!G11=1,20,IF(SUMMARY!G11=2,35,IF(SUMMARY!G11=3,100,200))),\"\")","v":""}]
[0.18,6,65.900001144409174,{"$f":"SUMMARY!B8","v":0},"13:01:21",8825.0001770019535,9.9200000811940381,8.9899997168928838,8.2600000252162236,7.3699999155879148,6.170000085019038,4.2700000028534761,2.9299998816693726,1.9200000593170521,1.370000011818874,8.1900000300935414,{"$f":"BELLS3(C7,E7,SUMMARY!E12/2,SUMMARY!$B$8)","v":-999},{"$f":"IF(SUMMARY!$B$37=\"F\",3.8+9000/F7*G7,9000/F7*G7*1.05+5.15)","v":15.77254944895996},{"$f":"(R7^(-0.1)+(80^0.69-(Q7)^0.69)*(-0.00824082*SUMMARY!E12^0.23+0.00782112))^(1/(-0.1))","v":{"$error":"#NUM!"}},{"$f":"S7*AH7","v":{"$error":"#NUM!"}},{"$f":"10*(0.9*Z7)/T7","v":{"$error":"#N/A"}},{"$f":"IF(U7>10,10,U7)","v":{"$error":"#N/A"}},{"$f":"IF(LN((T7/(0.9*Z7))^8.5812)<0,0,LN((T7/(0.9*(VLOOKUP(SUMMARY!E12+LN((T7/(0.9*Z7))^8.5812),TA!$A$7:'TA'!$G$9,HLOOKUP(AI7,TA!$D$1:'TA'!$G$2,2))*1000)))^8.5812))","v":{"$error":"#NUM!"}},{"$f":"IF(W7<0,0,W7)","v":{"$error":"#NUM!"}},{"$f":"114815362149.67/(T7^3.2499999)","v":{"$error":"#NUM!"}},{"$f":"VLOOKUP(SUMMARY!E12,TA!$A$7:'TA'!$G$9,HLOOKUP(AI7,TA!$D$1:'TA'!$G$2,2))*1000","v":{"$error":"#N/A"}},{"$f":"TAFDefl(80,Q7,SUMMARY!E12,IF('FWD Data'!K3=36,CALC!L7,CALC!$M$6)*9000/CALC!F7,45)","v":{"$error":"#VALUE!"}},{"$f":"ssbb80(G7,F7,AA7,AH7)","v":{"$error":"#VALUE!"}},{"$f":"radius5('FWD Data'!$Q$2,'FWD Data'!$F$2:$O$2,G7:P7)","v":31.769272065023603},{"$f":"hogg(F7,G7,G7/2,AC7,2)*1.3/((AH7-1)/2+1)","v":9948.2828708506222},{"$f":"(0.41+0.873*AD7/1000)^1.28","v":16.875566082439164},{"$f":"xEffSN(T7,AD7)/0.14","v":{"$error":"#VALUE!"}},{"$f":"9*Z7/T7","v":{"$error":"#N/A"}},{"$f":"IF(SUMMARY!$F12=\"P\",INDEX('Seasonal Adj Factors'!$E$10:$M$15,IF(AND(SUMMARY!$B$37=\"f\",VLOOKUP(SUMMARY!E12,'Seasonal Adj Factors'!$C$10:$D$14,2)=5),6,VLOOKUP(SUMMARY!E12,'Seasonal Adj Factors'!$C$10:$D$14,2)),HLOOKUP('FWD Data'!$D$4,'Seasonal Adj Factors'!$E$6:$M$7,2)),IF(SUMMARY!$F12=\"S\",INDEX('Seasonal Adj Factors'!$E$20:$M$21,VLOOKUP(SUMMARY!E12,'Seasonal Adj Factors'!$C$20:$D$21,2),HLOOKUP('FWD Data'!$D$4,'Seasonal Adj Factors'!$E$6:$M$7,2)),INDEX('Seasonal Adj Factors'!$E$26:$M$28,VLOOKUP(SUMMARY!E12,'Seasonal Adj Factors'!$C$26:$D$28,2),HLOOKUP('FWD Data'!$D$4,'Seasonal Adj Factors'!$E$6:$M$7,2))))","v":1.41},{"$f":"IF(SUMMARY!G12>0,IF(SUMMARY!G12=1,20,IF(SUMMARY!G12=2,35,IF(SUMMARY!G12=3,100,200))),\"\")","v":""}]
[0.3,6,65.000001144409183,{"$f":"SUMMARY!B8","v":0},"13:02:30",8901.9999053955089,10.130000066562085,9.2100002164839374,8.4999997510341085,7.5699999874726815,6.3700001569038056,4.4599998608851008,3.029999917611756,1.9999999679230136,1.3899999889703643,8.4299997559114264,{"$f":"BELLS3(C8,E8,SUMMARY!E13/2,SUMMARY!$B$8)","v":-999},{"$f":"IF(SUMMARY!$B$37=\"F\",3.8+9000/F8*G8,9000/F8*G8*1.05+5.15)","v":15.903594882762308},{"$f":"(R8^(-0.1)+(80^0.69-(Q8)^0.69)*(-0.00824082*SUMMARY!E13^0.23+0.00782112))^(1/(-0.1))","v":{"$error":"#NUM!"}},{"$error":"#NUM!"},{"$error":"#N/A"},{"$error":"#N/A"},{"$f":"IF(LN((T8/(0.9*Z8))^8.5812)<0,0,LN((T8/(0.9*(VLOOKUP(SUMMARY!E13+LN((T8/(0.9*Z8))^8.5812),TA!$A$7:'TA'!$G$9,HLOOKUP(AI8,TA!$D$1:'TA'!$G$2,2))*1000)))^8.5812))","v":{"$error":"#NUM!"}},{"$error":"#NUM!"},{"$error":"#NUM!"},{"$f":"VLOOKUP(SUMMARY!E13,TA!$A$7:'TA'!$G$9,HLOOKUP(AI8,TA!$D$1:'TA'!$G$2,2))*1000","v":{"$error":"#N/A"}},{"$f":"TAFDefl(80,Q8,SUMMARY!E13,IF('FWD Data'!K4=36,CALC!L8,CALC!$M$6)*9000/CALC!F8,45)","v":{"$error":"#VALUE!"}},{"$error":"#VALUE!"},{"$f":"radius5('FWD Data'!$Q$2,'FWD Data'!$F$2:$O$2,G8:P8)","v":32.269661894476947},9668.7247147302896,16.298116806732441,{"$error":"#VALUE!"},{"$error":"#N/A"},{"$f":"IF(SUMMARY!$F13=\"P\",INDEX('Seasonal Adj Factors'!$E$10:$M$15,IF(AND(SUMMARY!$B$37=\"f\",VLOOKUP(SUMMARY!E13,'Seasonal Adj Factors'!$C$10:$D$14,2)=5),6,VLOOKUP(SUMMARY!E13,'Seasonal Adj Factors'!$C$10:$D$14,2)),HLOOKUP('FWD Data'!$D$4,'Seasonal Adj Factors'!$E$6:$M$7,2)),IF(SUMMARY!$F13=\"S\",INDEX('Seasonal Adj Factors'!$E$20:$M$21,VLOOKUP(SUMMARY!E13,'Seasonal Adj Factors'!$C$20:$D$21,2),HLOOKUP('FWD Data'!$D$4,'Seasonal Adj Factors'!$E$6:$M$7,2)),INDEX('Seasonal Adj Factors'!$E$26:$M$28,VLOOKUP(SUMMARY!E13,'Seasonal Adj Factors'!$C$26:$D$28,2),HLOOKUP('FWD Data'!$D$4,'Seasonal Adj Factors'!$E$6:$M$7,2))))","v":1.41},{"$f":"IF(SUMMARY!G13>0,IF(SUMMARY!G13=1,20,IF(SUMMARY!G13=2,35,IF(SUMMARY!G13=3,100,200))),\"\")","v":""}]
{"$rows_left_out":172}
{"sheet":"MAPPING","index":8,"n_rows":13,"n_cols":15,"rows_kept":13,"cut":false,"hidden":false,"merged":[]}
["ID","RP","DATE","LATITUDE","LONGITUDE","TONN","HMA (72° F)","BASE","SUBGRADE","#1 Defl","HMA THICKNESS","BASE THICKNESS","ESALs",null,"err"]
[1,{"$f":"SUMMARY!D11","v":0.1},{"$f":"SUMMARY!$D$2","v":"2013-05-28"},{"$f":"INDEX('FWD Data'!$AB$6:$AB$2006,MATCH(B2,'FWD Data'!$F$6:$F$2006,0),1)","v":43.643929999999997},{"$f":"INDEX('FWD Data'!$AC$6:$AC$2006,MATCH(B2,'FWD Data'!$F$6:$F$2006,0),1)","v":-94.974490000000003},{"$f":"SUMMARY!P11","v":0},{"$f":"SUMMARY!R11","v":0},{"$f":"SUMMARY!S11","v":0},{"$f":"SUMMARY!T11","v":0},{"$f":"SUMMARY!V11","v":12.850000563603137},{"$f":"SUMMARY!E11","v":0},{"$f":"SUMMARY!H11","v":0},{"$f":"SUMMARY!I11","v":0},null,{"$f":"IFERROR((E2*D2)/(E2*D2),2)","v":1}]
[2,{"$f":"SUMMARY!D12","v":0.18},{"$f":"SUMMARY!$D$2","v":"2013-05-28"},{"$f":"INDEX('FWD Data'!$AB$6:$AB$2006,MATCH(B3,'FWD Data'!$F$6:$F$2006,0),1)","v":43.642780000000002},{"$f":"INDEX('FWD Data'!$AC$6:$AC$2006,MATCH(B3,'FWD Data'!$F$6:$F$2006,0),1)","v":-94.974485000000001},{"$f":"SUMMARY!P12","v":0},{"$f":"SUMMARY!R12","v":0},{"$f":"SUMMARY!S12","v":0},{"$f":"SUMMARY!T12","v":0},{"$f":"SUMMARY!V12","v":9.9200000811940381},{"$f":"SUMMARY!E12","v":0},{"$f":"SUMMARY!H12","v":0},{"$f":"SUMMARY!I12","v":0},null,{"$f":"IFERROR((E3*D3)/(E3*D3),2)","v":1}]
[3,{"$f":"SUMMARY!D13","v":0.3},{"$f":"SUMMARY!$D$2","v":"2013-05-28"},{"$f":"INDEX('FWD Data'!$AB$6:$AB$2006,MATCH(B4,'FWD Data'!$F$6:$F$2006,0),1)","v":43.641048300000001},{"$f":"INDEX('FWD Data'!$AC$6:$AC$2006,MATCH(B4,'FWD Data'!$F$6:$F$2006,0),1)","v":-94.974476699999997},{"$f":"SUMMARY!P13","v":0},{"$f":"SUMMARY!R13","v":0},{"$f":"SUMMARY!S13","v":0},{"$f":"SUMMARY!T13","v":0},{"$f":"SUMMARY!V13","v":10.130000066562085},{"$f":"SUMMARY!E13","v":0},{"$f":"SUMMARY!H13","v":0},{"$f":"SUMMARY!I13","v":0},null,1]
[4,{"$f":"SUMMARY!D14","v":0.4},{"$f":"SUMMARY!$D$2","v":"2013-05-28"},{"$f":"INDEX('FWD Data'!$AB$6:$AB$2006,MATCH(B5,'FWD Data'!$F$6:$F$2006,0),1)","v":43.639593300000001},{"$f":"INDEX('FWD Data'!$AC$6:$AC$2006,MATCH(B5,'FWD Data'!$F$6:$F$2006,0),1)","v":-94.974471699999995},{"$f":"SUMMARY!P14","v":0},{"$f":"SUMMARY!R14","v":0},{"$f":"SUMMARY!S14","v":0},{"$f":"SUMMARY!T14","v":0},{"$f":"SUMMARY!V14","v":8.969999889926326},{"$f":"SUMMARY!E14","v":0},{"$f":"SUMMARY!H14","v":0},{"$f":"SUMMARY!I14","v":0},null,1]
[5,{"$f":"SUMMARY!D15","v":0.5},{"$f":"SUMMARY!$D$2","v":"2013-05-28"},{"$f":"INDEX('FWD Data'!$AB$6:$AB$2006,MATCH(B6,'FWD Data'!$F$6:$F$2006,0),1)","v":43.638150000000003},{"$f":"INDEX('FWD Data'!$AC$6:$AC$2006,MATCH(B6,'FWD Data'!$F$6:$F$2006,0),1)","v":-94.9744666},{"$f":"SUMMARY!P15","v":0},{"$f":"SUMMARY!R15","v":0},{"$f":"SUMMARY!S15","v":0},{"$f":"SUMMARY!T15","v":0},{"$f":"SUMMARY!V15","v":11.23000016155844},{"$f":"SUMMARY!E15","v":0},{"$f":"SUMMARY!H15","v":0},{"$f":"SUMMARY!I15","v":0},null,1]
[6,{"$f":"SUMMARY!D16","v":0.6},{"$f":"SUMMARY!$D$2","v":"2013-05-28"},{"$f":"INDEX('FWD Data'!$AB$6:$AB$2006,MATCH(B7,'FWD Data'!$F$6:$F$2006,0),1)","v":43.636704999999999},{"$f":"INDEX('FWD Data'!$AC$6:$AC$2006,MATCH(B7,'FWD Data'!$F$6:$F$2006,0),1)","v":-94.974461700000006},{"$f":"SUMMARY!P16","v":0},{"$f":"SUMMARY!R16","v":0},{"$f":"SUMMARY!S16","v":0},{"$f":"SUMMARY!T16","v":0},{"$f":"SUMMARY!V16","v":7.3300002616547975},{"$f":"SUMMARY!E16","v":0},{"$f":"SUMMARY!H16","v":0},{"$f":"SUMMARY!I16","v":0},null,1]
[7,{"$f":"SUMMARY!D17","v":0.7},{"$f":"SUMMARY!$D$2","v":"2013-05-28"},{"$f":"INDEX('FWD Data'!$AB$6:$AB$2006,MATCH(B8,'FWD Data'!$F$6:$F$2006,0),1)","v":43.635260000000002},{"$f":"INDEX('FWD Data'!$AC$6:$AC$2006,MATCH(B8,'FWD Data'!$F$6:$F$2006,0),1)","v":-94.974455000000006},{"$f":"SUMMARY!P17","v":0},{"$f":"SUMMARY!R17","v":0},{"$f":"SUMMARY!S17","v":0},{"$f":"SUMMARY!T17","v":0},{"$f":"SUMMARY!V17","v":9.070000226238573},{"$f":"SUMMARY!E17","v":0},{"$f":"SUMMARY!H17","v":0},{"$f":"SUMMARY!I17","v":0},null,1]
{"$rows_left_out":6}
{"sheet":"Sheet2","index":9,"n_rows":173,"n_cols":21,"rows_kept":173,"cut":false,"hidden":true,"merged":[]}
[]
[]
[]
[]
[]
[]
[]
[]
{"$rows_left_out":165}